maven-notifications mailing list archives

Site index · List index
Message view « Date » · « Thread »
Top « Date » · « Thread »
From Apache Jenkins Server <jenk...@builds.apache.org>
Subject Build failed in Jenkins: Maven TLP » maven-wagon » WAGON-519 #16
Date Sat, 29 Dec 2018 18:06:44 GMT
See https://builds.apache.org/job/maven-box/job/maven-wagon/job/WAGON-519/16/

Changes:

* reduce the history archiving
* reduce the history archiving
* increase a bit archiving
* increase a bit archiving
* Activate sonarqube on first project
* Disable sonar:sonar for now
* use publisherStrategy: 'EXPLICIT' to avoid non used publishers
* [INFRA-17514] Fix file separator + add other locations for workspaces
* fix indent

30 tests failed.
FAILED:  org.apache.maven.wagon.providers.ftp.FtpWagonTest.testPutDirectoryCreation

Error Message:
Failed to bind to address 0.0.0.0/0.0.0.0:10023, check configuration

Stack Trace:
org.apache.ftpserver.FtpServerConfigurationException: Failed to bind to address 0.0.0.0/0.0.0.0:10023,
check configuration
	at org.apache.maven.wagon.providers.ftp.FtpWagonTest.setupWagonTestingFixtures(FtpWagonTest.java:106)
	at org.apache.maven.wagon.providers.ftp.FtpWagonTest.testPutDirectoryCreation(FtpWagonTest.java:195)
Caused by: java.net.BindException: Address already in use


FAILED:  org.apache.maven.wagon.providers.ftp.FtpWagonTest.testDefaultUserName

Error Message:
Cannot login to remote system

Stack Trace:
org.apache.maven.wagon.ConnectionException: Cannot login to remote system
	at org.apache.maven.wagon.providers.ftp.FtpWagonTest.testDefaultUserName(FtpWagonTest.java:178)
Caused by: org.apache.commons.net.ftp.FTPConnectionClosedException: Connection closed without
indication.
	at org.apache.maven.wagon.providers.ftp.FtpWagonTest.testDefaultUserName(FtpWagonTest.java:178)


FAILED:  org.apache.maven.wagon.providers.ftp.FtpWagonTest.testFailedGetToStream

Error Message:
Could not connect to server.

Stack Trace:
org.apache.maven.wagon.authentication.AuthenticationException: Could not connect to server.
Caused by: java.net.ConnectException: Connection refused (Connection refused)


FAILED:  org.apache.maven.wagon.providers.ftp.FtpWagonTest.testFailedGetIfNewerToStream

Error Message:
Could not connect to server.

Stack Trace:
org.apache.maven.wagon.authentication.AuthenticationException: Could not connect to server.
Caused by: java.net.ConnectException: Connection refused (Connection refused)


FAILED:  org.apache.maven.wagon.providers.ftp.FtpWagonTest.testWagonGetIfNewerToStreamIsNewer

Error Message:
Could not connect to server.

Stack Trace:
org.apache.maven.wagon.authentication.AuthenticationException: Could not connect to server.
Caused by: java.net.ConnectException: Connection refused (Connection refused)


FAILED:  org.apache.maven.wagon.providers.ftp.FtpWagonTest.testWagonGetIfNewerToStreamIsOlder

Error Message:
Could not connect to server.

Stack Trace:
org.apache.maven.wagon.authentication.AuthenticationException: Could not connect to server.
Caused by: java.net.ConnectException: Connection refused (Connection refused)


FAILED:  org.apache.maven.wagon.providers.ftp.FtpWagonTest.testStreamingWagon

Error Message:
Could not connect to server.

Stack Trace:
org.apache.maven.wagon.authentication.AuthenticationException: Could not connect to server.
Caused by: java.net.ConnectException: Connection refused (Connection refused)


FAILED:  org.apache.maven.wagon.providers.ftp.FtpWagonTest.testWagonGetIfNewerToStreamIsSame

Error Message:
Could not connect to server.

Stack Trace:
org.apache.maven.wagon.authentication.AuthenticationException: Could not connect to server.
Caused by: java.net.ConnectException: Connection refused (Connection refused)


FAILED:  org.apache.maven.wagon.providers.ftp.FtpWagonTest.testWagonPutDirectoryDeepDestination

Error Message:
Could not connect to server.

Stack Trace:
org.apache.maven.wagon.authentication.AuthenticationException: Could not connect to server.
Caused by: java.net.ConnectException: Connection refused (Connection refused)


FAILED:  org.apache.maven.wagon.providers.ftp.FtpWagonTest.testWagonGetFileListWhenDirectoryDoesNotExist

Error Message:
Could not connect to server.

Stack Trace:
org.apache.maven.wagon.authentication.AuthenticationException: Could not connect to server.
Caused by: java.net.ConnectException: Connection refused (Connection refused)


FAILED:  org.apache.maven.wagon.providers.ftp.FtpWagonTest.testWagon

Error Message:
Could not connect to server.

Stack Trace:
org.apache.maven.wagon.authentication.AuthenticationException: Could not connect to server.
Caused by: java.net.ConnectException: Connection refused (Connection refused)


FAILED:  org.apache.maven.wagon.providers.ftp.FtpWagonTest.testWagonPutDirectoryForDot

Error Message:
Could not connect to server.

Stack Trace:
org.apache.maven.wagon.authentication.AuthenticationException: Could not connect to server.
Caused by: java.net.ConnectException: Connection refused (Connection refused)


FAILED:  org.apache.maven.wagon.providers.ftp.FtpWagonTest.testWagonGetIfNewerIsNewer

Error Message:
Could not connect to server.

Stack Trace:
org.apache.maven.wagon.authentication.AuthenticationException: Could not connect to server.
Caused by: java.net.ConnectException: Connection refused (Connection refused)


FAILED:  org.apache.maven.wagon.providers.ftp.FtpWagonTest.testWagonGetIfNewerIsOlder

Error Message:
Could not connect to server.

Stack Trace:
org.apache.maven.wagon.authentication.AuthenticationException: Could not connect to server.
Caused by: java.net.ConnectException: Connection refused (Connection refused)


FAILED:  org.apache.maven.wagon.providers.ftp.FtpWagonTest.testWagonGetFileList

Error Message:
Could not connect to server.

Stack Trace:
org.apache.maven.wagon.authentication.AuthenticationException: Could not connect to server.
Caused by: java.net.ConnectException: Connection refused (Connection refused)


FAILED:  org.apache.maven.wagon.providers.ftp.FtpWagonTest.testFailedGet

Error Message:
Could not connect to server.

Stack Trace:
org.apache.maven.wagon.authentication.AuthenticationException: Could not connect to server.
Caused by: java.net.ConnectException: Connection refused (Connection refused)


FAILED:  org.apache.maven.wagon.providers.ftp.FtpWagonTest.testWagonPutDirectoryWhenDirectoryAlreadyExists

Error Message:
Could not connect to server.

Stack Trace:
org.apache.maven.wagon.authentication.AuthenticationException: Could not connect to server.
Caused by: java.net.ConnectException: Connection refused (Connection refused)


FAILED:  org.apache.maven.wagon.providers.ftp.FtpWagonTest.testWagonResourceExists

Error Message:
Could not connect to server.

Stack Trace:
org.apache.maven.wagon.authentication.AuthenticationException: Could not connect to server.
Caused by: java.net.ConnectException: Connection refused (Connection refused)


FAILED:  org.apache.maven.wagon.providers.ftp.FtpWagonTest.testFailedGetIfNewer

Error Message:
Could not connect to server.

Stack Trace:
org.apache.maven.wagon.authentication.AuthenticationException: Could not connect to server.
Caused by: java.net.ConnectException: Connection refused (Connection refused)


FAILED:  org.apache.maven.wagon.providers.ftp.FtpWagonTest.testWagonResourceNotExists

Error Message:
Could not connect to server.

Stack Trace:
org.apache.maven.wagon.authentication.AuthenticationException: Could not connect to server.
Caused by: java.net.ConnectException: Connection refused (Connection refused)


FAILED:  org.apache.maven.wagon.providers.ftp.FtpWagonTest.testWagonPutDirectory

Error Message:
Could not connect to server.

Stack Trace:
org.apache.maven.wagon.authentication.AuthenticationException: Could not connect to server.
Caused by: java.net.ConnectException: Connection refused (Connection refused)


FAILED:  org.apache.maven.wagon.providers.ftp.FtpWagonTest.testWagonGetIfNewerIsSame

Error Message:
Could not connect to server.

Stack Trace:
org.apache.maven.wagon.authentication.AuthenticationException: Could not connect to server.
Caused by: java.net.ConnectException: Connection refused (Connection refused)


FAILED:  org.apache.maven.wagon.providers.http.HttpWagonReasonPhraseTest.testGetReasonPhase401

Error Message:
Address already in use

Stack Trace:
java.net.BindException: Address already in use
	at org.apache.maven.wagon.providers.http.HttpWagonReasonPhraseTest.setUp(HttpWagonReasonPhraseTest.java:43)


FAILED:  org.apache.maven.wagon.providers.http.HttpWagonReasonPhraseTest.testGetReasonPhase403

Error Message:
Address already in use

Stack Trace:
java.net.BindException: Address already in use
	at org.apache.maven.wagon.providers.http.HttpWagonReasonPhraseTest.setUp(HttpWagonReasonPhraseTest.java:43)


FAILED:  org.apache.maven.wagon.providers.http.HttpWagonReasonPhraseTest.testGetReasonPhase407

Error Message:
Address already in use

Stack Trace:
java.net.BindException: Address already in use
	at org.apache.maven.wagon.providers.http.HttpWagonReasonPhraseTest.setUp(HttpWagonReasonPhraseTest.java:43)


FAILED:  org.apache.maven.wagon.providers.http.HttpWagonReasonPhraseTest.testGetReasonPhase500

Error Message:
Address already in use

Stack Trace:
java.net.BindException: Address already in use
	at org.apache.maven.wagon.providers.http.HttpWagonReasonPhraseTest.setUp(HttpWagonReasonPhraseTest.java:43)


FAILED:  org.apache.maven.wagon.providers.http.HttpWagonTimeoutTest.testResourceExits

Error Message:
Address already in use

Stack Trace:
java.net.BindException: Address already in use
	at org.apache.maven.wagon.providers.http.HttpWagonTimeoutTest.setUp(HttpWagonTimeoutTest.java:45)


FAILED:  org.apache.maven.wagon.providers.http.HttpWagonTimeoutTest.testGetTimeout

Error Message:
Address already in use

Stack Trace:
java.net.BindException: Address already in use
	at org.apache.maven.wagon.providers.http.HttpWagonTimeoutTest.setUp(HttpWagonTimeoutTest.java:45)


FAILED:  org.apache.maven.wagon.providers.http.HttpWagonTimeoutTest.testConnectionTimeout

Error Message:
Address already in use

Stack Trace:
java.net.BindException: Address already in use
	at org.apache.maven.wagon.providers.http.HttpWagonTimeoutTest.setUp(HttpWagonTimeoutTest.java:45)


FAILED:  org.apache.maven.wagon.providers.http.HttpWagonTimeoutTest.testGetFileList

Error Message:
Address already in use

Stack Trace:
java.net.BindException: Address already in use
	at org.apache.maven.wagon.providers.http.HttpWagonTimeoutTest.setUp(HttpWagonTimeoutTest.java:45)




Build log:
[...truncated 2.39 MB...]
[windows-jdk7] [INFO] --- maven-enforcer-plugin:1.4.1:enforce (default) @ wagon-webdav-jackrabbit
---
[windows-jdk7] [INFO] 
[windows-jdk7] [INFO] --- apache-rat-plugin:0.12:check (rat-check) @ wagon-webdav-jackrabbit
---
[windows-jdk7] [INFO] Enabled default license matchers.
[windows-jdk7] [INFO] Will parse SCM ignores for exclusions...
[windows-jdk7] [INFO] Finished adding exclusions from SCM ignore files.
[windows-jdk7] [INFO] 61 implicit excludes (use -debug for more details).
[windows-jdk7] [INFO] Exclude: .checkstyle
[windows-jdk7] [INFO] Exclude: **/*.odg
[windows-jdk7] [INFO] Exclude: src/test/resources/**
[windows-jdk7] [INFO] Exclude: src/main/resources/default-server-root/**
[windows-jdk7] [INFO] Exclude: src/main/resources/ssh-keys/**
[windows-jdk7] [INFO] Exclude: src/test/ssh-keys/**
[windows-jdk7] [INFO] Exclude: .repository/**
[windows-jdk7] [INFO] Exclude: out/**
[windows-jdk7] [INFO] Exclude: .repository/**
[windows-jdk7] [INFO] Exclude: .maven/spy.log
[windows-jdk7] [INFO] Exclude: dependency-reduced-pom.xml
[windows-jdk7] [INFO] Exclude: .java-version
[windows-jdk7] [INFO] 12 resources included (use -debug for more details)
[windows-jdk7] [INFO] Rat check: Summary over all files. Unapproved: 0, unknown: 0, generated:
0, approved: 12 licenses.
[windows-jdk7] [INFO] 
[windows-jdk7] [INFO] --- maven-remote-resources-plugin:1.5:process (process-resource-bundles)
@ wagon-webdav-jackrabbit ---
[windows-jdk7] [INFO] 
[windows-jdk7] [INFO] --- maven-resources-plugin:3.0.2:resources (default-resources) @ wagon-webdav-jackrabbit
---
[windows-jdk7] [INFO] Using 'UTF-8' encoding to copy filtered resources.
[windows-jdk7] [INFO] Copying 1 resource
[windows-jdk7] [INFO] Copying 3 resources
[windows-jdk7] [INFO] 
[windows-jdk7] [INFO] --- maven-compiler-plugin:3.7.0:compile (default-compile) @ wagon-webdav-jackrabbit
---
[windows-jdk7] [INFO] Changes detected - recompiling the module!
[windows-jdk7] [INFO] Compiling 4 source files to F:\jenkins\jenkins-slave\workspace\n-box_maven-wagon_WAGON-519-J7N2M5AJKBTD73HB3DZOZKCB6IA2V3HXJQ24G5WDSTNUCOQW37ZQ\m\wagon-providers\wagon-webdav-jackrabbit\target\classes
[windows-jdk7] [INFO] /F:/jenkins/jenkins-slave/workspace/n-box_maven-wagon_WAGON-519-J7N2M5AJKBTD73HB3DZOZKCB6IA2V3HXJQ24G5WDSTNUCOQW37ZQ/m/wagon-providers/wagon-webdav-jackrabbit/src/main/java/org/apache/maven/wagon/providers/webdav/WebDavWagon.java:
F:\jenkins\jenkins-slave\workspace\n-box_maven-wagon_WAGON-519-J7N2M5AJKBTD73HB3DZOZKCB6IA2V3HXJQ24G5WDSTNUCOQW37ZQ\m\wagon-providers\wagon-webdav-jackrabbit\src\main\java\org\apache\maven\wagon\providers\webdav\WebDavWagon.java
uses or overrides a deprecated API.
[windows-jdk7] [INFO] /F:/jenkins/jenkins-slave/workspace/n-box_maven-wagon_WAGON-519-J7N2M5AJKBTD73HB3DZOZKCB6IA2V3HXJQ24G5WDSTNUCOQW37ZQ/m/wagon-providers/wagon-webdav-jackrabbit/src/main/java/org/apache/maven/wagon/providers/webdav/WebDavWagon.java:
Recompile with -Xlint:deprecation for details.
[windows-jdk7] [INFO] 
[windows-jdk7] [INFO] --- plexus-component-metadata:1.7.1:generate-metadata (generate) @ wagon-webdav-jackrabbit
---
[windows-jdk7] [INFO] Discovered 1 component descriptors(s)
[windows-jdk7] [INFO] 
[windows-jdk7] [INFO] --- animal-sniffer-maven-plugin:1.15:check (check-java-1.7-compat) @
wagon-webdav-jackrabbit ---
[windows-jdk7] [INFO] Checking unresolved references to org.codehaus.mojo.signature:java17:1.0
[windows-jdk7] [INFO] 
[windows-jdk7] [INFO] --- maven-resources-plugin:3.0.2:testResources (default-testResources)
@ wagon-webdav-jackrabbit ---
[windows-jdk7] [INFO] Using 'UTF-8' encoding to copy filtered resources.
[windows-jdk7] [INFO] Copying 2 resources
[windows-jdk7] [INFO] Copying 3 resources
[windows-jdk7] [INFO] 
[windows-jdk7] [INFO] --- maven-compiler-plugin:3.7.0:testCompile (default-testCompile) @
wagon-webdav-jackrabbit ---
[windows-jdk7] [INFO] Changes detected - recompiling the module!
[windows-jdk7] [INFO] Compiling 4 source files to F:\jenkins\jenkins-slave\workspace\n-box_maven-wagon_WAGON-519-J7N2M5AJKBTD73HB3DZOZKCB6IA2V3HXJQ24G5WDSTNUCOQW37ZQ\m\wagon-providers\wagon-webdav-jackrabbit\target\test-classes
[windows-jdk7] [INFO] /F:/jenkins/jenkins-slave/workspace/n-box_maven-wagon_WAGON-519-J7N2M5AJKBTD73HB3DZOZKCB6IA2V3HXJQ24G5WDSTNUCOQW37ZQ/m/wagon-providers/wagon-webdav-jackrabbit/src/test/java/org/apache/maven/wagon/providers/webdav/HttpClientWagonTest.java:
F:\jenkins\jenkins-slave\workspace\n-box_maven-wagon_WAGON-519-J7N2M5AJKBTD73HB3DZOZKCB6IA2V3HXJQ24G5WDSTNUCOQW37ZQ\m\wagon-providers\wagon-webdav-jackrabbit\src\test\java\org\apache\maven\wagon\providers\webdav\HttpClientWagonTest.java
uses or overrides a deprecated API.
[windows-jdk7] [INFO] /F:/jenkins/jenkins-slave/workspace/n-box_maven-wagon_WAGON-519-J7N2M5AJKBTD73HB3DZOZKCB6IA2V3HXJQ24G5WDSTNUCOQW37ZQ/m/wagon-providers/wagon-webdav-jackrabbit/src/test/java/org/apache/maven/wagon/providers/webdav/HttpClientWagonTest.java:
Recompile with -Xlint:deprecation for details.
[windows-jdk7] [INFO] 
[windows-jdk7] [INFO] --- maven-surefire-plugin:2.20:test (default-test) @ wagon-webdav-jackrabbit
---
[windows-jdk7] [INFO] 
[windows-jdk7] [INFO] -------------------------------------------------------
[windows-jdk7] [INFO]  T E S T S
[windows-jdk7] [INFO] -------------------------------------------------------
[windows-jdk7] [INFO] Running org.apache.maven.wagon.providers.webdav.HttpClientWagonTest
[windows-jdk7] [INFO] Tests run: 6, Failures: 0, Errors: 0, Skipped: 0, Time elapsed: 0.919
s - in org.apache.maven.wagon.providers.webdav.HttpClientWagonTest
[windows-jdk7] [INFO] Running org.apache.maven.wagon.providers.webdav.PathNavigatorTest
[windows-jdk7] [INFO] Tests run: 1, Failures: 0, Errors: 0, Skipped: 0, Time elapsed: 0.002
s - in org.apache.maven.wagon.providers.webdav.PathNavigatorTest
[windows-jdk7] [INFO] Running org.apache.maven.wagon.providers.webdav.WebDavsWagonTest
[windows-jdk8] [INFO] Tests run: 69, Failures: 0, Errors: 0, Skipped: 0, Time elapsed: 31.035
s - in org.apache.maven.wagon.providers.webdav.WebDavsWagonTest
[windows-jdk8] [INFO] Running org.apache.maven.wagon.providers.webdav.WebDavWagonTest
[windows-jdk7] [INFO] Tests run: 69, Failures: 0, Errors: 0, Skipped: 0, Time elapsed: 30.238
s - in org.apache.maven.wagon.providers.webdav.WebDavsWagonTest
[windows-jdk7] [INFO] Running org.apache.maven.wagon.providers.webdav.WebDavWagonTest
[windows-jdk8] [INFO] Tests run: 69, Failures: 0, Errors: 0, Skipped: 0, Time elapsed: 27.35
s - in org.apache.maven.wagon.providers.webdav.WebDavWagonTest
[windows-jdk8] [INFO] 
[windows-jdk8] [INFO] Results:
[windows-jdk8] [INFO] 
[windows-jdk8] [INFO] Tests run: 145, Failures: 0, Errors: 0, Skipped: 0
[windows-jdk8] [INFO] 
[windows-jdk8] [INFO] 
[windows-jdk8] [INFO] --- maven-jar-plugin:3.0.2:jar (default-jar) @ wagon-webdav-jackrabbit
---
[windows-jdk8] [INFO] Building jar: F:\jenkins\jenkins-slave\workspace\n-box_maven-wagon_WAGON-519-J7N2M5AJKBTD73HB3DZOZKCB6IA2V3HXJQ24G5WDSTNUCOQW37ZQ\m\wagon-providers\wagon-webdav-jackrabbit\target\wagon-webdav-jackrabbit-3.1.0-SNAPSHOT.jar
[windows-jdk8] [INFO] 
[windows-jdk8] [INFO] --- maven-site-plugin:3.7:attach-descriptor (attach-descriptor) @ wagon-webdav-jackrabbit
---
[windows-jdk8] [INFO] Skipping because packaging 'jar' is not pom.
[windows-jdk8] [INFO] 
[windows-jdk8] [INFO] --- maven-checkstyle-plugin:3.0.0:check (checkstyle-check) @ wagon-webdav-jackrabbit
---
[windows-jdk8] [INFO] ------------------------------------------------------------------------
[windows-jdk8] [INFO] Reactor Summary:
[windows-jdk8] [INFO] 
[windows-jdk8] [INFO] Apache Maven Wagon ................................. SUCCESS [ 27.667
s]
[windows-jdk8] [INFO] Apache Maven Wagon :: API .......................... SUCCESS [  9.092
s]
[windows-jdk8] [INFO] Apache Maven Wagon :: Provider Test ................ SUCCESS [  3.342
s]
[windows-jdk8] [INFO] Apache Maven Wagon :: Providers .................... SUCCESS [  1.516
s]
[windows-jdk8] [INFO] Apache Maven Wagon :: Providers :: File Provider ... SUCCESS [  4.077
s]
[windows-jdk8] [INFO] Apache Maven Wagon :: Providers :: FTP Provider .... SUCCESS [  7.205
s]
[windows-jdk8] [INFO] Apache Maven Wagon :: Providers :: HTTP Shared Library SUCCESS [  4.439
s]
[windows-jdk8] [INFO] Apache Maven Wagon :: Test Compatibility Kits ...... SUCCESS [  1.306
s]
[windows-jdk8] [INFO] Apache Maven Wagon :: HTTP Test Compatibility Kit .. SUCCESS [  2.049
s]
[windows-jdk8] [INFO] Apache Maven Wagon :: Providers :: HTTP Provider ... SUCCESS [04:41
min]
[windows-jdk8] [INFO] Apache Maven Wagon :: Providers :: Lightweight HTTP Provider SUCCESS
[02:09 min]
[windows-jdk8] [INFO] Apache Maven Wagon :: Providers :: SCM Provider .... SUCCESS [ 14.274
s]
[windows-jdk8] [INFO] Apache Maven Wagon :: Providers :: SSH Common Library SUCCESS [  2.987
s]
[windows-jdk8] [INFO] Apache Maven Wagon :: Providers :: SSH Common Tests  SUCCESS [  2.737
s]
[windows-jdk8] [INFO] Apache Maven Wagon :: Providers :: SSH External Provider SUCCESS [ 
1.891 s]
[windows-jdk8] [INFO] Apache Maven Wagon :: Providers :: SSH Provider .... SUCCESS [  3.474
s]
[windows-jdk8] [INFO] Apache Maven Wagon :: Providers :: WebDAV Provider . SUCCESS [01:03
min]
[windows-jdk8] [INFO] ------------------------------------------------------------------------
[windows-jdk8] [INFO] BUILD SUCCESS
[windows-jdk8] [INFO] ------------------------------------------------------------------------
[windows-jdk8] [INFO] Total time: 09:22 min
[windows-jdk8] [INFO] Finished at: 2018-12-29T18:06:22Z
[windows-jdk8] [INFO] Final Memory: 93M/1048M
[windows-jdk8] [INFO] ------------------------------------------------------------------------
[windows-jdk8] [WARNING] The requested profile "run-its" could not be activated because it
does not exist.
[windows-jdk8] [INFO] [jenkins-event-spy] Generated F:\jenkins\jenkins-slave\workspace\n-box_maven-wagon_WAGON-519-J7N2M5AJKBTD73HB3DZOZKCB6IA2V3HXJQ24G5WDSTNUCOQW37ZQ@tmp\withMaven87694e57\maven-spy-20181229-175659-862145556359915883990.log
[windows-jdk8] Picked up JAVA_TOOL_OPTIONS: -Dmaven.ext.class.path="f:\jenkins\jenkins-slave\workspace\n-box_maven-wagon_WAGON-519-J7N2M5AJKBTD73HB3DZOZKCB6IA2V3HXJQ24G5WDSTNUCOQW37ZQ@tmp\withMaven87694e57\pipeline-maven-spy.jar"
-Dorg.jenkinsci.plugins.pipeline.maven.reportsFolder="f:\jenkins\jenkins-slave\workspace\n-box_maven-wagon_WAGON-519-J7N2M5AJKBTD73HB3DZOZKCB6IA2V3HXJQ24G5WDSTNUCOQW37ZQ@tmp\withMaven87694e57"

[Pipeline] [windows-jdk8] }
[Pipeline] [windows-jdk8] // dir
[Pipeline] [windows-jdk8] }
[windows-jdk8] [withMaven] junitPublisher - Archive test results for Maven artifact org.apache.maven.wagon:wagon-provider-api:3.1.0-SNAPSHOT
generated by maven-surefire-plugin:test (default-test): m\wagon-provider-api\target\surefire-reports\*.xml
[windows-jdk8] Recording test results
[windows-jdk8] [withMaven] junitPublisher - Archive test results for Maven artifact org.apache.maven.wagon:wagon-provider-test:3.1.0-SNAPSHOT
generated by maven-surefire-plugin:test (default-test): m\wagon-provider-test\target\surefire-reports\*.xml
[windows-jdk8] Recording test results
[windows-jdk8] None of the test reports contained any result
[windows-jdk8] [withMaven] junitPublisher - Archive test results for Maven artifact org.apache.maven.wagon:wagon-file:3.1.0-SNAPSHOT
generated by maven-surefire-plugin:test (default-test): m\wagon-providers\wagon-file\target\surefire-reports\*.xml
[windows-jdk8] Recording test results
[windows-jdk8] [withMaven] junitPublisher - Archive test results for Maven artifact org.apache.maven.wagon:wagon-ftp:3.1.0-SNAPSHOT
generated by maven-surefire-plugin:test (default-test): m\wagon-providers\wagon-ftp\target\surefire-reports\*.xml
[windows-jdk8] Recording test results
[windows-jdk8] [withMaven] junitPublisher - Archive test results for Maven artifact org.apache.maven.wagon:wagon-http-shared:3.1.0-SNAPSHOT
generated by maven-surefire-plugin:test (default-test): m\wagon-providers\wagon-http-shared\target\surefire-reports\*.xml
[windows-jdk8] Recording test results
[windows-jdk8] [withMaven] junitPublisher - Archive test results for Maven artifact org.apache.maven.wagon:wagon-tck-http:3.1.0-SNAPSHOT
generated by maven-surefire-plugin:test (default-test): m\wagon-tcks\wagon-tck-http\target\surefire-reports\*.xml
[windows-jdk8] Recording test results
[windows-jdk8] None of the test reports contained any result
[windows-jdk8] [withMaven] junitPublisher - Archive test results for Maven artifact org.apache.maven.wagon:wagon-http:3.1.0-SNAPSHOT
generated by maven-surefire-plugin:test (default-test): m\wagon-providers\wagon-http\target\surefire-reports\*.xml
[windows-jdk8] Recording test results
[windows-jdk8] [withMaven] junitPublisher - Archive test results for Maven artifact org.apache.maven.wagon:wagon-http-lightweight:3.1.0-SNAPSHOT
generated by maven-surefire-plugin:test (default-test): m\wagon-providers\wagon-http-lightweight\target\surefire-reports\*.xml
[windows-jdk8] Recording test results
[windows-jdk8] [withMaven] junitPublisher - Archive test results for Maven artifact org.apache.maven.wagon:wagon-scm:3.1.0-SNAPSHOT
generated by maven-surefire-plugin:test (default-test): m\wagon-providers\wagon-scm\target\surefire-reports\*.xml
[windows-jdk8] Recording test results
[windows-jdk8] [withMaven] junitPublisher - Archive test results for Maven artifact org.apache.maven.wagon:wagon-ssh-common:3.1.0-SNAPSHOT
generated by maven-surefire-plugin:test (default-test): m\wagon-providers\wagon-ssh-common\target\surefire-reports\*.xml
[windows-jdk8] Recording test results
[windows-jdk8] [withMaven] junitPublisher - Archive test results for Maven artifact org.apache.maven.wagon:wagon-ssh-common-test:3.1.0-SNAPSHOT
generated by maven-surefire-plugin:test (default-test): m\wagon-providers\wagon-ssh-common-test\target\surefire-reports\*.xml
[windows-jdk8] Recording test results
[windows-jdk8] None of the test reports contained any result
[windows-jdk8] [withMaven] junitPublisher - Archive test results for Maven artifact org.apache.maven.wagon:wagon-ssh-external:3.1.0-SNAPSHOT
generated by maven-surefire-plugin:test (default-test): m\wagon-providers\wagon-ssh-external\target\surefire-reports\*.xml
[windows-jdk8] Recording test results
[windows-jdk8] None of the test reports contained any result
[windows-jdk8] [withMaven] junitPublisher - Archive test results for Maven artifact org.apache.maven.wagon:wagon-ssh:3.1.0-SNAPSHOT
generated by maven-surefire-plugin:test (default-test): m\wagon-providers\wagon-ssh\target\surefire-reports\*.xml
[windows-jdk8] Recording test results
[windows-jdk8] None of the test reports contained any result
[windows-jdk8] [withMaven] junitPublisher - Archive test results for Maven artifact org.apache.maven.wagon:wagon-webdav-jackrabbit:3.1.0-SNAPSHOT
generated by maven-surefire-plugin:test (default-test): m\wagon-providers\wagon-webdav-jackrabbit\target\surefire-reports\*.xml
[windows-jdk8] Recording test results
[Pipeline] [windows-jdk8] // withMaven
[Pipeline] [windows-jdk8] cleanWs
[windows-jdk8] [WS-CLEANUP] Deleting project workspace...[WS-CLEANUP] done
[Pipeline] [windows-jdk8] }
[Pipeline] [windows-jdk8] // stage
[Pipeline] [windows-jdk8] }
[Pipeline] [windows-jdk8] // node
[Pipeline] [windows-jdk8] }
[windows-jdk7] [INFO] Tests run: 69, Failures: 0, Errors: 0, Skipped: 0, Time elapsed: 25.905
s - in org.apache.maven.wagon.providers.webdav.WebDavWagonTest
[windows-jdk7] [INFO] 
[windows-jdk7] [INFO] Results:
[windows-jdk7] [INFO] 
[windows-jdk7] [INFO] Tests run: 145, Failures: 0, Errors: 0, Skipped: 0
[windows-jdk7] [INFO] 
[windows-jdk7] [INFO] 
[windows-jdk7] [INFO] --- maven-jar-plugin:3.0.2:jar (default-jar) @ wagon-webdav-jackrabbit
---
[windows-jdk7] [INFO] Building jar: F:\jenkins\jenkins-slave\workspace\n-box_maven-wagon_WAGON-519-J7N2M5AJKBTD73HB3DZOZKCB6IA2V3HXJQ24G5WDSTNUCOQW37ZQ\m\wagon-providers\wagon-webdav-jackrabbit\target\wagon-webdav-jackrabbit-3.1.0-SNAPSHOT.jar
[windows-jdk7] [INFO] 
[windows-jdk7] [INFO] --- maven-site-plugin:3.7:attach-descriptor (attach-descriptor) @ wagon-webdav-jackrabbit
---
[windows-jdk7] [INFO] Skipping because packaging 'jar' is not pom.
[windows-jdk7] [INFO] 
[windows-jdk7] [INFO] --- maven-checkstyle-plugin:3.0.0:check (checkstyle-check) @ wagon-webdav-jackrabbit
---
[windows-jdk7] [INFO] ------------------------------------------------------------------------
[windows-jdk7] [INFO] Reactor Summary:
[windows-jdk7] [INFO] 
[windows-jdk7] [INFO] Apache Maven Wagon ................................. SUCCESS [ 31.016
s]
[windows-jdk7] [INFO] Apache Maven Wagon :: API .......................... SUCCESS [ 11.223
s]
[windows-jdk7] [INFO] Apache Maven Wagon :: Provider Test ................ SUCCESS [  4.058
s]
[windows-jdk7] [INFO] Apache Maven Wagon :: Providers .................... SUCCESS [  1.761
s]
[windows-jdk7] [INFO] Apache Maven Wagon :: Providers :: File Provider ... SUCCESS [  3.659
s]
[windows-jdk7] [INFO] Apache Maven Wagon :: Providers :: FTP Provider .... SUCCESS [  6.673
s]
[windows-jdk7] [INFO] Apache Maven Wagon :: Providers :: HTTP Shared Library SUCCESS [  4.072
s]
[windows-jdk7] [INFO] Apache Maven Wagon :: Test Compatibility Kits ...... SUCCESS [  1.361
s]
[windows-jdk7] [INFO] Apache Maven Wagon :: HTTP Test Compatibility Kit .. SUCCESS [  2.580
s]
[windows-jdk7] [INFO] Apache Maven Wagon :: Providers :: HTTP Provider ... SUCCESS [04:53
min]
[windows-jdk7] [INFO] Apache Maven Wagon :: Providers :: Lightweight HTTP Provider SUCCESS
[02:10 min]
[windows-jdk7] [INFO] Apache Maven Wagon :: Providers :: SCM Provider .... SUCCESS [ 12.658
s]
[windows-jdk7] [INFO] Apache Maven Wagon :: Providers :: SSH Common Library SUCCESS [  3.479
s]
[windows-jdk7] [INFO] Apache Maven Wagon :: Providers :: SSH Common Tests  SUCCESS [  3.618
s]
[windows-jdk7] [INFO] Apache Maven Wagon :: Providers :: SSH External Provider SUCCESS [ 
2.371 s]
[windows-jdk7] [INFO] Apache Maven Wagon :: Providers :: SSH Provider .... SUCCESS [  3.386
s]
[windows-jdk7] [INFO] Apache Maven Wagon :: Providers :: WebDAV Provider . SUCCESS [01:00
min]
[windows-jdk7] [INFO] ------------------------------------------------------------------------
[windows-jdk7] [INFO] BUILD SUCCESS
[windows-jdk7] [INFO] ------------------------------------------------------------------------
[windows-jdk7] [INFO] Total time: 09:38 min
[windows-jdk7] [INFO] Finished at: 2018-12-29T18:06:36Z
[windows-jdk7] [INFO] Final Memory: 52M/241M
[windows-jdk7] [INFO] ------------------------------------------------------------------------
[windows-jdk7] [WARNING] The requested profile "run-its" could not be activated because it
does not exist.
[windows-jdk7] [INFO] [jenkins-event-spy] Generated F:\jenkins\jenkins-slave\workspace\n-box_maven-wagon_WAGON-519-J7N2M5AJKBTD73HB3DZOZKCB6IA2V3HXJQ24G5WDSTNUCOQW37ZQ@tmp\withMaven619073df\maven-spy-20181229-175657-311143747012169307533.log
[windows-jdk7] Picked up JAVA_TOOL_OPTIONS: -Dmaven.ext.class.path="f:\jenkins\jenkins-slave\workspace\n-box_maven-wagon_WAGON-519-J7N2M5AJKBTD73HB3DZOZKCB6IA2V3HXJQ24G5WDSTNUCOQW37ZQ@tmp\withMaven619073df\pipeline-maven-spy.jar"
-Dorg.jenkinsci.plugins.pipeline.maven.reportsFolder="f:\jenkins\jenkins-slave\workspace\n-box_maven-wagon_WAGON-519-J7N2M5AJKBTD73HB3DZOZKCB6IA2V3HXJQ24G5WDSTNUCOQW37ZQ@tmp\withMaven619073df"

[Pipeline] [windows-jdk7] }
[Pipeline] [windows-jdk7] // dir
[Pipeline] [windows-jdk7] }
[windows-jdk7] [withMaven] junitPublisher - Archive test results for Maven artifact org.apache.maven.wagon:wagon-provider-api:3.1.0-SNAPSHOT
generated by maven-surefire-plugin:test (default-test): m\wagon-provider-api\target\surefire-reports\*.xml
[windows-jdk7] Recording test results
[windows-jdk7] [withMaven] junitPublisher - Archive test results for Maven artifact org.apache.maven.wagon:wagon-provider-test:3.1.0-SNAPSHOT
generated by maven-surefire-plugin:test (default-test): m\wagon-provider-test\target\surefire-reports\*.xml
[windows-jdk7] Recording test results
[windows-jdk7] None of the test reports contained any result
[windows-jdk7] [withMaven] junitPublisher - Archive test results for Maven artifact org.apache.maven.wagon:wagon-file:3.1.0-SNAPSHOT
generated by maven-surefire-plugin:test (default-test): m\wagon-providers\wagon-file\target\surefire-reports\*.xml
[windows-jdk7] Recording test results
[windows-jdk7] [withMaven] junitPublisher - Archive test results for Maven artifact org.apache.maven.wagon:wagon-ftp:3.1.0-SNAPSHOT
generated by maven-surefire-plugin:test (default-test): m\wagon-providers\wagon-ftp\target\surefire-reports\*.xml
[windows-jdk7] Recording test results
[windows-jdk7] [withMaven] junitPublisher - Archive test results for Maven artifact org.apache.maven.wagon:wagon-http-shared:3.1.0-SNAPSHOT
generated by maven-surefire-plugin:test (default-test): m\wagon-providers\wagon-http-shared\target\surefire-reports\*.xml
[windows-jdk7] Recording test results
[windows-jdk7] [withMaven] junitPublisher - Archive test results for Maven artifact org.apache.maven.wagon:wagon-tck-http:3.1.0-SNAPSHOT
generated by maven-surefire-plugin:test (default-test): m\wagon-tcks\wagon-tck-http\target\surefire-reports\*.xml
[windows-jdk7] Recording test results
[windows-jdk7] None of the test reports contained any result
[windows-jdk7] [withMaven] junitPublisher - Archive test results for Maven artifact org.apache.maven.wagon:wagon-http:3.1.0-SNAPSHOT
generated by maven-surefire-plugin:test (default-test): m\wagon-providers\wagon-http\target\surefire-reports\*.xml
[windows-jdk7] Recording test results
[windows-jdk7] [withMaven] junitPublisher - Archive test results for Maven artifact org.apache.maven.wagon:wagon-http-lightweight:3.1.0-SNAPSHOT
generated by maven-surefire-plugin:test (default-test): m\wagon-providers\wagon-http-lightweight\target\surefire-reports\*.xml
[windows-jdk7] Recording test results
[windows-jdk7] [withMaven] junitPublisher - Archive test results for Maven artifact org.apache.maven.wagon:wagon-scm:3.1.0-SNAPSHOT
generated by maven-surefire-plugin:test (default-test): m\wagon-providers\wagon-scm\target\surefire-reports\*.xml
[windows-jdk7] Recording test results
[windows-jdk7] [withMaven] junitPublisher - Archive test results for Maven artifact org.apache.maven.wagon:wagon-ssh-common:3.1.0-SNAPSHOT
generated by maven-surefire-plugin:test (default-test): m\wagon-providers\wagon-ssh-common\target\surefire-reports\*.xml
[windows-jdk7] Recording test results
[windows-jdk7] [withMaven] junitPublisher - Archive test results for Maven artifact org.apache.maven.wagon:wagon-ssh-common-test:3.1.0-SNAPSHOT
generated by maven-surefire-plugin:test (default-test): m\wagon-providers\wagon-ssh-common-test\target\surefire-reports\*.xml
[windows-jdk7] Recording test results
[windows-jdk7] None of the test reports contained any result
[windows-jdk7] [withMaven] junitPublisher - Archive test results for Maven artifact org.apache.maven.wagon:wagon-ssh-external:3.1.0-SNAPSHOT
generated by maven-surefire-plugin:test (default-test): m\wagon-providers\wagon-ssh-external\target\surefire-reports\*.xml
[windows-jdk7] Recording test results
[windows-jdk7] None of the test reports contained any result
[windows-jdk7] [withMaven] junitPublisher - Archive test results for Maven artifact org.apache.maven.wagon:wagon-ssh:3.1.0-SNAPSHOT
generated by maven-surefire-plugin:test (default-test): m\wagon-providers\wagon-ssh\target\surefire-reports\*.xml
[windows-jdk7] Recording test results
[windows-jdk7] None of the test reports contained any result
[windows-jdk7] [withMaven] junitPublisher - Archive test results for Maven artifact org.apache.maven.wagon:wagon-webdav-jackrabbit:3.1.0-SNAPSHOT
generated by maven-surefire-plugin:test (default-test): m\wagon-providers\wagon-webdav-jackrabbit\target\surefire-reports\*.xml
[windows-jdk7] Recording test results
[Pipeline] [windows-jdk7] // withMaven
[Pipeline] [windows-jdk7] cleanWs
[windows-jdk7] [WS-CLEANUP] Deleting project workspace...[WS-CLEANUP] done
[Pipeline] [windows-jdk7] }
[Pipeline] [windows-jdk7] // stage
[Pipeline] [windows-jdk7] }
[Pipeline] [windows-jdk7] // node
[Pipeline] [windows-jdk7] }
[Pipeline] // parallel
[Pipeline] stage
[Pipeline] { (Notifications)
[Pipeline] echo
Build result: FAILURE
[Pipeline] jiraIssueSelector
[Pipeline] emailext
Mime
  • Unnamed multipart/mixed (inline, None, 0 bytes)
View raw message