maven-notifications mailing list archives

Site index · List index
Message view « Date » · « Thread »
Top « Date » · « Thread »
From Apache Jenkins Server <jenk...@builds.apache.org>
Subject Build failed in Jenkins: Maven TLP » maven-dependency-plugin » MDEP-625 #13
Date Sat, 08 Dec 2018 13:50:46 GMT
See https://builds.apache.org/job/maven-box/job/maven-dependency-plugin/job/MDEP-625/13/

No changes.

14 tests failed.
FAILED:  org.apache.maven.plugins.dependency.TestGetMojo.testRemoteRepositories

Error Message:
The parameter filter is not allowed to be null.

Stack Trace:
java.lang.IllegalArgumentException: The parameter filter is not allowed to be null.
	at org.apache.maven.plugins.dependency.TestGetMojo.testRemoteRepositories(TestGetMojo.java:96)


FAILED:  org.apache.maven.plugins.dependency.TestGetMojo.testRemoteRepositories

Error Message:
The parameter filter is not allowed to be null.

Stack Trace:
java.lang.IllegalArgumentException: The parameter filter is not allowed to be null.
	at org.apache.maven.plugins.dependency.TestGetMojo.testRemoteRepositories(TestGetMojo.java:96)


FAILED:  org.apache.maven.plugins.dependency.TestGetMojo.testRemoteRepositories

Error Message:
The parameter filter is not allowed to be null.

Stack Trace:
java.lang.IllegalArgumentException: The parameter filter is not allowed to be null.
	at org.apache.maven.plugins.dependency.TestGetMojo.testRemoteRepositories(TestGetMojo.java:96)


FAILED:  org.apache.maven.plugins.dependency.TestGetMojo.testRemoteRepositories

Error Message:
The parameter filter is not allowed to be null.

Stack Trace:
java.lang.IllegalArgumentException: The parameter filter is not allowed to be null.
	at org.apache.maven.plugins.dependency.TestGetMojo.testRemoteRepositories(TestGetMojo.java:96)


FAILED:  org.apache.maven.plugins.dependency.TestGetMojo.testRemoteRepositories

Error Message:
The parameter filter is not allowed to be null.

Stack Trace:
java.lang.IllegalArgumentException: The parameter filter is not allowed to be null.
	at org.apache.maven.plugins.dependency.TestGetMojo.testRemoteRepositories(TestGetMojo.java:96)


FAILED:  org.apache.maven.plugins.dependency.TestGetMojo.testRemoteRepositories

Error Message:
The parameter filter is not allowed to be null.

Stack Trace:
java.lang.IllegalArgumentException: The parameter filter is not allowed to be null.
	at org.apache.maven.plugins.dependency.TestGetMojo.testRemoteRepositories(TestGetMojo.java:96)


FAILED:  org.apache.maven.plugins.dependency.TestGetMojo.testRemoteRepositories

Error Message:
The parameter filter is not allowed to be null.

Stack Trace:
java.lang.IllegalArgumentException: The parameter filter is not allowed to be null.
	at org.apache.maven.plugins.dependency.TestGetMojo.testRemoteRepositories(TestGetMojo.java:96)


FAILED:  org.apache.maven.plugins.dependency.TestGetMojo.testRemoteRepositories

Error Message:
The parameter filter is not allowed to be null.

Stack Trace:
java.lang.IllegalArgumentException: The parameter filter is not allowed to be null.
	at org.apache.maven.plugins.dependency.TestGetMojo.testRemoteRepositories(TestGetMojo.java:96)


FAILED:  org.apache.maven.plugins.dependency.TestGetMojo.testRemoteRepositories

Error Message:
The parameter filter is not allowed to be null.

Stack Trace:
java.lang.IllegalArgumentException: The parameter filter is not allowed to be null.
	at org.apache.maven.plugins.dependency.TestGetMojo.testRemoteRepositories(TestGetMojo.java:96)


FAILED:  org.apache.maven.plugins.dependency.TestGetMojo.testRemoteRepositories

Error Message:
The parameter filter is not allowed to be null.

Stack Trace:
java.lang.IllegalArgumentException: The parameter filter is not allowed to be null.
	at org.apache.maven.plugins.dependency.TestGetMojo.testRemoteRepositories(TestGetMojo.java:96)


FAILED:  org.apache.maven.plugins.dependency.TestGetMojo.testRemoteRepositories

Error Message:
The parameter filter is not allowed to be null.

Stack Trace:
java.lang.IllegalArgumentException: The parameter filter is not allowed to be null.
	at org.apache.maven.plugins.dependency.TestGetMojo.testRemoteRepositories(TestGetMojo.java:96)


FAILED:  org.apache.maven.plugins.dependency.TestGetMojo.testRemoteRepositories

Error Message:
The parameter filter is not allowed to be null.

Stack Trace:
java.lang.IllegalArgumentException: The parameter filter is not allowed to be null.
	at org.apache.maven.plugins.dependency.TestGetMojo.testRemoteRepositories(TestGetMojo.java:96)


FAILED:  org.apache.maven.plugins.dependency.TestGetMojo.testRemoteRepositories

Error Message:
The parameter filter is not allowed to be null.

Stack Trace:
java.lang.IllegalArgumentException: The parameter filter is not allowed to be null.
	at org.apache.maven.plugins.dependency.TestGetMojo.testRemoteRepositories(TestGetMojo.java:96)


FAILED:  org.apache.maven.plugins.dependency.TestGetMojo.testRemoteRepositories

Error Message:
The parameter filter is not allowed to be null.

Stack Trace:
java.lang.IllegalArgumentException: The parameter filter is not allowed to be null.
	at org.apache.maven.plugins.dependency.TestGetMojo.testRemoteRepositories(TestGetMojo.java:96)




Build log:
[...truncated 6.11 MB...]
[windows-jdk11-m3.5.x_build] [withMaven] junitPublisher - Archive test results for Maven artifact org.apache.maven.plugins:maven-dependency-plugin:3.1.2-SNAPSHOT generated by maven-surefire-plugin:test (default-test): windows-jdk11-m3.5.x_build\target\surefire-reports\*.xml
[windows-jdk11-m3.5.x_build] Recording test results
[windows-jdk11-m3.5.x_build] [withMaven] openTasksPublisher - Scan Tasks for Maven artifact org.apache.maven.plugins:maven-dependency-plugin:3.1.2-SNAPSHOT in source directory windows-jdk11-m3.5.x_build\src\main\java
[windows-jdk11-m3.5.x_build] [TASKS] Scanning folder 'f:\jenkins\jenkins-slave\workspace\-dependency-plugin_MDEP-625-3I6V7G3727HFCGSCWRQH5RTCWRSMXZQ3ZEOVZRI3U3XLP2Z7WCCQ@2@2' for files matching the pattern 'windows-jdk11-m3.5.x_build\src\main\java\**\*' - excludes: null
[windows-jdk11-m3.5.x_build] [TASKS] Found 48 files to scan for tasks
[windows-jdk11-m3.5.x_build] [TASKS] Found 4 open tasks.
[windows-jdk11-m3.5.x_build] Skipping warnings blame since pipelines do not have an SCM link.%n
[Pipeline] [windows-jdk11-m3.5.x_build] // withMaven
[Pipeline] [windows-jdk11-m3.5.x_build] cleanWs
[Pipeline] [windows-jdk7-m3.5.x_build] }
[Pipeline] [windows-jdk7-m3.5.x_build] // dir
[windows-jdk11-m3.5.x_build] [WS-CLEANUP] Deleting project workspace...[WS-CLEANUP] done
[windows-jdk9-m3.5.x_build] [INFO] run post-build script verify.bsh
[windows-jdk9-m3.5.x_build] [INFO]           unpack\pom.xml ................................... SUCCESS (8.0 s)
[windows-jdk9-m3.5.x_build] [INFO] Building: unpack-cli\pom.xml
[Pipeline] [windows-jdk7-m3.5.x_build] }
[windows-jdk7-m3.5.x_build] [Fast Archiver] No prior successful build to compare, so performing full copy of artifacts
[windows-jdk7-m3.5.x_build] [withMaven] invokerPublisher - Archive invoker results for Maven artifact MavenArtifact{org.apache.maven.plugins:maven-dependency-plugin::3.1.2-SNAPSHOT(version: 3.1.2-SNAPSHOT, snapshot:false) } generated by PluginInvocation{org.apache.maven.plugins:maven-invoker-plugin:3.1.0@integration-test  integration-test}: windows-jdk7-m3.5.x_build\target\invoker-reports\*.xml
[windows-jdk7-m3.5.x_build] performing MavenInvokerRecorder, reportsFilenamePattern:'**/windows-jdk7-m3.5.x_build\target\invoker-reports/BUILD*.xml', invokerBuildDir:'**/windows-jdk7-m3.5.x_build\target\it'
[windows-jdk7-m3.5.x_build] Found reports:[f:\jenkins\jenkins-slave\workspace\-dependency-plugin_MDEP-625-3I6V7G3727HFCGSCWRQH5RTCWRSMXZQ3ZEOVZRI3U3XLP2Z7WCCQ@3\windows-jdk7-m3.5.x_build\target\invoker-reports\BUILD-analyze-dep-mgt.xml, f:\jenkins\jenkins-slave\workspace\-dependency-plugin_MDEP-625-3I6V7G3727HFCGSCWRQH5RTCWRSMXZQ3ZEOVZRI3U3XLP2Z7WCCQ@3\windows-jdk7-m3.5.x_build\target\invoker-reports\BUILD-analyze-ignore-dependency.xml, f:\jenkins\jenkins-slave\workspace\-dependency-plugin_MDEP-625-3I6V7G3727HFCGSCWRQH5RTCWRSMXZQ3ZEOVZRI3U3XLP2Z7WCCQ@3\windows-jdk7-m3.5.x_build\target\invoker-reports\BUILD-analyze-ignore-unused-declared-dependency.xml, f:\jenkins\jenkins-slave\workspace\-dependency-plugin_MDEP-625-3I6V7G3727HFCGSCWRQH5RTCWRSMXZQ3ZEOVZRI3U3XLP2Z7WCCQ@3\windows-jdk7-m3.5.x_build\target\invoker-reports\BUILD-analyze-ignore-used-undeclared-dependency.xml, f:\jenkins\jenkins-slave\workspace\-dependency-plugin_MDEP-625-3I6V7G3727HFCGSCWRQH5RTCWRSMXZQ3ZEOVZRI3U3XLP2Z7WCCQ@3\windows-jdk7-m3.5.x_build\target\invoker-reports\BUILD-analyze-multimodule-project.xml, f:\jenkins\jenkins-slave\workspace\-dependency-plugin_MDEP-625-3I6V7G3727HFCGSCWRQH5RTCWRSMXZQ3ZEOVZRI3U3XLP2Z7WCCQ@3\windows-jdk7-m3.5.x_build\target\invoker-reports\BUILD-analyze-report.xml, f:\jenkins\jenkins-slave\workspace\-dependency-plugin_MDEP-625-3I6V7G3727HFCGSCWRQH5RTCWRSMXZQ3ZEOVZRI3U3XLP2Z7WCCQ@3\windows-jdk7-m3.5.x_build\target\invoker-reports\BUILD-analyze.xml, f:\jenkins\jenkins-slave\workspace\-dependency-plugin_MDEP-625-3I6V7G3727HFCGSCWRQH5RTCWRSMXZQ3ZEOVZRI3U3XLP2Z7WCCQ@3\windows-jdk7-m3.5.x_build\target\invoker-reports\BUILD-build-classpath-output-file-and-property.xml, f:\jenkins\jenkins-slave\workspace\-dependency-plugin_MDEP-625-3I6V7G3727HFCGSCWRQH5RTCWRSMXZQ3ZEOVZRI3U3XLP2Z7WCCQ@3\windows-jdk7-m3.5.x_build\target\invoker-reports\BUILD-build-classpath.xml, f:\jenkins\jenkins-slave\workspace\-dependency-plugin_MDEP-625-3I6V7G3727HFCGSCWRQH5RTCWRSMXZQ3ZEOVZRI3U3XLP2Z7WCCQ@3\windows-jdk7-m3.5.x_build\target\invoker-reports\BUILD-collect.xml, f:\jenkins\jenkins-slave\workspace\-dependency-plugin_MDEP-625-3I6V7G3727HFCGSCWRQH5RTCWRSMXZQ3ZEOVZRI3U3XLP2Z7WCCQ@3\windows-jdk7-m3.5.x_build\target\invoker-reports\BUILD-copy-and-unpack-with-alternate-local-repo.xml, f:\jenkins\jenkins-slave\workspace\-dependency-plugin_MDEP-625-3I6V7G3727HFCGSCWRQH5RTCWRSMXZQ3ZEOVZRI3U3XLP2Z7WCCQ@3\windows-jdk7-m3.5.x_build\target\invoker-reports\BUILD-copy-cli.xml, f:\jenkins\jenkins-slave\workspace\-dependency-plugin_MDEP-625-3I6V7G3727HFCGSCWRQH5RTCWRSMXZQ3ZEOVZRI3U3XLP2Z7WCCQ@3\windows-jdk7-m3.5.x_build\target\invoker-reports\BUILD-copy-dependencies.xml, f:\jenkins\jenkins-slave\workspace\-dependency-plugin_MDEP-625-3I6V7G3727HFCGSCWRQH5RTCWRSMXZQ3ZEOVZRI3U3XLP2Z7WCCQ@3\windows-jdk7-m3.5.x_build\target\invoker-reports\BUILD-copy-from-reactor.xml, f:\jenkins\jenkins-slave\workspace\-dependency-plugin_MDEP-625-3I6V7G3727HFCGSCWRQH5RTCWRSMXZQ3ZEOVZRI3U3XLP2Z7WCCQ@3\windows-jdk7-m3.5.x_build\target\invoker-reports\BUILD-copy-from-remote-repository.xml, f:\jenkins\jenkins-slave\workspace\-dependency-plugin_MDEP-625-3I6V7G3727HFCGSCWRQH5RTCWRSMXZQ3ZEOVZRI3U3XLP2Z7WCCQ@3\windows-jdk7-m3.5.x_build\target\invoker-reports\BUILD-copy.xml, f:\jenkins\jenkins-slave\workspace\-dependency-plugin_MDEP-625-3I6V7G3727HFCGSCWRQH5RTCWRSMXZQ3ZEOVZRI3U3XLP2Z7WCCQ@3\windows-jdk7-m3.5.x_build\target\invoker-reports\BUILD-dependency-properties.xml, f:\jenkins\jenkins-slave\workspace\-dependency-plugin_MDEP-625-3I6V7G3727HFCGSCWRQH5RTCWRSMXZQ3ZEOVZRI3U3XLP2Z7WCCQ@3\windows-jdk7-m3.5.x_build\target\invoker-reports\BUILD-filterunpack.xml, f:\jenkins\jenkins-slave\workspace\-dependency-plugin_MDEP-625-3I6V7G3727HFCGSCWRQH5RTCWRSMXZQ3ZEOVZRI3U3XLP2Z7WCCQ@3\windows-jdk7-m3.5.x_build\target\invoker-reports\BUILD-get-artifact-maven-plugin.xml, f:\jenkins\jenkins-slave\workspace\-dependency-plugin_MDEP-625-3I6V7G3727HFCGSCWRQH5RTCWRSMXZQ3ZEOVZRI3U3XLP2Z7WCCQ@3\windows-jdk7-m3.5.x_build\target\invoker-reports\BUILD-get-artifact-no-transitive.xml, f:\jenkins\jenkins-slave\workspace\-dependency-plugin_MDEP-625-3I6V7G3727HFCGSCWRQH5RTCWRSMXZQ3ZEOVZRI3U3XLP2Z7WCCQ@3\windows-jdk7-m3.5.x_build\target\invoker-reports\BUILD-get-artifact.xml, f:\jenkins\jenkins-slave\workspace\-dependency-plugin_MDEP-625-3I6V7G3727HFCGSCWRQH5RTCWRSMXZQ3ZEOVZRI3U3XLP2Z7WCCQ@3\windows-jdk7-m3.5.x_build\target\invoker-reports\BUILD-get-gav.xml, f:\jenkins\jenkins-slave\workspace\-dependency-plugin_MDEP-625-3I6V7G3727HFCGSCWRQH5RTCWRSMXZQ3ZEOVZRI3U3XLP2Z7WCCQ@3\windows-jdk7-m3.5.x_build\target\invoker-reports\BUILD-go-offline.xml, f:\jenkins\jenkins-slave\workspace\-dependency-plugin_MDEP-625-3I6V7G3727HFCGSCWRQH5RTCWRSMXZQ3ZEOVZRI3U3XLP2Z7WCCQ@3\windows-jdk7-m3.5.x_build\target\invoker-reports\BUILD-list-repositories.xml, f:\jenkins\jenkins-slave\workspace\-dependency-plugin_MDEP-625-3I6V7G3727HFCGSCWRQH5RTCWRSMXZQ3ZEOVZRI3U3XLP2Z7WCCQ@3\windows-jdk7-m3.5.x_build\target\invoker-reports\BUILD-mdep-439-analyze-java8.xml, f:\jenkins\jenkins-slave\workspace\-dependency-plugin_MDEP-625-3I6V7G3727HFCGSCWRQH5RTCWRSMXZQ3ZEOVZRI3U3XLP2Z7WCCQ@3\windows-jdk7-m3.5.x_build\target\invoker-reports\BUILD-mdep-450-project-with-ancestor.xml, f:\jenkins\jenkins-slave\workspace\-dependency-plugin_MDEP-625-3I6V7G3727HFCGSCWRQH5RTCWRSMXZQ3ZEOVZRI3U3XLP2Z7WCCQ@3\windows-jdk7-m3.5.x_build\target\invoker-reports\BUILD-mdep-450-project-without-ancestor.xml, f:\jenkins\jenkins-slave\workspace\-dependency-plugin_MDEP-625-3I6V7G3727HFCGSCWRQH5RTCWRSMXZQ3ZEOVZRI3U3XLP2Z7WCCQ@3\windows-jdk7-m3.5.x_build\target\invoker-reports\BUILD-mdep-506-dependency-without-version-in-depmgt.xml, f:\jenkins\jenkins-slave\workspace\-dependency-plugin_MDEP-625-3I6V7G3727HFCGSCWRQH5RTCWRSMXZQ3ZEOVZRI3U3XLP2Z7WCCQ@3\windows-jdk7-m3.5.x_build\target\invoker-reports\BUILD-mdep-571-resolve-java9.xml, f:\jenkins\jenkins-slave\workspace\-dependency-plugin_MDEP-625-3I6V7G3727HFCGSCWRQH5RTCWRSMXZQ3ZEOVZRI3U3XLP2Z7WCCQ@3\windows-jdk7-m3.5.x_build\target\invoker-reports\BUILD-mdep-572-unpack-tar-long-file.xml, f:\jenkins\jenkins-slave\workspace\-dependency-plugin_MDEP-625-3I6V7G3727HFCGSCWRQH5RTCWRSMXZQ3ZEOVZRI3U3XLP2Z7WCCQ@3\windows-jdk7-m3.5.x_build\target\invoker-reports\BUILD-mdep-578_display-reason-invalid-module.xml, f:\jenkins\jenkins-slave\workspace\-dependency-plugin_MDEP-625-3I6V7G3727HFCGSCWRQH5RTCWRSMXZQ3ZEOVZRI3U3XLP2Z7WCCQ@3\windows-jdk7-m3.5.x_build\target\invoker-reports\BUILD-mdep-580_display-manifest-automodules.xml, f:\jenkins\jenkins-slave\workspace\-dependency-plugin_MDEP-625-3I6V7G3727HFCGSCWRQH5RTCWRSMXZQ3ZEOVZRI3U3XLP2Z7WCCQ@3\windows-jdk7-m3.5.x_build\target\invoker-reports\BUILD-mdep-599-analyze-java9.xml, f:\jenkins\jenkins-slave\workspace\-dependency-plugin_MDEP-625-3I6V7G3727HFCGSCWRQH5RTCWRSMXZQ3ZEOVZRI3U3XLP2Z7WCCQ@3\windows-jdk7-m3.5.x_build\target\invoker-reports\BUILD-purge-local-repository-bad-dep.xml, f:\jenkins\jenkins-slave\workspace\-dependency-plugin_MDEP-625-3I6V7G3727HFCGSCWRQH5RTCWRSMXZQ3ZEOVZRI3U3XLP2Z7WCCQ@3\windows-jdk7-m3.5.x_build\target\invoker-reports\BUILD-purge-local-repository-include.xml, f:\jenkins\jenkins-slave\workspace\-dependency-plugin_MDEP-625-3I6V7G3727HFCGSCWRQH5RTCWRSMXZQ3ZEOVZRI3U3XLP2Z7WCCQ@3\windows-jdk7-m3.5.x_build\target\invoker-reports\BUILD-purge-local-repository-multi-module-execution.xml, f:\jenkins\jenkins-slave\workspace\-dependency-plugin_MDEP-625-3I6V7G3727HFCGSCWRQH5RTCWRSMXZQ3ZEOVZRI3U3XLP2Z7WCCQ@3\windows-jdk7-m3.5.x_build\target\invoker-reports\BUILD-purge-local-repository-multi-module.xml, f:\jenkins\jenkins-slave\workspace\-dependency-plugin_MDEP-625-3I6V7G3727HFCGSCWRQH5RTCWRSMXZQ3ZEOVZRI3U3XLP2Z7WCCQ@3\windows-jdk7-m3.5.x_build\target\invoker-reports\BUILD-purge-local-repository-non-transitive.xml, f:\jenkins\jenkins-slave\workspace\-dependency-plugin_MDEP-625-3I6V7G3727HFCGSCWRQH5RTCWRSMXZQ3ZEOVZRI3U3XLP2Z7WCCQ@3\windows-jdk7-m3.5.x_build\target\invoker-reports\BUILD-purge-local-repository-reresolve.xml, f:\jenkins\jenkins-slave\workspace\-dependency-plugin_MDEP-625-3I6V7G3727HFCGSCWRQH5RTCWRSMXZQ3ZEOVZRI3U3XLP2Z7WCCQ@3\windows-jdk7-m3.5.x_build\target\invoker-reports\BUILD-purge-local-repository-snapshots-only.xml, f:\jenkins\jenkins-slave\workspace\-dependency-plugin_MDEP-625-3I6V7G3727HFCGSCWRQH5RTCWRSMXZQ3ZEOVZRI3U3XLP2Z7WCCQ@3\windows-jdk7-m3.5.x_build\target\invoker-reports\BUILD-purge-local-repository-version-range.xml, f:\jenkins\jenkins-slave\workspace\-dependency-plugin_MDEP-625-3I6V7G3727HFCGSCWRQH5RTCWRSMXZQ3ZEOVZRI3U3XLP2Z7WCCQ@3\windows-jdk7-m3.5.x_build\target\invoker-reports\BUILD-purge-local-repository-without-pom.xml, f:\jenkins\jenkins-slave\workspace\-dependency-plugin_MDEP-625-3I6V7G3727HFCGSCWRQH5RTCWRSMXZQ3ZEOVZRI3U3XLP2Z7WCCQ@3\windows-jdk7-m3.5.x_build\target\invoker-reports\BUILD-purge-local-repository.xml, f:\jenkins\jenkins-slave\workspace\-dependency-plugin_MDEP-625-3I6V7G3727HFCGSCWRQH5RTCWRSMXZQ3ZEOVZRI3U3XLP2Z7WCCQ@3\windows-jdk7-m3.5.x_build\target\invoker-reports\BUILD-resolve-plugins-exclude-reactor.xml, f:\jenkins\jenkins-slave\workspace\-dependency-plugin_MDEP-625-3I6V7G3727HFCGSCWRQH5RTCWRSMXZQ3ZEOVZRI3U3XLP2Z7WCCQ@3\windows-jdk7-m3.5.x_build\target\invoker-reports\BUILD-resolve-plugins-with-exclude.xml, f:\jenkins\jenkins-slave\workspace\-dependency-plugin_MDEP-625-3I6V7G3727HFCGSCWRQH5RTCWRSMXZQ3ZEOVZRI3U3XLP2Z7WCCQ@3\windows-jdk7-m3.5.x_build\target\invoker-reports\BUILD-resolve-plugins.xml, f:\jenkins\jenkins-slave\workspace\-dependency-plugin_MDEP-625-3I6V7G3727HFCGSCWRQH5RTCWRSMXZQ3ZEOVZRI3U3XLP2Z7WCCQ@3\windows-jdk7-m3.5.x_build\target\invoker-reports\BUILD-resolve.xml, f:\jenkins\jenkins-slave\workspace\-dependency-plugin_MDEP-625-3I6V7G3727HFCGSCWRQH5RTCWRSMXZQ3ZEOVZRI3U3XLP2Z7WCCQ@3\windows-jdk7-m3.5.x_build\target\invoker-reports\BUILD-setup-custom-ear-lifecycle.xml, f:\jenkins\jenkins-slave\workspace\-dependency-plugin_MDEP-625-3I6V7G3727HFCGSCWRQH5RTCWRSMXZQ3ZEOVZRI3U3XLP2Z7WCCQ@3\windows-jdk7-m3.5.x_build\target\invoker-reports\BUILD-sources.xml, f:\jenkins\jenkins-slave\workspace\-dependency-plugin_MDEP-625-3I6V7G3727HFCGSCWRQH5RTCWRSMXZQ3ZEOVZRI3U3XLP2Z7WCCQ@3\windows-jdk7-m3.5.x_build\target\invoker-reports\BUILD-tree-includes.xml, f:\jenkins\jenkins-slave\workspace\-dependency-plugin_MDEP-625-3I6V7G3727HFCGSCWRQH5RTCWRSMXZQ3ZEOVZRI3U3XLP2Z7WCCQ@3\windows-jdk7-m3.5.x_build\target\invoker-reports\BUILD-tree-multimodule.xml, f:\jenkins\jenkins-slave\workspace\-dependency-plugin_MDEP-625-3I6V7G3727HFCGSCWRQH5RTCWRSMXZQ3ZEOVZRI3U3XLP2Z7WCCQ@3\windows-jdk7-m3.5.x_build\target\invoker-reports\BUILD-tree.xml, f:\jenkins\jenkins-slave\workspace\-dependency-plugin_MDEP-625-3I6V7G3727HFCGSCWRQH5RTCWRSMXZQ3ZEOVZRI3U3XLP2Z7WCCQ@3\windows-jdk7-m3.5.x_build\target\invoker-reports\BUILD-unpack-cli.xml, f:\jenkins\jenkins-slave\workspace\-dependency-plugin_MDEP-625-3I6V7G3727HFCGSCWRQH5RTCWRSMXZQ3ZEOVZRI3U3XLP2Z7WCCQ@3\windows-jdk7-m3.5.x_build\target\invoker-reports\BUILD-unpack-custom-ear.xml, f:\jenkins\jenkins-slave\workspace\-dependency-plugin_MDEP-625-3I6V7G3727HFCGSCWRQH5RTCWRSMXZQ3ZEOVZRI3U3XLP2Z7WCCQ@3\windows-jdk7-m3.5.x_build\target\invoker-reports\BUILD-unpack-dependencies-with-filemappers.xml, f:\jenkins\jenkins-slave\workspace\-dependency-plugin_MDEP-625-3I6V7G3727HFCGSCWRQH5RTCWRSMXZQ3ZEOVZRI3U3XLP2Z7WCCQ@3\windows-jdk7-m3.5.x_build\target\invoker-reports\BUILD-unpack-dependencies.xml, f:\jenkins\jenkins-slave\workspace\-dependency-plugin_MDEP-625-3I6V7G3727HFCGSCWRQH5RTCWRSMXZQ3ZEOVZRI3U3XLP2Z7WCCQ@3\windows-jdk7-m3.5.x_build\target\invoker-reports\BUILD-unpack-from-remote-repository.xml, f:\jenkins\jenkins-slave\workspace\-dependency-plugin_MDEP-625-3I6V7G3727HFCGSCWRQH5RTCWRSMXZQ3ZEOVZRI3U3XLP2Z7WCCQ@3\windows-jdk7-m3.5.x_build\target\invoker-reports\BUILD-unpack.xml, f:\jenkins\jenkins-slave\workspace\-dependency-plugin_MDEP-625-3I6V7G3727HFCGSCWRQH5RTCWRSMXZQ3ZEOVZRI3U3XLP2Z7WCCQ@3\windows-jdk7-m3.5.x_build\target\invoker-reports\BUILD-used-dependencies.xml]
[windows-jdk7-m3.5.x_build] Found logs:[f:\jenkins\jenkins-slave\workspace\-dependency-plugin_MDEP-625-3I6V7G3727HFCGSCWRQH5RTCWRSMXZQ3ZEOVZRI3U3XLP2Z7WCCQ@3\windows-jdk7-m3.5.x_build\target\it\analyze-dep-mgt\build.log, f:\jenkins\jenkins-slave\workspace\-dependency-plugin_MDEP-625-3I6V7G3727HFCGSCWRQH5RTCWRSMXZQ3ZEOVZRI3U3XLP2Z7WCCQ@3\windows-jdk7-m3.5.x_build\target\it\analyze-ignore-dependency\build.log, f:\jenkins\jenkins-slave\workspace\-dependency-plugin_MDEP-625-3I6V7G3727HFCGSCWRQH5RTCWRSMXZQ3ZEOVZRI3U3XLP2Z7WCCQ@3\windows-jdk7-m3.5.x_build\target\it\analyze-ignore-unused-declared-dependency\build.log, f:\jenkins\jenkins-slave\workspace\-dependency-plugin_MDEP-625-3I6V7G3727HFCGSCWRQH5RTCWRSMXZQ3ZEOVZRI3U3XLP2Z7WCCQ@3\windows-jdk7-m3.5.x_build\target\it\analyze-ignore-used-undeclared-dependency\build.log, f:\jenkins\jenkins-slave\workspace\-dependency-plugin_MDEP-625-3I6V7G3727HFCGSCWRQH5RTCWRSMXZQ3ZEOVZRI3U3XLP2Z7WCCQ@3\windows-jdk7-m3.5.x_build\target\it\analyze-multimodule-project\build.log, f:\jenkins\jenkins-slave\workspace\-dependency-plugin_MDEP-625-3I6V7G3727HFCGSCWRQH5RTCWRSMXZQ3ZEOVZRI3U3XLP2Z7WCCQ@3\windows-jdk7-m3.5.x_build\target\it\analyze-report\build.log, f:\jenkins\jenkins-slave\workspace\-dependency-plugin_MDEP-625-3I6V7G3727HFCGSCWRQH5RTCWRSMXZQ3ZEOVZRI3U3XLP2Z7WCCQ@3\windows-jdk7-m3.5.x_build\target\it\analyze\build.log, f:\jenkins\jenkins-slave\workspace\-dependency-plugin_MDEP-625-3I6V7G3727HFCGSCWRQH5RTCWRSMXZQ3ZEOVZRI3U3XLP2Z7WCCQ@3\windows-jdk7-m3.5.x_build\target\it\build-classpath-output-file-and-property\build.log, f:\jenkins\jenkins-slave\workspace\-dependency-plugin_MDEP-625-3I6V7G3727HFCGSCWRQH5RTCWRSMXZQ3ZEOVZRI3U3XLP2Z7WCCQ@3\windows-jdk7-m3.5.x_build\target\it\build-classpath\build.log, f:\jenkins\jenkins-slave\workspace\-dependency-plugin_MDEP-625-3I6V7G3727HFCGSCWRQH5RTCWRSMXZQ3ZEOVZRI3U3XLP2Z7WCCQ@3\windows-jdk7-m3.5.x_build\target\it\collect\build.log, f:\jenkins\jenkins-slave\workspace\-dependency-plugin_MDEP-625-3I6V7G3727HFCGSCWRQH5RTCWRSMXZQ3ZEOVZRI3U3XLP2Z7WCCQ@3\windows-jdk7-m3.5.x_build\target\it\copy-and-unpack-with-alternate-local-repo\build.log, f:\jenkins\jenkins-slave\workspace\-dependency-plugin_MDEP-625-3I6V7G3727HFCGSCWRQH5RTCWRSMXZQ3ZEOVZRI3U3XLP2Z7WCCQ@3\windows-jdk7-m3.5.x_build\target\it\copy-cli\build.log, f:\jenkins\jenkins-slave\workspace\-dependency-plugin_MDEP-625-3I6V7G3727HFCGSCWRQH5RTCWRSMXZQ3ZEOVZRI3U3XLP2Z7WCCQ@3\windows-jdk7-m3.5.x_build\target\it\copy-dependencies\build.log, f:\jenkins\jenkins-slave\workspace\-dependency-plugin_MDEP-625-3I6V7G3727HFCGSCWRQH5RTCWRSMXZQ3ZEOVZRI3U3XLP2Z7WCCQ@3\windows-jdk7-m3.5.x_build\target\it\copy-from-reactor\build.log, f:\jenkins\jenkins-slave\workspace\-dependency-plugin_MDEP-625-3I6V7G3727HFCGSCWRQH5RTCWRSMXZQ3ZEOVZRI3U3XLP2Z7WCCQ@3\windows-jdk7-m3.5.x_build\target\it\copy-from-remote-repository\build.log, f:\jenkins\jenkins-slave\workspace\-dependency-plugin_MDEP-625-3I6V7G3727HFCGSCWRQH5RTCWRSMXZQ3ZEOVZRI3U3XLP2Z7WCCQ@3\windows-jdk7-m3.5.x_build\target\it\copy\build.log, f:\jenkins\jenkins-slave\workspace\-dependency-plugin_MDEP-625-3I6V7G3727HFCGSCWRQH5RTCWRSMXZQ3ZEOVZRI3U3XLP2Z7WCCQ@3\windows-jdk7-m3.5.x_build\target\it\dependency-properties\build.log, f:\jenkins\jenkins-slave\workspace\-dependency-plugin_MDEP-625-3I6V7G3727HFCGSCWRQH5RTCWRSMXZQ3ZEOVZRI3U3XLP2Z7WCCQ@3\windows-jdk7-m3.5.x_build\target\it\filterunpack\build.log, f:\jenkins\jenkins-slave\workspace\-dependency-plugin_MDEP-625-3I6V7G3727HFCGSCWRQH5RTCWRSMXZQ3ZEOVZRI3U3XLP2Z7WCCQ@3\windows-jdk7-m3.5.x_build\target\it\get-artifact-maven-plugin\build.log, f:\jenkins\jenkins-slave\workspace\-dependency-plugin_MDEP-625-3I6V7G3727HFCGSCWRQH5RTCWRSMXZQ3ZEOVZRI3U3XLP2Z7WCCQ@3\windows-jdk7-m3.5.x_build\target\it\get-artifact-no-transitive\build.log, f:\jenkins\jenkins-slave\workspace\-dependency-plugin_MDEP-625-3I6V7G3727HFCGSCWRQH5RTCWRSMXZQ3ZEOVZRI3U3XLP2Z7WCCQ@3\windows-jdk7-m3.5.x_build\target\it\get-artifact\build.log, f:\jenkins\jenkins-slave\workspace\-dependency-plugin_MDEP-625-3I6V7G3727HFCGSCWRQH5RTCWRSMXZQ3ZEOVZRI3U3XLP2Z7WCCQ@3\windows-jdk7-m3.5.x_build\target\it\get-gav\build.log, f:\jenkins\jenkins-slave\workspace\-dependency-plugin_MDEP-625-3I6V7G3727HFCGSCWRQH5RTCWRSMXZQ3ZEOVZRI3U3XLP2Z7WCCQ@3\windows-jdk7-m3.5.x_build\target\it\go-offline\build.log, f:\jenkins\jenkins-slave\workspace\-dependency-plugin_MDEP-625-3I6V7G3727HFCGSCWRQH5RTCWRSMXZQ3ZEOVZRI3U3XLP2Z7WCCQ@3\windows-jdk7-m3.5.x_build\target\it\list-repositories\build.log, f:\jenkins\jenkins-slave\workspace\-dependency-plugin_MDEP-625-3I6V7G3727HFCGSCWRQH5RTCWRSMXZQ3ZEOVZRI3U3XLP2Z7WCCQ@3\windows-jdk7-m3.5.x_build\target\it\mdep-450-project-with-ancestor\build.log, f:\jenkins\jenkins-slave\workspace\-dependency-plugin_MDEP-625-3I6V7G3727HFCGSCWRQH5RTCWRSMXZQ3ZEOVZRI3U3XLP2Z7WCCQ@3\windows-jdk7-m3.5.x_build\target\it\mdep-450-project-without-ancestor\build.log, f:\jenkins\jenkins-slave\workspace\-dependency-plugin_MDEP-625-3I6V7G3727HFCGSCWRQH5RTCWRSMXZQ3ZEOVZRI3U3XLP2Z7WCCQ@3\windows-jdk7-m3.5.x_build\target\it\mdep-506-dependency-without-version-in-depmgt\build.log, f:\jenkins\jenkins-slave\workspace\-dependency-plugin_MDEP-625-3I6V7G3727HFCGSCWRQH5RTCWRSMXZQ3ZEOVZRI3U3XLP2Z7WCCQ@3\windows-jdk7-m3.5.x_build\target\it\mdep-572-unpack-tar-long-file\build.log, f:\jenkins\jenkins-slave\workspace\-dependency-plugin_MDEP-625-3I6V7G3727HFCGSCWRQH5RTCWRSMXZQ3ZEOVZRI3U3XLP2Z7WCCQ@3\windows-jdk7-m3.5.x_build\target\it\purge-local-repository-bad-dep\build.log, f:\jenkins\jenkins-slave\workspace\-dependency-plugin_MDEP-625-3I6V7G3727HFCGSCWRQH5RTCWRSMXZQ3ZEOVZRI3U3XLP2Z7WCCQ@3\windows-jdk7-m3.5.x_build\target\it\purge-local-repository-include\build.log, f:\jenkins\jenkins-slave\workspace\-dependency-plugin_MDEP-625-3I6V7G3727HFCGSCWRQH5RTCWRSMXZQ3ZEOVZRI3U3XLP2Z7WCCQ@3\windows-jdk7-m3.5.x_build\target\it\purge-local-repository-multi-module-execution\build.log, f:\jenkins\jenkins-slave\workspace\-dependency-plugin_MDEP-625-3I6V7G3727HFCGSCWRQH5RTCWRSMXZQ3ZEOVZRI3U3XLP2Z7WCCQ@3\windows-jdk7-m3.5.x_build\target\it\purge-local-repository-multi-module\build.log, f:\jenkins\jenkins-slave\workspace\-dependency-plugin_MDEP-625-3I6V7G3727HFCGSCWRQH5RTCWRSMXZQ3ZEOVZRI3U3XLP2Z7WCCQ@3\windows-jdk7-m3.5.x_build\target\it\purge-local-repository-non-transitive\build.log, f:\jenkins\jenkins-slave\workspace\-dependency-plugin_MDEP-625-3I6V7G3727HFCGSCWRQH5RTCWRSMXZQ3ZEOVZRI3U3XLP2Z7WCCQ@3\windows-jdk7-m3.5.x_build\target\it\purge-local-repository-reresolve\build.log, f:\jenkins\jenkins-slave\workspace\-dependency-plugin_MDEP-625-3I6V7G3727HFCGSCWRQH5RTCWRSMXZQ3ZEOVZRI3U3XLP2Z7WCCQ@3\windows-jdk7-m3.5.x_build\target\it\purge-local-repository-snapshots-only\build.log, f:\jenkins\jenkins-slave\workspace\-dependency-plugin_MDEP-625-3I6V7G3727HFCGSCWRQH5RTCWRSMXZQ3ZEOVZRI3U3XLP2Z7WCCQ@3\windows-jdk7-m3.5.x_build\target\it\purge-local-repository-version-range\build.log, f:\jenkins\jenkins-slave\workspace\-dependency-plugin_MDEP-625-3I6V7G3727HFCGSCWRQH5RTCWRSMXZQ3ZEOVZRI3U3XLP2Z7WCCQ@3\windows-jdk7-m3.5.x_build\target\it\purge-local-repository-without-pom\build.log, f:\jenkins\jenkins-slave\workspace\-dependency-plugin_MDEP-625-3I6V7G3727HFCGSCWRQH5RTCWRSMXZQ3ZEOVZRI3U3XLP2Z7WCCQ@3\windows-jdk7-m3.5.x_build\target\it\purge-local-repository\build.log, f:\jenkins\jenkins-slave\workspace\-dependency-plugin_MDEP-625-3I6V7G3727HFCGSCWRQH5RTCWRSMXZQ3ZEOVZRI3U3XLP2Z7WCCQ@3\windows-jdk7-m3.5.x_build\target\it\resolve-plugins-exclude-reactor\build.log, f:\jenkins\jenkins-slave\workspace\-dependency-plugin_MDEP-625-3I6V7G3727HFCGSCWRQH5RTCWRSMXZQ3ZEOVZRI3U3XLP2Z7WCCQ@3\windows-jdk7-m3.5.x_build\target\it\resolve-plugins-with-exclude\build.log, f:\jenkins\jenkins-slave\workspace\-dependency-plugin_MDEP-625-3I6V7G3727HFCGSCWRQH5RTCWRSMXZQ3ZEOVZRI3U3XLP2Z7WCCQ@3\windows-jdk7-m3.5.x_build\target\it\resolve-plugins\build.log, f:\jenkins\jenkins-slave\workspace\-dependency-plugin_MDEP-625-3I6V7G3727HFCGSCWRQH5RTCWRSMXZQ3ZEOVZRI3U3XLP2Z7WCCQ@3\windows-jdk7-m3.5.x_build\target\it\resolve\build.log, f:\jenkins\jenkins-slave\workspace\-dependency-plugin_MDEP-625-3I6V7G3727HFCGSCWRQH5RTCWRSMXZQ3ZEOVZRI3U3XLP2Z7WCCQ@3\windows-jdk7-m3.5.x_build\target\it\setup-custom-ear-lifecycle\build.log, f:\jenkins\jenkins-slave\workspace\-dependency-plugin_MDEP-625-3I6V7G3727HFCGSCWRQH5RTCWRSMXZQ3ZEOVZRI3U3XLP2Z7WCCQ@3\windows-jdk7-m3.5.x_build\target\it\sources\build.log, f:\jenkins\jenkins-slave\workspace\-dependency-plugin_MDEP-625-3I6V7G3727HFCGSCWRQH5RTCWRSMXZQ3ZEOVZRI3U3XLP2Z7WCCQ@3\windows-jdk7-m3.5.x_build\target\it\tree-includes\build.log, f:\jenkins\jenkins-slave\workspace\-dependency-plugin_MDEP-625-3I6V7G3727HFCGSCWRQH5RTCWRSMXZQ3ZEOVZRI3U3XLP2Z7WCCQ@3\windows-jdk7-m3.5.x_build\target\it\tree-multimodule\build.log, f:\jenkins\jenkins-slave\workspace\-dependency-plugin_MDEP-625-3I6V7G3727HFCGSCWRQH5RTCWRSMXZQ3ZEOVZRI3U3XLP2Z7WCCQ@3\windows-jdk7-m3.5.x_build\target\it\unpack-cli\build.log, f:\jenkins\jenkins-slave\workspace\-dependency-plugin_MDEP-625-3I6V7G3727HFCGSCWRQH5RTCWRSMXZQ3ZEOVZRI3U3XLP2Z7WCCQ@3\windows-jdk7-m3.5.x_build\target\it\unpack-custom-ear\build.log, f:\jenkins\jenkins-slave\workspace\-dependency-plugin_MDEP-625-3I6V7G3727HFCGSCWRQH5RTCWRSMXZQ3ZEOVZRI3U3XLP2Z7WCCQ@3\windows-jdk7-m3.5.x_build\target\it\unpack-dependencies-with-filemappers\build.log, f:\jenkins\jenkins-slave\workspace\-dependency-plugin_MDEP-625-3I6V7G3727HFCGSCWRQH5RTCWRSMXZQ3ZEOVZRI3U3XLP2Z7WCCQ@3\windows-jdk7-m3.5.x_build\target\it\unpack-dependencies\build.log, f:\jenkins\jenkins-slave\workspace\-dependency-plugin_MDEP-625-3I6V7G3727HFCGSCWRQH5RTCWRSMXZQ3ZEOVZRI3U3XLP2Z7WCCQ@3\windows-jdk7-m3.5.x_build\target\it\unpack-from-remote-repository\build.log, f:\jenkins\jenkins-slave\workspace\-dependency-plugin_MDEP-625-3I6V7G3727HFCGSCWRQH5RTCWRSMXZQ3ZEOVZRI3U3XLP2Z7WCCQ@3\windows-jdk7-m3.5.x_build\target\it\unpack\build.log, f:\jenkins\jenkins-slave\workspace\-dependency-plugin_MDEP-625-3I6V7G3727HFCGSCWRQH5RTCWRSMXZQ3ZEOVZRI3U3XLP2Z7WCCQ@3\windows-jdk7-m3.5.x_build\target\it\used-dependencies\build.log]
[windows-jdk7-m3.5.x_build] Finished parsing Maven Invoker results (found 59)
[windows-jdk7-m3.5.x_build] [withMaven] junitPublisher - Archive test results for Maven artifact org.apache.maven.plugins:maven-dependency-plugin:3.1.2-SNAPSHOT generated by maven-surefire-plugin:test (default-test): windows-jdk7-m3.5.x_build\target\surefire-reports\*.xml
[windows-jdk7-m3.5.x_build] Recording test results
[windows-jdk7-m3.5.x_build] [withMaven] openTasksPublisher - Scan Tasks for Maven artifact org.apache.maven.plugins:maven-dependency-plugin:3.1.2-SNAPSHOT in source directory windows-jdk7-m3.5.x_build\src\main\java
[windows-jdk7-m3.5.x_build] [TASKS] Scanning folder 'f:\jenkins\jenkins-slave\workspace\-dependency-plugin_MDEP-625-3I6V7G3727HFCGSCWRQH5RTCWRSMXZQ3ZEOVZRI3U3XLP2Z7WCCQ@3' for files matching the pattern 'windows-jdk7-m3.5.x_build\src\main\java\**\*' - excludes: null
[windows-jdk7-m3.5.x_build] [TASKS] Found 48 files to scan for tasks
[windows-jdk7-m3.5.x_build] [TASKS] Found 4 open tasks.
[windows-jdk7-m3.5.x_build] Skipping warnings blame since pipelines do not have an SCM link.%n
[Pipeline] [windows-jdk7-m3.5.x_build] // withMaven
[Pipeline] [windows-jdk7-m3.5.x_build] cleanWs
[Pipeline] [windows-jdk11-m3.5.x_build] cleanWs
[windows-jdk7-m3.5.x_build] [WS-CLEANUP] Deleting project workspace...[WS-CLEANUP] done
[windows-jdk11-m3.5.x_build] [WS-CLEANUP] Deleting project workspace...[WS-CLEANUP] done
[Pipeline] [windows-jdk11-m3.5.x_build] }
[Pipeline] [windows-jdk11-m3.5.x_build] // stage
[Pipeline] [windows-jdk11-m3.5.x_build] }
[Pipeline] [windows-jdk7-m3.5.x_build] cleanWs
[Pipeline] [windows-jdk11-m3.5.x_build] // ws
[windows-jdk7-m3.5.x_build] [WS-CLEANUP] Deleting project workspace...[WS-CLEANUP] done
[Pipeline] [windows-jdk11-m3.5.x_build] }
[Pipeline] [windows-jdk11-m3.5.x_build] // node
[Pipeline] [windows-jdk11-m3.5.x_build] }
[windows-jdk11-m3.5.x_build] Failed in branch windows-jdk11-m3.5.x_build
[Pipeline] [windows-jdk7-m3.5.x_build] }
[Pipeline] [windows-jdk7-m3.5.x_build] // stage
[Pipeline] [windows-jdk7-m3.5.x_build] }
[Pipeline] [windows-jdk7-m3.5.x_build] // ws
[Pipeline] [windows-jdk7-m3.5.x_build] }
[Pipeline] [windows-jdk7-m3.5.x_build] // node
[Pipeline] [windows-jdk7-m3.5.x_build] }
[windows-jdk7-m3.5.x_build] Failed in branch windows-jdk7-m3.5.x_build
[windows-jdk9-m3.5.x_build] [INFO] run post-build script verify.bsh
[windows-jdk9-m3.5.x_build] [INFO]           unpack-cli\pom.xml ............................... SUCCESS (6.2 s)
[windows-jdk9-m3.5.x_build] [INFO] Building: unpack-custom-ear\pom.xml
[windows-jdk9-m3.5.x_build] [INFO] run post-build script verify.groovy
[windows-jdk9-m3.5.x_build] [INFO]           unpack-custom-ear\pom.xml ........................ SUCCESS (6.3 s)
[windows-jdk9-m3.5.x_build] [INFO] Building: unpack-dependencies\pom.xml
[windows-jdk9-m3.5.x_build] [INFO] run post-build script verify.groovy
[windows-jdk9-m3.5.x_build] [INFO]           unpack-dependencies\pom.xml ...................... SUCCESS (10.2 s)
[windows-jdk9-m3.5.x_build] [INFO] Building: unpack-dependencies-with-filemappers\pom.xml
[windows-jdk9-m3.5.x_build] [INFO] run post-build script verify.groovy
[windows-jdk9-m3.5.x_build] [INFO]           unpack-dependencies-with-filemappers\pom.xml ..... SUCCESS (8.8 s)
[windows-jdk9-m3.5.x_build] [INFO] Building: unpack-from-remote-repository\pom.xml
[windows-jdk9-m3.5.x_build] [INFO] run pre-build script setup.bsh
[windows-jdk9-m3.5.x_build] [INFO] artifact org.apache.maven.its.dependency.fake-remote-unpack:1.0: checking for updates from central
[windows-jdk9-m3.5.x_build] [INFO] org.apache.maven.its.dependency.fake-remote-unpack.1.0: checking for updates from central
[windows-jdk9-m3.5.x_build] [INFO] run post-build script verify.bsh
[windows-jdk9-m3.5.x_build] [INFO]           unpack-from-remote-repository\pom.xml ............ SUCCESS (7.4 s)
[windows-jdk9-m3.5.x_build] [INFO] Building: used-dependencies\pom.xml
[windows-jdk9-m3.5.x_build] [INFO]           used-dependencies\pom.xml ........................ SUCCESS (7.7 s)
[windows-jdk9-m3.5.x_build] [INFO] Building: purge-local-repository-without-pom
[windows-jdk9-m3.5.x_build] [INFO] run pre-build script setup.bsh
[windows-jdk9-m3.5.x_build] [INFO] run post-build script verify.bsh
[windows-jdk9-m3.5.x_build] [INFO]           purge-local-repository-without-pom ............... SUCCESS (6.0 s)
[windows-jdk9-m3.5.x_build] [INFO] 
[windows-jdk9-m3.5.x_build] [INFO] --- mrm-maven-plugin:1.0.0:stop (default) @ maven-dependency-plugin ---
[windows-jdk9-m3.5.x_build] [INFO] Stopping Mock Repository Manager on http://localhost:61787
[windows-jdk9-m3.5.x_build] [INFO] Mock Repository Manager http://localhost:61787 is stopped.
[windows-jdk9-m3.5.x_build] [INFO] 
[windows-jdk9-m3.5.x_build] [INFO] --- maven-checkstyle-plugin:3.0.0:check (checkstyle-check) @ maven-dependency-plugin ---
[windows-jdk9-m3.5.x_build] [INFO] Downloading from central: https://repo.maven.apache.org/maven2/org/apache/maven/shared/maven-shared-resources/2/maven-shared-resources-2.pom
[windows-jdk9-m3.5.x_build] [INFO] Downloaded from central: https://repo.maven.apache.org/maven2/org/apache/maven/shared/maven-shared-resources/2/maven-shared-resources-2.pom (3.0 kB at 31 kB/s)
[windows-jdk9-m3.5.x_build] [INFO] Downloading from central: https://repo.maven.apache.org/maven2/org/apache/maven/doxia/doxia-integration-tools/1.6/doxia-integration-tools-1.6.pom
[windows-jdk9-m3.5.x_build] [INFO] Downloaded from central: https://repo.maven.apache.org/maven2/org/apache/maven/doxia/doxia-integration-tools/1.6/doxia-integration-tools-1.6.pom (7.0 kB at 188 kB/s)
[windows-jdk9-m3.5.x_build] [INFO] Downloading from central: https://repo.maven.apache.org/maven2/org/apache/maven/doxia/doxia-tools/3/doxia-tools-3.pom
[windows-jdk9-m3.5.x_build] [INFO] Downloaded from central: https://repo.maven.apache.org/maven2/org/apache/maven/doxia/doxia-tools/3/doxia-tools-3.pom (9.9 kB at 268 kB/s)
[windows-jdk9-m3.5.x_build] [INFO] Downloading from central: https://repo.maven.apache.org/maven2/org/codehaus/plexus/plexus-resources/1.1.0/plexus-resources-1.1.0.pom
[windows-jdk9-m3.5.x_build] [INFO] Downloaded from central: https://repo.maven.apache.org/maven2/org/codehaus/plexus/plexus-resources/1.1.0/plexus-resources-1.1.0.pom (3.2 kB at 96 kB/s)
[windows-jdk9-m3.5.x_build] [INFO] Downloading from central: https://repo.maven.apache.org/maven2/com/puppycrawl/tools/checkstyle/6.18/checkstyle-6.18.pom
[windows-jdk9-m3.5.x_build] [INFO] Downloaded from central: https://repo.maven.apache.org/maven2/com/puppycrawl/tools/checkstyle/6.18/checkstyle-6.18.pom (71 kB at 1.3 MB/s)
[windows-jdk9-m3.5.x_build] [INFO] Downloading from central: https://repo.maven.apache.org/maven2/antlr/antlr/2.7.7/antlr-2.7.7.pom
[windows-jdk9-m3.5.x_build] [INFO] Downloaded from central: https://repo.maven.apache.org/maven2/antlr/antlr/2.7.7/antlr-2.7.7.pom (632 B at 21 kB/s)
[windows-jdk9-m3.5.x_build] [INFO] Downloading from central: https://repo.maven.apache.org/maven2/org/antlr/antlr4-runtime/4.5.3/antlr4-runtime-4.5.3.pom
[windows-jdk9-m3.5.x_build] [INFO] Downloaded from central: https://repo.maven.apache.org/maven2/org/antlr/antlr4-runtime/4.5.3/antlr4-runtime-4.5.3.pom (2.3 kB at 70 kB/s)
[windows-jdk9-m3.5.x_build] [INFO] Downloading from central: https://repo.maven.apache.org/maven2/org/antlr/antlr4-master/4.5.3/antlr4-master-4.5.3.pom
[windows-jdk9-m3.5.x_build] [INFO] Downloaded from central: https://repo.maven.apache.org/maven2/org/antlr/antlr4-master/4.5.3/antlr4-master-4.5.3.pom (3.7 kB at 119 kB/s)
[windows-jdk9-m3.5.x_build] [INFO] Downloading from central: https://repo.maven.apache.org/maven2/commons-beanutils/commons-beanutils/1.9.2/commons-beanutils-1.9.2.pom
[windows-jdk9-m3.5.x_build] [INFO] Downloaded from central: https://repo.maven.apache.org/maven2/commons-beanutils/commons-beanutils/1.9.2/commons-beanutils-1.9.2.pom (14 kB at 421 kB/s)
[windows-jdk9-m3.5.x_build] [INFO] Downloading from central: https://repo.maven.apache.org/maven2/commons-cli/commons-cli/1.3.1/commons-cli-1.3.1.pom
[windows-jdk9-m3.5.x_build] [INFO] Downloaded from central: https://repo.maven.apache.org/maven2/commons-cli/commons-cli/1.3.1/commons-cli-1.3.1.pom (10 kB at 260 kB/s)
[windows-jdk9-m3.5.x_build] [INFO] Downloading from central: https://repo.maven.apache.org/maven2/com/google/guava/guava/19.0/guava-19.0.pom
[windows-jdk9-m3.5.x_build] [INFO] Downloaded from central: https://repo.maven.apache.org/maven2/com/google/guava/guava/19.0/guava-19.0.pom (6.8 kB at 194 kB/s)
[windows-jdk9-m3.5.x_build] [INFO] Downloading from central: https://repo.maven.apache.org/maven2/com/google/guava/guava-parent/19.0/guava-parent-19.0.pom
[windows-jdk9-m3.5.x_build] [INFO] Downloaded from central: https://repo.maven.apache.org/maven2/com/google/guava/guava-parent/19.0/guava-parent-19.0.pom (9.9 kB at 299 kB/s)
[windows-jdk9-m3.5.x_build] [INFO] Downloading from central: https://repo.maven.apache.org/maven2/org/sonatype/oss/oss-parent/7/oss-parent-7.pom
[windows-jdk9-m3.5.x_build] [INFO] Downloaded from central: https://repo.maven.apache.org/maven2/org/sonatype/oss/oss-parent/7/oss-parent-7.pom (4.8 kB at 130 kB/s)
[windows-jdk9-m3.5.x_build] [INFO] Downloading from central: https://repo.maven.apache.org/maven2/javax/xml/bind/jaxb-api/2.3.0/jaxb-api-2.3.0.pom
[windows-jdk9-m3.5.x_build] [INFO] Downloaded from central: https://repo.maven.apache.org/maven2/javax/xml/bind/jaxb-api/2.3.0/jaxb-api-2.3.0.pom (23 kB at 561 kB/s)
[windows-jdk9-m3.5.x_build] [INFO] Downloading from central: https://repo.maven.apache.org/maven2/javax/xml/bind/jaxb-api-parent/2.3.0/jaxb-api-parent-2.3.0.pom
[windows-jdk9-m3.5.x_build] [INFO] Downloaded from central: https://repo.maven.apache.org/maven2/javax/xml/bind/jaxb-api-parent/2.3.0/jaxb-api-parent-2.3.0.pom (5.6 kB at 161 kB/s)
[windows-jdk9-m3.5.x_build] [INFO] Downloading from central: https://repo.maven.apache.org/maven2/net/java/jvnet-parent/5/jvnet-parent-5.pom
[windows-jdk9-m3.5.x_build] [INFO] Downloaded from central: https://repo.maven.apache.org/maven2/net/java/jvnet-parent/5/jvnet-parent-5.pom (8.9 kB at 253 kB/s)
[windows-jdk9-m3.5.x_build] [INFO] Downloading from central: https://repo.maven.apache.org/maven2/org/apache/maven/shared/maven-shared-resources/2/maven-shared-resources-2.jar
[windows-jdk9-m3.5.x_build] [INFO] Downloading from central: https://repo.maven.apache.org/maven2/org/codehaus/plexus/plexus-resources/1.1.0/plexus-resources-1.1.0.jar
[windows-jdk9-m3.5.x_build] [INFO] Downloading from central: https://repo.maven.apache.org/maven2/com/puppycrawl/tools/checkstyle/6.18/checkstyle-6.18.jar
[windows-jdk9-m3.5.x_build] [INFO] Downloading from central: https://repo.maven.apache.org/maven2/org/apache/maven/doxia/doxia-integration-tools/1.6/doxia-integration-tools-1.6.jar
[windows-jdk9-m3.5.x_build] [INFO] Downloading from central: https://repo.maven.apache.org/maven2/commons-io/commons-io/1.4/commons-io-1.4.jar
[windows-jdk9-m3.5.x_build] [INFO] Downloaded from central: https://repo.maven.apache.org/maven2/commons-io/commons-io/1.4/commons-io-1.4.jar (109 kB at 965 kB/s)
[windows-jdk9-m3.5.x_build] [INFO] Downloading from central: https://repo.maven.apache.org/maven2/antlr/antlr/2.7.7/antlr-2.7.7.jar
[windows-jdk9-m3.5.x_build] [INFO] Downloaded from central: https://repo.maven.apache.org/maven2/org/apache/maven/shared/maven-shared-resources/2/maven-shared-resources-2.jar (13 kB at 101 kB/s)
[windows-jdk9-m3.5.x_build] [INFO] Downloading from central: https://repo.maven.apache.org/maven2/org/antlr/antlr4-runtime/4.5.3/antlr4-runtime-4.5.3.jar
[windows-jdk9-m3.5.x_build] [INFO] Downloaded from central: https://repo.maven.apache.org/maven2/com/puppycrawl/tools/checkstyle/6.18/checkstyle-6.18.jar (1.2 MB at 7.2 MB/s)
[windows-jdk9-m3.5.x_build] [INFO] Downloading from central: https://repo.maven.apache.org/maven2/commons-beanutils/commons-beanutils/1.9.2/commons-beanutils-1.9.2.jar
[windows-jdk9-m3.5.x_build] [INFO] Downloaded from central: https://repo.maven.apache.org/maven2/antlr/antlr/2.7.7/antlr-2.7.7.jar (445 kB at 2.3 MB/s)
[windows-jdk9-m3.5.x_build] [INFO] Downloading from central: https://repo.maven.apache.org/maven2/commons-cli/commons-cli/1.3.1/commons-cli-1.3.1.jar
[windows-jdk9-m3.5.x_build] [INFO] Downloaded from central: https://repo.maven.apache.org/maven2/org/codehaus/plexus/plexus-resources/1.1.0/plexus-resources-1.1.0.jar (23 kB at 117 kB/s)
[windows-jdk9-m3.5.x_build] [INFO] Downloading from central: https://repo.maven.apache.org/maven2/com/google/guava/guava/19.0/guava-19.0.jar
[windows-jdk9-m3.5.x_build] [INFO] Downloaded from central: https://repo.maven.apache.org/maven2/commons-beanutils/commons-beanutils/1.9.2/commons-beanutils-1.9.2.jar (234 kB at 1.1 MB/s)
[windows-jdk9-m3.5.x_build] [INFO] Downloading from central: https://repo.maven.apache.org/maven2/javax/xml/bind/jaxb-api/2.3.0/jaxb-api-2.3.0.jar
[windows-jdk9-m3.5.x_build] [INFO] Downloaded from central: https://repo.maven.apache.org/maven2/org/antlr/antlr4-runtime/4.5.3/antlr4-runtime-4.5.3.jar (302 kB at 1.4 MB/s)
[windows-jdk9-m3.5.x_build] [INFO] Downloaded from central: https://repo.maven.apache.org/maven2/commons-cli/commons-cli/1.3.1/commons-cli-1.3.1.jar (53 kB at 227 kB/s)
[windows-jdk9-m3.5.x_build] [INFO] Downloaded from central: https://repo.maven.apache.org/maven2/javax/xml/bind/jaxb-api/2.3.0/jaxb-api-2.3.0.jar (126 kB at 480 kB/s)
[windows-jdk9-m3.5.x_build] [INFO] Downloaded from central: https://repo.maven.apache.org/maven2/com/google/guava/guava/19.0/guava-19.0.jar (2.3 MB at 7.3 MB/s)
[windows-jdk9-m3.5.x_build] [INFO] Downloaded from central: https://repo.maven.apache.org/maven2/org/apache/maven/doxia/doxia-integration-tools/1.6/doxia-integration-tools-1.6.jar (45 kB at 136 kB/s)
[windows-jdk9-m3.5.x_build] [INFO] There is 1 error reported by Checkstyle 6.18 with config/maven_checks.xml ruleset.
[windows-jdk9-m3.5.x_build] [INFO] Ignored 1 error, 0 violation remaining.
[windows-jdk9-m3.5.x_build] [INFO] 
[windows-jdk9-m3.5.x_build] [INFO] --- maven-invoker-plugin:3.1.0:verify (integration-test) @ maven-dependency-plugin ---
[windows-jdk9-m3.5.x_build] [INFO] -------------------------------------------------
[windows-jdk9-m3.5.x_build] [INFO] Build Summary:
[windows-jdk9-m3.5.x_build] [INFO]   Passed: 51, Failed: 7, Errors: 0, Skipped: 1
[windows-jdk9-m3.5.x_build] [INFO] -------------------------------------------------
[windows-jdk9-m3.5.x_build] [ERROR] The following builds failed:
[windows-jdk9-m3.5.x_build] [ERROR] *  get-artifact-maven-plugin\pom.xml
[windows-jdk9-m3.5.x_build] [ERROR] *  get-artifact\pom.xml
[windows-jdk9-m3.5.x_build] [ERROR] *  get-gav\pom.xml
[windows-jdk9-m3.5.x_build] [ERROR] *  go-offline\pom.xml
[windows-jdk9-m3.5.x_build] [ERROR] *  resolve-plugins-exclude-reactor\pom.xml
[windows-jdk9-m3.5.x_build] [ERROR] *  resolve-plugins-with-exclude\pom.xml
[windows-jdk9-m3.5.x_build] [ERROR] *  resolve-plugins\pom.xml
[windows-jdk9-m3.5.x_build] [INFO] -------------------------------------------------
[windows-jdk9-m3.5.x_build] [INFO] ------------------------------------------------------------------------
[windows-jdk9-m3.5.x_build] [INFO] BUILD FAILURE
[windows-jdk9-m3.5.x_build] [INFO] ------------------------------------------------------------------------
[windows-jdk9-m3.5.x_build] [INFO] Total time: 24:39 min
[windows-jdk9-m3.5.x_build] [INFO] Finished at: 2018-12-08T05:50:40-08:00
[windows-jdk9-m3.5.x_build] [INFO] Final Memory: 52M/175M
[windows-jdk9-m3.5.x_build] [INFO] ------------------------------------------------------------------------
[windows-jdk9-m3.5.x_build] [INFO] [jenkins-event-spy] Generated F:\jenkins\jenkins-slave\workspace\-dependency-plugin_MDEP-625-3I6V7G3727HFCGSCWRQH5RTCWRSMXZQ3ZEOVZRI3U3XLP2Z7WCCQ@2@tmp\withMaven1ccd69f9\maven-spy-20181208-052601-87987649382112645398.log
[windows-jdk9-m3.5.x_build] [ERROR] Failed to execute goal org.apache.maven.plugins:maven-invoker-plugin:3.1.0:verify (integration-test) on project maven-dependency-plugin: 7 builds failed. See console output above for details. -> [Help 1]
[windows-jdk9-m3.5.x_build] org.apache.maven.lifecycle.LifecycleExecutionException: Failed to execute goal org.apache.maven.plugins:maven-invoker-plugin:3.1.0:verify (integration-test) on project maven-dependency-plugin: 7 builds failed. See console output above for details.
[windows-jdk9-m3.5.x_build]     at org.apache.maven.lifecycle.internal.MojoExecutor.execute (MojoExecutor.java:213)
[windows-jdk9-m3.5.x_build]     at org.apache.maven.lifecycle.internal.MojoExecutor.execute (MojoExecutor.java:154)
[windows-jdk9-m3.5.x_build]     at org.apache.maven.lifecycle.internal.MojoExecutor.execute (MojoExecutor.java:146)
[windows-jdk9-m3.5.x_build]     at org.apache.maven.lifecycle.internal.LifecycleModuleBuilder.buildProject (LifecycleModuleBuilder.java:117)
[windows-jdk9-m3.5.x_build]     at org.apache.maven.lifecycle.internal.LifecycleModuleBuilder.buildProject (LifecycleModuleBuilder.java:81)
[windows-jdk9-m3.5.x_build]     at org.apache.maven.lifecycle.internal.builder.singlethreaded.SingleThreadedBuilder.build (SingleThreadedBuilder.java:51)
[windows-jdk9-m3.5.x_build]     at org.apache.maven.lifecycle.internal.LifecycleStarter.execute (LifecycleStarter.java:128)
[windows-jdk9-m3.5.x_build]     at org.apache.maven.DefaultMaven.doExecute (DefaultMaven.java:309)
[windows-jdk9-m3.5.x_build]     at org.apache.maven.DefaultMaven.doExecute (DefaultMaven.java:194)
[windows-jdk9-m3.5.x_build]     at org.apache.maven.DefaultMaven.execute (DefaultMaven.java:107)
[windows-jdk9-m3.5.x_build]     at org.apache.maven.cli.MavenCli.execute (MavenCli.java:955)
[windows-jdk9-m3.5.x_build]     at org.apache.maven.cli.MavenCli.doMain (MavenCli.java:290)
[windows-jdk9-m3.5.x_build]     at org.apache.maven.cli.MavenCli.main (MavenCli.java:194)
[windows-jdk9-m3.5.x_build]     at jdk.internal.reflect.NativeMethodAccessorImpl.invoke0 (Native Method)
[windows-jdk9-m3.5.x_build]     at jdk.internal.reflect.NativeMethodAccessorImpl.invoke (NativeMethodAccessorImpl.java:62)
[windows-jdk9-m3.5.x_build]     at jdk.internal.reflect.DelegatingMethodAccessorImpl.invoke (DelegatingMethodAccessorImpl.java:43)
[windows-jdk9-m3.5.x_build]     at java.lang.reflect.Method.invoke (Method.java:564)
[windows-jdk9-m3.5.x_build]     at org.codehaus.plexus.classworlds.launcher.Launcher.launchEnhanced (Launcher.java:289)
[windows-jdk9-m3.5.x_build]     at org.codehaus.plexus.classworlds.launcher.Launcher.launch (Launcher.java:229)
[windows-jdk9-m3.5.x_build]     at org.codehaus.plexus.classworlds.launcher.Launcher.mainWithExitCode (Launcher.java:415)
[windows-jdk9-m3.5.x_build]     at org.codehaus.plexus.classworlds.launcher.Launcher.main (Launcher.java:356)
[windows-jdk9-m3.5.x_build] Caused by: org.apache.maven.plugin.MojoFailureException: 7 builds failed. See console output above for details.
[windows-jdk9-m3.5.x_build]     at org.apache.maven.plugins.invoker.InvokerSession.handleFailures (InvokerSession.java:260)
[windows-jdk9-m3.5.x_build]     at org.apache.maven.plugins.invoker.VerifyMojo.execute (VerifyMojo.java:137)
[windows-jdk9-m3.5.x_build]     at org.apache.maven.plugin.DefaultBuildPluginManager.executeMojo (DefaultBuildPluginManager.java:134)
[windows-jdk9-m3.5.x_build]     at org.apache.maven.lifecycle.internal.MojoExecutor.execute (MojoExecutor.java:208)
[windows-jdk9-m3.5.x_build]     at org.apache.maven.lifecycle.internal.MojoExecutor.execute (MojoExecutor.java:154)
[windows-jdk9-m3.5.x_build]     at org.apache.maven.lifecycle.internal.MojoExecutor.execute (MojoExecutor.java:146)
[windows-jdk9-m3.5.x_build]     at org.apache.maven.lifecycle.internal.LifecycleModuleBuilder.buildProject (LifecycleModuleBuilder.java:117)
[windows-jdk9-m3.5.x_build]     at org.apache.maven.lifecycle.internal.LifecycleModuleBuilder.buildProject (LifecycleModuleBuilder.java:81)
[windows-jdk9-m3.5.x_build]     at org.apache.maven.lifecycle.internal.builder.singlethreaded.SingleThreadedBuilder.build (SingleThreadedBuilder.java:51)
[windows-jdk9-m3.5.x_build]     at org.apache.maven.lifecycle.internal.LifecycleStarter.execute (LifecycleStarter.java:128)
[windows-jdk9-m3.5.x_build]     at org.apache.maven.DefaultMaven.doExecute (DefaultMaven.java:309)
[windows-jdk9-m3.5.x_build]     at org.apache.maven.DefaultMaven.doExecute (DefaultMaven.java:194)
[windows-jdk9-m3.5.x_build]     at org.apache.maven.DefaultMaven.execute (DefaultMaven.java:107)
[windows-jdk9-m3.5.x_build]     at org.apache.maven.cli.MavenCli.execute (MavenCli.java:955)
[windows-jdk9-m3.5.x_build]     at org.apache.maven.cli.MavenCli.doMain (MavenCli.java:290)
[windows-jdk9-m3.5.x_build]     at org.apache.maven.cli.MavenCli.main (MavenCli.java:194)
[windows-jdk9-m3.5.x_build]     at jdk.internal.reflect.NativeMethodAccessorImpl.invoke0 (Native Method)
[windows-jdk9-m3.5.x_build]     at jdk.internal.reflect.NativeMethodAccessorImpl.invoke (NativeMethodAccessorImpl.java:62)
[windows-jdk9-m3.5.x_build]     at jdk.internal.reflect.DelegatingMethodAccessorImpl.invoke (DelegatingMethodAccessorImpl.java:43)
[windows-jdk9-m3.5.x_build]     at java.lang.reflect.Method.invoke (Method.java:564)
[windows-jdk9-m3.5.x_build]     at org.codehaus.plexus.classworlds.launcher.Launcher.launchEnhanced (Launcher.java:289)
[windows-jdk9-m3.5.x_build]     at org.codehaus.plexus.classworlds.launcher.Launcher.launch (Launcher.java:229)
[windows-jdk9-m3.5.x_build]     at org.codehaus.plexus.classworlds.launcher.Launcher.mainWithExitCode (Launcher.java:415)
[windows-jdk9-m3.5.x_build]     at org.codehaus.plexus.classworlds.launcher.Launcher.main (Launcher.java:356)
[windows-jdk9-m3.5.x_build] [ERROR] 
[windows-jdk9-m3.5.x_build] [ERROR] Re-run Maven using the -X switch to enable full debug logging.
[windows-jdk9-m3.5.x_build] [ERROR] 
[windows-jdk9-m3.5.x_build] [ERROR] For more information about the errors and possible solutions, please read the following articles:
[windows-jdk9-m3.5.x_build] [ERROR] [Help 1] http://cwiki.apache.org/confluence/display/MAVEN/MojoFailureException
[Pipeline] [windows-jdk9-m3.5.x_build] }
[Pipeline] [windows-jdk9-m3.5.x_build] // dir
[Pipeline] [windows-jdk9-m3.5.x_build] }
[windows-jdk9-m3.5.x_build] [Fast Archiver] No prior successful build to compare, so performing full copy of artifacts
[windows-jdk9-m3.5.x_build] [withMaven] invokerPublisher - Archive invoker results for Maven artifact MavenArtifact{org.apache.maven.plugins:maven-dependency-plugin::3.1.2-SNAPSHOT(version: 3.1.2-SNAPSHOT, snapshot:false) } generated by PluginInvocation{org.apache.maven.plugins:maven-invoker-plugin:3.1.0@integration-test  integration-test}: windows-jdk9-m3.5.x_build\target\invoker-reports\*.xml
[windows-jdk9-m3.5.x_build] performing MavenInvokerRecorder, reportsFilenamePattern:'**/windows-jdk9-m3.5.x_build\target\invoker-reports/BUILD*.xml', invokerBuildDir:'**/windows-jdk9-m3.5.x_build\target\it'
[windows-jdk9-m3.5.x_build] Found reports:[f:\jenkins\jenkins-slave\workspace\-dependency-plugin_MDEP-625-3I6V7G3727HFCGSCWRQH5RTCWRSMXZQ3ZEOVZRI3U3XLP2Z7WCCQ@2\windows-jdk9-m3.5.x_build\target\invoker-reports\BUILD-analyze-dep-mgt.xml, f:\jenkins\jenkins-slave\workspace\-dependency-plugin_MDEP-625-3I6V7G3727HFCGSCWRQH5RTCWRSMXZQ3ZEOVZRI3U3XLP2Z7WCCQ@2\windows-jdk9-m3.5.x_build\target\invoker-reports\BUILD-analyze-ignore-dependency.xml, f:\jenkins\jenkins-slave\workspace\-dependency-plugin_MDEP-625-3I6V7G3727HFCGSCWRQH5RTCWRSMXZQ3ZEOVZRI3U3XLP2Z7WCCQ@2\windows-jdk9-m3.5.x_build\target\invoker-reports\BUILD-analyze-ignore-unused-declared-dependency.xml, f:\jenkins\jenkins-slave\workspace\-dependency-plugin_MDEP-625-3I6V7G3727HFCGSCWRQH5RTCWRSMXZQ3ZEOVZRI3U3XLP2Z7WCCQ@2\windows-jdk9-m3.5.x_build\target\invoker-reports\BUILD-analyze-ignore-used-undeclared-dependency.xml, f:\jenkins\jenkins-slave\workspace\-dependency-plugin_MDEP-625-3I6V7G3727HFCGSCWRQH5RTCWRSMXZQ3ZEOVZRI3U3XLP2Z7WCCQ@2\windows-jdk9-m3.5.x_build\target\invoker-reports\BUILD-analyze-multimodule-project.xml, f:\jenkins\jenkins-slave\workspace\-dependency-plugin_MDEP-625-3I6V7G3727HFCGSCWRQH5RTCWRSMXZQ3ZEOVZRI3U3XLP2Z7WCCQ@2\windows-jdk9-m3.5.x_build\target\invoker-reports\BUILD-analyze-report.xml, f:\jenkins\jenkins-slave\workspace\-dependency-plugin_MDEP-625-3I6V7G3727HFCGSCWRQH5RTCWRSMXZQ3ZEOVZRI3U3XLP2Z7WCCQ@2\windows-jdk9-m3.5.x_build\target\invoker-reports\BUILD-analyze.xml, f:\jenkins\jenkins-slave\workspace\-dependency-plugin_MDEP-625-3I6V7G3727HFCGSCWRQH5RTCWRSMXZQ3ZEOVZRI3U3XLP2Z7WCCQ@2\windows-jdk9-m3.5.x_build\target\invoker-reports\BUILD-build-classpath-output-file-and-property.xml, f:\jenkins\jenkins-slave\workspace\-dependency-plugin_MDEP-625-3I6V7G3727HFCGSCWRQH5RTCWRSMXZQ3ZEOVZRI3U3XLP2Z7WCCQ@2\windows-jdk9-m3.5.x_build\target\invoker-reports\BUILD-build-classpath.xml, f:\jenkins\jenkins-slave\workspace\-dependency-plugin_MDEP-625-3I6V7G3727HFCGSCWRQH5RTCWRSMXZQ3ZEOVZRI3U3XLP2Z7WCCQ@2\windows-jdk9-m3.5.x_build\target\invoker-reports\BUILD-collect.xml, f:\jenkins\jenkins-slave\workspace\-dependency-plugin_MDEP-625-3I6V7G3727HFCGSCWRQH5RTCWRSMXZQ3ZEOVZRI3U3XLP2Z7WCCQ@2\windows-jdk9-m3.5.x_build\target\invoker-reports\BUILD-copy-and-unpack-with-alternate-local-repo.xml, f:\jenkins\jenkins-slave\workspace\-dependency-plugin_MDEP-625-3I6V7G3727HFCGSCWRQH5RTCWRSMXZQ3ZEOVZRI3U3XLP2Z7WCCQ@2\windows-jdk9-m3.5.x_build\target\invoker-reports\BUILD-copy-cli.xml, f:\jenkins\jenkins-slave\workspace\-dependency-plugin_MDEP-625-3I6V7G3727HFCGSCWRQH5RTCWRSMXZQ3ZEOVZRI3U3XLP2Z7WCCQ@2\windows-jdk9-m3.5.x_build\target\invoker-reports\BUILD-copy-dependencies.xml, f:\jenkins\jenkins-slave\workspace\-dependency-plugin_MDEP-625-3I6V7G3727HFCGSCWRQH5RTCWRSMXZQ3ZEOVZRI3U3XLP2Z7WCCQ@2\windows-jdk9-m3.5.x_build\target\invoker-reports\BUILD-copy-from-reactor.xml, f:\jenkins\jenkins-slave\workspace\-dependency-plugin_MDEP-625-3I6V7G3727HFCGSCWRQH5RTCWRSMXZQ3ZEOVZRI3U3XLP2Z7WCCQ@2\windows-jdk9-m3.5.x_build\target\invoker-reports\BUILD-copy-from-remote-repository.xml, f:\jenkins\jenkins-slave\workspace\-dependency-plugin_MDEP-625-3I6V7G3727HFCGSCWRQH5RTCWRSMXZQ3ZEOVZRI3U3XLP2Z7WCCQ@2\windows-jdk9-m3.5.x_build\target\invoker-reports\BUILD-copy.xml, f:\jenkins\jenkins-slave\workspace\-dependency-plugin_MDEP-625-3I6V7G3727HFCGSCWRQH5RTCWRSMXZQ3ZEOVZRI3U3XLP2Z7WCCQ@2\windows-jdk9-m3.5.x_build\target\invoker-reports\BUILD-dependency-properties.xml, f:\jenkins\jenkins-slave\workspace\-dependency-plugin_MDEP-625-3I6V7G3727HFCGSCWRQH5RTCWRSMXZQ3ZEOVZRI3U3XLP2Z7WCCQ@2\windows-jdk9-m3.5.x_build\target\invoker-reports\BUILD-filterunpack.xml, f:\jenkins\jenkins-slave\workspace\-dependency-plugin_MDEP-625-3I6V7G3727HFCGSCWRQH5RTCWRSMXZQ3ZEOVZRI3U3XLP2Z7WCCQ@2\windows-jdk9-m3.5.x_build\target\invoker-reports\BUILD-get-artifact-maven-plugin.xml, f:\jenkins\jenkins-slave\workspace\-dependency-plugin_MDEP-625-3I6V7G3727HFCGSCWRQH5RTCWRSMXZQ3ZEOVZRI3U3XLP2Z7WCCQ@2\windows-jdk9-m3.5.x_build\target\invoker-reports\BUILD-get-artifact-no-transitive.xml, f:\jenkins\jenkins-slave\workspace\-dependency-plugin_MDEP-625-3I6V7G3727HFCGSCWRQH5RTCWRSMXZQ3ZEOVZRI3U3XLP2Z7WCCQ@2\windows-jdk9-m3.5.x_build\target\invoker-reports\BUILD-get-artifact.xml, f:\jenkins\jenkins-slave\workspace\-dependency-plugin_MDEP-625-3I6V7G3727HFCGSCWRQH5RTCWRSMXZQ3ZEOVZRI3U3XLP2Z7WCCQ@2\windows-jdk9-m3.5.x_build\target\invoker-reports\BUILD-get-gav.xml, f:\jenkins\jenkins-slave\workspace\-dependency-plugin_MDEP-625-3I6V7G3727HFCGSCWRQH5RTCWRSMXZQ3ZEOVZRI3U3XLP2Z7WCCQ@2\windows-jdk9-m3.5.x_build\target\invoker-reports\BUILD-go-offline.xml, f:\jenkins\jenkins-slave\workspace\-dependency-plugin_MDEP-625-3I6V7G3727HFCGSCWRQH5RTCWRSMXZQ3ZEOVZRI3U3XLP2Z7WCCQ@2\windows-jdk9-m3.5.x_build\target\invoker-reports\BUILD-list-repositories.xml, f:\jenkins\jenkins-slave\workspace\-dependency-plugin_MDEP-625-3I6V7G3727HFCGSCWRQH5RTCWRSMXZQ3ZEOVZRI3U3XLP2Z7WCCQ@2\windows-jdk9-m3.5.x_build\target\invoker-reports\BUILD-mdep-439-analyze-java8.xml, f:\jenkins\jenkins-slave\workspace\-dependency-plugin_MDEP-625-3I6V7G3727HFCGSCWRQH5RTCWRSMXZQ3ZEOVZRI3U3XLP2Z7WCCQ@2\windows-jdk9-m3.5.x_build\target\invoker-reports\BUILD-mdep-450-project-with-ancestor.xml, f:\jenkins\jenkins-slave\workspace\-dependency-plugin_MDEP-625-3I6V7G3727HFCGSCWRQH5RTCWRSMXZQ3ZEOVZRI3U3XLP2Z7WCCQ@2\windows-jdk9-m3.5.x_build\target\invoker-reports\BUILD-mdep-450-project-without-ancestor.xml, f:\jenkins\jenkins-slave\workspace\-dependency-plugin_MDEP-625-3I6V7G3727HFCGSCWRQH5RTCWRSMXZQ3ZEOVZRI3U3XLP2Z7WCCQ@2\windows-jdk9-m3.5.x_build\target\invoker-reports\BUILD-mdep-506-dependency-without-version-in-depmgt.xml, f:\jenkins\jenkins-slave\workspace\-dependency-plugin_MDEP-625-3I6V7G3727HFCGSCWRQH5RTCWRSMXZQ3ZEOVZRI3U3XLP2Z7WCCQ@2\windows-jdk9-m3.5.x_build\target\invoker-reports\BUILD-mdep-571-resolve-java9.xml, f:\jenkins\jenkins-slave\workspace\-dependency-plugin_MDEP-625-3I6V7G3727HFCGSCWRQH5RTCWRSMXZQ3ZEOVZRI3U3XLP2Z7WCCQ@2\windows-jdk9-m3.5.x_build\target\invoker-reports\BUILD-mdep-572-unpack-tar-long-file.xml, f:\jenkins\jenkins-slave\workspace\-dependency-plugin_MDEP-625-3I6V7G3727HFCGSCWRQH5RTCWRSMXZQ3ZEOVZRI3U3XLP2Z7WCCQ@2\windows-jdk9-m3.5.x_build\target\invoker-reports\BUILD-mdep-578_display-reason-invalid-module.xml, f:\jenkins\jenkins-slave\workspace\-dependency-plugin_MDEP-625-3I6V7G3727HFCGSCWRQH5RTCWRSMXZQ3ZEOVZRI3U3XLP2Z7WCCQ@2\windows-jdk9-m3.5.x_build\target\invoker-reports\BUILD-mdep-580_display-manifest-automodules.xml, f:\jenkins\jenkins-slave\workspace\-dependency-plugin_MDEP-625-3I6V7G3727HFCGSCWRQH5RTCWRSMXZQ3ZEOVZRI3U3XLP2Z7WCCQ@2\windows-jdk9-m3.5.x_build\target\invoker-reports\BUILD-mdep-599-analyze-java9.xml, f:\jenkins\jenkins-slave\workspace\-dependency-plugin_MDEP-625-3I6V7G3727HFCGSCWRQH5RTCWRSMXZQ3ZEOVZRI3U3XLP2Z7WCCQ@2\windows-jdk9-m3.5.x_build\target\invoker-reports\BUILD-purge-local-repository-bad-dep.xml, f:\jenkins\jenkins-slave\workspace\-dependency-plugin_MDEP-625-3I6V7G3727HFCGSCWRQH5RTCWRSMXZQ3ZEOVZRI3U3XLP2Z7WCCQ@2\windows-jdk9-m3.5.x_build\target\invoker-reports\BUILD-purge-local-repository-include.xml, f:\jenkins\jenkins-slave\workspace\-dependency-plugin_MDEP-625-3I6V7G3727HFCGSCWRQH5RTCWRSMXZQ3ZEOVZRI3U3XLP2Z7WCCQ@2\windows-jdk9-m3.5.x_build\target\invoker-reports\BUILD-purge-local-repository-multi-module-execution.xml, f:\jenkins\jenkins-slave\workspace\-dependency-plugin_MDEP-625-3I6V7G3727HFCGSCWRQH5RTCWRSMXZQ3ZEOVZRI3U3XLP2Z7WCCQ@2\windows-jdk9-m3.5.x_build\target\invoker-reports\BUILD-purge-local-repository-multi-module.xml, f:\jenkins\jenkins-slave\workspace\-dependency-plugin_MDEP-625-3I6V7G3727HFCGSCWRQH5RTCWRSMXZQ3ZEOVZRI3U3XLP2Z7WCCQ@2\windows-jdk9-m3.5.x_build\target\invoker-reports\BUILD-purge-local-repository-non-transitive.xml, f:\jenkins\jenkins-slave\workspace\-dependency-plugin_MDEP-625-3I6V7G3727HFCGSCWRQH5RTCWRSMXZQ3ZEOVZRI3U3XLP2Z7WCCQ@2\windows-jdk9-m3.5.x_build\target\invoker-reports\BUILD-purge-local-repository-reresolve.xml, f:\jenkins\jenkins-slave\workspace\-dependency-plugin_MDEP-625-3I6V7G3727HFCGSCWRQH5RTCWRSMXZQ3ZEOVZRI3U3XLP2Z7WCCQ@2\windows-jdk9-m3.5.x_build\target\invoker-reports\BUILD-purge-local-repository-snapshots-only.xml, f:\jenkins\jenkins-slave\workspace\-dependency-plugin_MDEP-625-3I6V7G3727HFCGSCWRQH5RTCWRSMXZQ3ZEOVZRI3U3XLP2Z7WCCQ@2\windows-jdk9-m3.5.x_build\target\invoker-reports\BUILD-purge-local-repository-version-range.xml, f:\jenkins\jenkins-slave\workspace\-dependency-plugin_MDEP-625-3I6V7G3727HFCGSCWRQH5RTCWRSMXZQ3ZEOVZRI3U3XLP2Z7WCCQ@2\windows-jdk9-m3.5.x_build\target\invoker-reports\BUILD-purge-local-repository-without-pom.xml, f:\jenkins\jenkins-slave\workspace\-dependency-plugin_MDEP-625-3I6V7G3727HFCGSCWRQH5RTCWRSMXZQ3ZEOVZRI3U3XLP2Z7WCCQ@2\windows-jdk9-m3.5.x_build\target\invoker-reports\BUILD-purge-local-repository.xml, f:\jenkins\jenkins-slave\workspace\-dependency-plugin_MDEP-625-3I6V7G3727HFCGSCWRQH5RTCWRSMXZQ3ZEOVZRI3U3XLP2Z7WCCQ@2\windows-jdk9-m3.5.x_build\target\invoker-reports\BUILD-resolve-plugins-exclude-reactor.xml, f:\jenkins\jenkins-slave\workspace\-dependency-plugin_MDEP-625-3I6V7G3727HFCGSCWRQH5RTCWRSMXZQ3ZEOVZRI3U3XLP2Z7WCCQ@2\windows-jdk9-m3.5.x_build\target\invoker-reports\BUILD-resolve-plugins-with-exclude.xml, f:\jenkins\jenkins-slave\workspace\-dependency-plugin_MDEP-625-3I6V7G3727HFCGSCWRQH5RTCWRSMXZQ3ZEOVZRI3U3XLP2Z7WCCQ@2\windows-jdk9-m3.5.x_build\target\invoker-reports\BUILD-resolve-plugins.xml, f:\jenkins\jenkins-slave\workspace\-dependency-plugin_MDEP-625-3I6V7G3727HFCGSCWRQH5RTCWRSMXZQ3ZEOVZRI3U3XLP2Z7WCCQ@2\windows-jdk9-m3.5.x_build\target\invoker-reports\BUILD-resolve.xml, f:\jenkins\jenkins-slave\workspace\-dependency-plugin_MDEP-625-3I6V7G3727HFCGSCWRQH5RTCWRSMXZQ3ZEOVZRI3U3XLP2Z7WCCQ@2\windows-jdk9-m3.5.x_build\target\invoker-reports\BUILD-setup-custom-ear-lifecycle.xml, f:\jenkins\jenkins-slave\workspace\-dependency-plugin_MDEP-625-3I6V7G3727HFCGSCWRQH5RTCWRSMXZQ3ZEOVZRI3U3XLP2Z7WCCQ@2\windows-jdk9-m3.5.x_build\target\invoker-reports\BUILD-sources.xml, f:\jenkins\jenkins-slave\workspace\-dependency-plugin_MDEP-625-3I6V7G3727HFCGSCWRQH5RTCWRSMXZQ3ZEOVZRI3U3XLP2Z7WCCQ@2\windows-jdk9-m3.5.x_build\target\invoker-reports\BUILD-tree-includes.xml, f:\jenkins\jenkins-slave\workspace\-dependency-plugin_MDEP-625-3I6V7G3727HFCGSCWRQH5RTCWRSMXZQ3ZEOVZRI3U3XLP2Z7WCCQ@2\windows-jdk9-m3.5.x_build\target\invoker-reports\BUILD-tree-multimodule.xml, f:\jenkins\jenkins-slave\workspace\-dependency-plugin_MDEP-625-3I6V7G3727HFCGSCWRQH5RTCWRSMXZQ3ZEOVZRI3U3XLP2Z7WCCQ@2\windows-jdk9-m3.5.x_build\target\invoker-reports\BUILD-tree.xml, f:\jenkins\jenkins-slave\workspace\-dependency-plugin_MDEP-625-3I6V7G3727HFCGSCWRQH5RTCWRSMXZQ3ZEOVZRI3U3XLP2Z7WCCQ@2\windows-jdk9-m3.5.x_build\target\invoker-reports\BUILD-unpack-cli.xml, f:\jenkins\jenkins-slave\workspace\-dependency-plugin_MDEP-625-3I6V7G3727HFCGSCWRQH5RTCWRSMXZQ3ZEOVZRI3U3XLP2Z7WCCQ@2\windows-jdk9-m3.5.x_build\target\invoker-reports\BUILD-unpack-custom-ear.xml, f:\jenkins\jenkins-slave\workspace\-dependency-plugin_MDEP-625-3I6V7G3727HFCGSCWRQH5RTCWRSMXZQ3ZEOVZRI3U3XLP2Z7WCCQ@2\windows-jdk9-m3.5.x_build\target\invoker-reports\BUILD-unpack-dependencies-with-filemappers.xml, f:\jenkins\jenkins-slave\workspace\-dependency-plugin_MDEP-625-3I6V7G3727HFCGSCWRQH5RTCWRSMXZQ3ZEOVZRI3U3XLP2Z7WCCQ@2\windows-jdk9-m3.5.x_build\target\invoker-reports\BUILD-unpack-dependencies.xml, f:\jenkins\jenkins-slave\workspace\-dependency-plugin_MDEP-625-3I6V7G3727HFCGSCWRQH5RTCWRSMXZQ3ZEOVZRI3U3XLP2Z7WCCQ@2\windows-jdk9-m3.5.x_build\target\invoker-reports\BUILD-unpack-from-remote-repository.xml, f:\jenkins\jenkins-slave\workspace\-dependency-plugin_MDEP-625-3I6V7G3727HFCGSCWRQH5RTCWRSMXZQ3ZEOVZRI3U3XLP2Z7WCCQ@2\windows-jdk9-m3.5.x_build\target\invoker-reports\BUILD-unpack.xml, f:\jenkins\jenkins-slave\workspace\-dependency-plugin_MDEP-625-3I6V7G3727HFCGSCWRQH5RTCWRSMXZQ3ZEOVZRI3U3XLP2Z7WCCQ@2\windows-jdk9-m3.5.x_build\target\invoker-reports\BUILD-used-dependencies.xml]
[windows-jdk9-m3.5.x_build] Found logs:[f:\jenkins\jenkins-slave\workspace\-dependency-plugin_MDEP-625-3I6V7G3727HFCGSCWRQH5RTCWRSMXZQ3ZEOVZRI3U3XLP2Z7WCCQ@2\windows-jdk9-m3.5.x_build\target\it\analyze-dep-mgt\build.log, f:\jenkins\jenkins-slave\workspace\-dependency-plugin_MDEP-625-3I6V7G3727HFCGSCWRQH5RTCWRSMXZQ3ZEOVZRI3U3XLP2Z7WCCQ@2\windows-jdk9-m3.5.x_build\target\it\analyze-ignore-dependency\build.log, f:\jenkins\jenkins-slave\workspace\-dependency-plugin_MDEP-625-3I6V7G3727HFCGSCWRQH5RTCWRSMXZQ3ZEOVZRI3U3XLP2Z7WCCQ@2\windows-jdk9-m3.5.x_build\target\it\analyze-ignore-unused-declared-dependency\build.log, f:\jenkins\jenkins-slave\workspace\-dependency-plugin_MDEP-625-3I6V7G3727HFCGSCWRQH5RTCWRSMXZQ3ZEOVZRI3U3XLP2Z7WCCQ@2\windows-jdk9-m3.5.x_build\target\it\analyze-ignore-used-undeclared-dependency\build.log, f:\jenkins\jenkins-slave\workspace\-dependency-plugin_MDEP-625-3I6V7G3727HFCGSCWRQH5RTCWRSMXZQ3ZEOVZRI3U3XLP2Z7WCCQ@2\windows-jdk9-m3.5.x_build\target\it\analyze-multimodule-project\build.log, f:\jenkins\jenkins-slave\workspace\-dependency-plugin_MDEP-625-3I6V7G3727HFCGSCWRQH5RTCWRSMXZQ3ZEOVZRI3U3XLP2Z7WCCQ@2\windows-jdk9-m3.5.x_build\target\it\analyze-report\build.log, f:\jenkins\jenkins-slave\workspace\-dependency-plugin_MDEP-625-3I6V7G3727HFCGSCWRQH5RTCWRSMXZQ3ZEOVZRI3U3XLP2Z7WCCQ@2\windows-jdk9-m3.5.x_build\target\it\analyze\build.log, f:\jenkins\jenkins-slave\workspace\-dependency-plugin_MDEP-625-3I6V7G3727HFCGSCWRQH5RTCWRSMXZQ3ZEOVZRI3U3XLP2Z7WCCQ@2\windows-jdk9-m3.5.x_build\target\it\build-classpath-output-file-and-property\build.log, f:\jenkins\jenkins-slave\workspace\-dependency-plugin_MDEP-625-3I6V7G3727HFCGSCWRQH5RTCWRSMXZQ3ZEOVZRI3U3XLP2Z7WCCQ@2\windows-jdk9-m3.5.x_build\target\it\build-classpath\build.log, f:\jenkins\jenkins-slave\workspace\-dependency-plugin_MDEP-625-3I6V7G3727HFCGSCWRQH5RTCWRSMXZQ3ZEOVZRI3U3XLP2Z7WCCQ@2\windows-jdk9-m3.5.x_build\target\it\collect\build.log, f:\jenkins\jenkins-slave\workspace\-dependency-plugin_MDEP-625-3I6V7G3727HFCGSCWRQH5RTCWRSMXZQ3ZEOVZRI3U3XLP2Z7WCCQ@2\windows-jdk9-m3.5.x_build\target\it\copy-and-unpack-with-alternate-local-repo\build.log, f:\jenkins\jenkins-slave\workspace\-dependency-plugin_MDEP-625-3I6V7G3727HFCGSCWRQH5RTCWRSMXZQ3ZEOVZRI3U3XLP2Z7WCCQ@2\windows-jdk9-m3.5.x_build\target\it\copy-cli\build.log, f:\jenkins\jenkins-slave\workspace\-dependency-plugin_MDEP-625-3I6V7G3727HFCGSCWRQH5RTCWRSMXZQ3ZEOVZRI3U3XLP2Z7WCCQ@2\windows-jdk9-m3.5.x_build\target\it\copy-dependencies\build.log, f:\jenkins\jenkins-slave\workspace\-dependency-plugin_MDEP-625-3I6V7G3727HFCGSCWRQH5RTCWRSMXZQ3ZEOVZRI3U3XLP2Z7WCCQ@2\windows-jdk9-m3.5.x_build\target\it\copy-from-reactor\build.log, f:\jenkins\jenkins-slave\workspace\-dependency-plugin_MDEP-625-3I6V7G3727HFCGSCWRQH5RTCWRSMXZQ3ZEOVZRI3U3XLP2Z7WCCQ@2\windows-jdk9-m3.5.x_build\target\it\copy-from-remote-repository\build.log, f:\jenkins\jenkins-slave\workspace\-dependency-plugin_MDEP-625-3I6V7G3727HFCGSCWRQH5RTCWRSMXZQ3ZEOVZRI3U3XLP2Z7WCCQ@2\windows-jdk9-m3.5.x_build\target\it\copy\build.log, f:\jenkins\jenkins-slave\workspace\-dependency-plugin_MDEP-625-3I6V7G3727HFCGSCWRQH5RTCWRSMXZQ3ZEOVZRI3U3XLP2Z7WCCQ@2\windows-jdk9-m3.5.x_build\target\it\dependency-properties\build.log, f:\jenkins\jenkins-slave\workspace\-dependency-plugin_MDEP-625-3I6V7G3727HFCGSCWRQH5RTCWRSMXZQ3ZEOVZRI3U3XLP2Z7WCCQ@2\windows-jdk9-m3.5.x_build\target\it\filterunpack\build.log, f:\jenkins\jenkins-slave\workspace\-dependency-plugin_MDEP-625-3I6V7G3727HFCGSCWRQH5RTCWRSMXZQ3ZEOVZRI3U3XLP2Z7WCCQ@2\windows-jdk9-m3.5.x_build\target\it\get-artifact-maven-plugin\build.log, f:\jenkins\jenkins-slave\workspace\-dependency-plugin_MDEP-625-3I6V7G3727HFCGSCWRQH5RTCWRSMXZQ3ZEOVZRI3U3XLP2Z7WCCQ@2\windows-jdk9-m3.5.x_build\target\it\get-artifact-no-transitive\build.log, f:\jenkins\jenkins-slave\workspace\-dependency-plugin_MDEP-625-3I6V7G3727HFCGSCWRQH5RTCWRSMXZQ3ZEOVZRI3U3XLP2Z7WCCQ@2\windows-jdk9-m3.5.x_build\target\it\get-artifact\build.log, f:\jenkins\jenkins-slave\workspace\-dependency-plugin_MDEP-625-3I6V7G3727HFCGSCWRQH5RTCWRSMXZQ3ZEOVZRI3U3XLP2Z7WCCQ@2\windows-jdk9-m3.5.x_build\target\it\get-gav\build.log, f:\jenkins\jenkins-slave\workspace\-dependency-plugin_MDEP-625-3I6V7G3727HFCGSCWRQH5RTCWRSMXZQ3ZEOVZRI3U3XLP2Z7WCCQ@2\windows-jdk9-m3.5.x_build\target\it\go-offline\build.log, f:\jenkins\jenkins-slave\workspace\-dependency-plugin_MDEP-625-3I6V7G3727HFCGSCWRQH5RTCWRSMXZQ3ZEOVZRI3U3XLP2Z7WCCQ@2\windows-jdk9-m3.5.x_build\target\it\list-repositories\build.log, f:\jenkins\jenkins-slave\workspace\-dependency-plugin_MDEP-625-3I6V7G3727HFCGSCWRQH5RTCWRSMXZQ3ZEOVZRI3U3XLP2Z7WCCQ@2\windows-jdk9-m3.5.x_build\target\it\mdep-439-analyze-java8\build.log, f:\jenkins\jenkins-slave\workspace\-dependency-plugin_MDEP-625-3I6V7G3727HFCGSCWRQH5RTCWRSMXZQ3ZEOVZRI3U3XLP2Z7WCCQ@2\windows-jdk9-m3.5.x_build\target\it\mdep-450-project-with-ancestor\build.log, f:\jenkins\jenkins-slave\workspace\-dependency-plugin_MDEP-625-3I6V7G3727HFCGSCWRQH5RTCWRSMXZQ3ZEOVZRI3U3XLP2Z7WCCQ@2\windows-jdk9-m3.5.x_build\target\it\mdep-450-project-without-ancestor\build.log, f:\jenkins\jenkins-slave\workspace\-dependency-plugin_MDEP-625-3I6V7G3727HFCGSCWRQH5RTCWRSMXZQ3ZEOVZRI3U3XLP2Z7WCCQ@2\windows-jdk9-m3.5.x_build\target\it\mdep-506-dependency-without-version-in-depmgt\build.log, f:\jenkins\jenkins-slave\workspace\-dependency-plugin_MDEP-625-3I6V7G3727HFCGSCWRQH5RTCWRSMXZQ3ZEOVZRI3U3XLP2Z7WCCQ@2\windows-jdk9-m3.5.x_build\target\it\mdep-571-resolve-java9\build.log, f:\jenkins\jenkins-slave\workspace\-dependency-plugin_MDEP-625-3I6V7G3727HFCGSCWRQH5RTCWRSMXZQ3ZEOVZRI3U3XLP2Z7WCCQ@2\windows-jdk9-m3.5.x_build\target\it\mdep-572-unpack-tar-long-file\build.log, f:\jenkins\jenkins-slave\workspace\-dependency-plugin_MDEP-625-3I6V7G3727HFCGSCWRQH5RTCWRSMXZQ3ZEOVZRI3U3XLP2Z7WCCQ@2\windows-jdk9-m3.5.x_build\target\it\mdep-578_display-reason-invalid-module\build.log, f:\jenkins\jenkins-slave\workspace\-dependency-plugin_MDEP-625-3I6V7G3727HFCGSCWRQH5RTCWRSMXZQ3ZEOVZRI3U3XLP2Z7WCCQ@2\windows-jdk9-m3.5.x_build\target\it\mdep-580_display-manifest-automodules\build.log, f:\jenkins\jenkins-slave\workspace\-dependency-plugin_MDEP-625-3I6V7G3727HFCGSCWRQH5RTCWRSMXZQ3ZEOVZRI3U3XLP2Z7WCCQ@2\windows-jdk9-m3.5.x_build\target\it\mdep-599-analyze-java9\build.log, f:\jenkins\jenkins-slave\workspace\-dependency-plugin_MDEP-625-3I6V7G3727HFCGSCWRQH5RTCWRSMXZQ3ZEOVZRI3U3XLP2Z7WCCQ@2\windows-jdk9-m3.5.x_build\target\it\purge-local-repository-bad-dep\build.log, f:\jenkins\jenkins-slave\workspace\-dependency-plugin_MDEP-625-3I6V7G3727HFCGSCWRQH5RTCWRSMXZQ3ZEOVZRI3U3XLP2Z7WCCQ@2\windows-jdk9-m3.5.x_build\target\it\purge-local-repository-include\build.log, f:\jenkins\jenkins-slave\workspace\-dependency-plugin_MDEP-625-3I6V7G3727HFCGSCWRQH5RTCWRSMXZQ3ZEOVZRI3U3XLP2Z7WCCQ@2\windows-jdk9-m3.5.x_build\target\it\purge-local-repository-multi-module-execution\build.log, f:\jenkins\jenkins-slave\workspace\-dependency-plugin_MDEP-625-3I6V7G3727HFCGSCWRQH5RTCWRSMXZQ3ZEOVZRI3U3XLP2Z7WCCQ@2\windows-jdk9-m3.5.x_build\target\it\purge-local-repository-multi-module\build.log, f:\jenkins\jenkins-slave\workspace\-dependency-plugin_MDEP-625-3I6V7G3727HFCGSCWRQH5RTCWRSMXZQ3ZEOVZRI3U3XLP2Z7WCCQ@2\windows-jdk9-m3.5.x_build\target\it\purge-local-repository-non-transitive\build.log, f:\jenkins\jenkins-slave\workspace\-dependency-plugin_MDEP-625-3I6V7G3727HFCGSCWRQH5RTCWRSMXZQ3ZEOVZRI3U3XLP2Z7WCCQ@2\windows-jdk9-m3.5.x_build\target\it\purge-local-repository-reresolve\build.log, f:\jenkins\jenkins-slave\workspace\-dependency-plugin_MDEP-625-3I6V7G3727HFCGSCWRQH5RTCWRSMXZQ3ZEOVZRI3U3XLP2Z7WCCQ@2\windows-jdk9-m3.5.x_build\target\it\purge-local-repository-snapshots-only\build.log, f:\jenkins\jenkins-slave\workspace\-dependency-plugin_MDEP-625-3I6V7G3727HFCGSCWRQH5RTCWRSMXZQ3ZEOVZRI3U3XLP2Z7WCCQ@2\windows-jdk9-m3.5.x_build\target\it\purge-local-repository-version-range\build.log, f:\jenkins\jenkins-slave\workspace\-dependency-plugin_MDEP-625-3I6V7G3727HFCGSCWRQH5RTCWRSMXZQ3ZEOVZRI3U3XLP2Z7WCCQ@2\windows-jdk9-m3.5.x_build\target\it\purge-local-repository-without-pom\build.log, f:\jenkins\jenkins-slave\workspace\-dependency-plugin_MDEP-625-3I6V7G3727HFCGSCWRQH5RTCWRSMXZQ3ZEOVZRI3U3XLP2Z7WCCQ@2\windows-jdk9-m3.5.x_build\target\it\purge-local-repository\build.log, f:\jenkins\jenkins-slave\workspace\-dependency-plugin_MDEP-625-3I6V7G3727HFCGSCWRQH5RTCWRSMXZQ3ZEOVZRI3U3XLP2Z7WCCQ@2\windows-jdk9-m3.5.x_build\target\it\resolve-plugins-exclude-reactor\build.log, f:\jenkins\jenkins-slave\workspace\-dependency-plugin_MDEP-625-3I6V7G3727HFCGSCWRQH5RTCWRSMXZQ3ZEOVZRI3U3XLP2Z7WCCQ@2\windows-jdk9-m3.5.x_build\target\it\resolve-plugins-with-exclude\build.log, f:\jenkins\jenkins-slave\workspace\-dependency-plugin_MDEP-625-3I6V7G3727HFCGSCWRQH5RTCWRSMXZQ3ZEOVZRI3U3XLP2Z7WCCQ@2\windows-jdk9-m3.5.x_build\target\it\resolve-plugins\build.log, f:\jenkins\jenkins-slave\workspace\-dependency-plugin_MDEP-625-3I6V7G3727HFCGSCWRQH5RTCWRSMXZQ3ZEOVZRI3U3XLP2Z7WCCQ@2\windows-jdk9-m3.5.x_build\target\it\resolve\build.log, f:\jenkins\jenkins-slave\workspace\-dependency-plugin_MDEP-625-3I6V7G3727HFCGSCWRQH5RTCWRSMXZQ3ZEOVZRI3U3XLP2Z7WCCQ@2\windows-jdk9-m3.5.x_build\target\it\setup-custom-ear-lifecycle\build.log, f:\jenkins\jenkins-slave\workspace\-dependency-plugin_MDEP-625-3I6V7G3727HFCGSCWRQH5RTCWRSMXZQ3ZEOVZRI3U3XLP2Z7WCCQ@2\windows-jdk9-m3.5.x_build\target\it\sources\build.log, f:\jenkins\jenkins-slave\workspace\-dependency-plugin_MDEP-625-3I6V7G3727HFCGSCWRQH5RTCWRSMXZQ3ZEOVZRI3U3XLP2Z7WCCQ@2\windows-jdk9-m3.5.x_build\target\it\tree-includes\build.log, f:\jenkins\jenkins-slave\workspace\-dependency-plugin_MDEP-625-3I6V7G3727HFCGSCWRQH5RTCWRSMXZQ3ZEOVZRI3U3XLP2Z7WCCQ@2\windows-jdk9-m3.5.x_build\target\it\tree-multimodule\build.log, f:\jenkins\jenkins-slave\workspace\-dependency-plugin_MDEP-625-3I6V7G3727HFCGSCWRQH5RTCWRSMXZQ3ZEOVZRI3U3XLP2Z7WCCQ@2\windows-jdk9-m3.5.x_build\target\it\unpack-cli\build.log, f:\jenkins\jenkins-slave\workspace\-dependency-plugin_MDEP-625-3I6V7G3727HFCGSCWRQH5RTCWRSMXZQ3ZEOVZRI3U3XLP2Z7WCCQ@2\windows-jdk9-m3.5.x_build\target\it\unpack-custom-ear\build.log, f:\jenkins\jenkins-slave\workspace\-dependency-plugin_MDEP-625-3I6V7G3727HFCGSCWRQH5RTCWRSMXZQ3ZEOVZRI3U3XLP2Z7WCCQ@2\windows-jdk9-m3.5.x_build\target\it\unpack-dependencies-with-filemappers\build.log, f:\jenkins\jenkins-slave\workspace\-dependency-plugin_MDEP-625-3I6V7G3727HFCGSCWRQH5RTCWRSMXZQ3ZEOVZRI3U3XLP2Z7WCCQ@2\windows-jdk9-m3.5.x_build\target\it\unpack-dependencies\build.log, f:\jenkins\jenkins-slave\workspace\-dependency-plugin_MDEP-625-3I6V7G3727HFCGSCWRQH5RTCWRSMXZQ3ZEOVZRI3U3XLP2Z7WCCQ@2\windows-jdk9-m3.5.x_build\target\it\unpack-from-remote-repository\build.log, f:\jenkins\jenkins-slave\workspace\-dependency-plugin_MDEP-625-3I6V7G3727HFCGSCWRQH5RTCWRSMXZQ3ZEOVZRI3U3XLP2Z7WCCQ@2\windows-jdk9-m3.5.x_build\target\it\unpack\build.log, f:\jenkins\jenkins-slave\workspace\-dependency-plugin_MDEP-625-3I6V7G3727HFCGSCWRQH5RTCWRSMXZQ3ZEOVZRI3U3XLP2Z7WCCQ@2\windows-jdk9-m3.5.x_build\target\it\used-dependencies\build.log]
[windows-jdk9-m3.5.x_build] Finished parsing Maven Invoker results (found 59)
[windows-jdk9-m3.5.x_build] [withMaven] junitPublisher - Archive test results for Maven artifact org.apache.maven.plugins:maven-dependency-plugin:3.1.2-SNAPSHOT generated by maven-surefire-plugin:test (default-test): windows-jdk9-m3.5.x_build\target\surefire-reports\*.xml
[windows-jdk9-m3.5.x_build] Recording test results
[windows-jdk9-m3.5.x_build] [withMaven] openTasksPublisher - Scan Tasks for Maven artifact org.apache.maven.plugins:maven-dependency-plugin:3.1.2-SNAPSHOT in source directory windows-jdk9-m3.5.x_build\src\main\java
[windows-jdk9-m3.5.x_build] [TASKS] Scanning folder 'f:\jenkins\jenkins-slave\workspace\-dependency-plugin_MDEP-625-3I6V7G3727HFCGSCWRQH5RTCWRSMXZQ3ZEOVZRI3U3XLP2Z7WCCQ@2' for files matching the pattern 'windows-jdk9-m3.5.x_build\src\main\java\**\*' - excludes: null
[windows-jdk9-m3.5.x_build] [TASKS] Found 48 files to scan for tasks
[windows-jdk9-m3.5.x_build] [TASKS] Found 4 open tasks.
[windows-jdk9-m3.5.x_build] Skipping warnings blame since pipelines do not have an SCM link.%n
[Pipeline] [windows-jdk9-m3.5.x_build] // withMaven
[Pipeline] [windows-jdk9-m3.5.x_build] cleanWs
[windows-jdk9-m3.5.x_build] [WS-CLEANUP] Deleting project workspace...[WS-CLEANUP] done
[Pipeline] [windows-jdk9-m3.5.x_build] cleanWs
[windows-jdk9-m3.5.x_build] [WS-CLEANUP] Deleting project workspace...[WS-CLEANUP] done
[Pipeline] [windows-jdk9-m3.5.x_build] }
[Pipeline] [windows-jdk9-m3.5.x_build] // stage
[Pipeline] [windows-jdk9-m3.5.x_build] }
[Pipeline] [windows-jdk9-m3.5.x_build] // ws
[Pipeline] [windows-jdk9-m3.5.x_build] }
[Pipeline] [windows-jdk9-m3.5.x_build] // node
[Pipeline] [windows-jdk9-m3.5.x_build] }
[windows-jdk9-m3.5.x_build] Failed in branch windows-jdk9-m3.5.x_build
[Pipeline] // parallel
[Pipeline] stage
[Pipeline] { (Notifications)
[Pipeline] echo
Build result: FAILURE
[Pipeline] jiraIssueSelector
[Pipeline] emailext
Mime
  • Unnamed multipart/mixed (inline, None, 0 bytes)
View raw message