maven-notifications mailing list archives

Site index · List index
Message view « Date » · « Thread »
Top « Date » · « Thread »
From Apache Jenkins Server <jenk...@builds.apache.org>
Subject Build failed in Jenkins: Maven TLP » maven-verifier-plugin » master #36
Date Sun, 30 Dec 2018 14:20:18 GMT
See https://builds.apache.org/job/maven-box/job/maven-verifier-plugin/job/master/36/

Changes:

* reduce the history archiving
* reduce the history archiving
* increase a bit archiving
* increase a bit archiving
* Activate sonarqube on first project
* Disable sonar:sonar for now
* use publisherStrategy: 'EXPLICIT' to avoid non used publishers
* [INFRA-17514] Fix file separator + add other locations for workspaces
* fix indent
* use a special local repo to have a bit of caching

All tests passed

Build log:
[...truncated 338.12 KB...]
[windows-jdk8-m3.5.x_build] [INFO] 
[windows-jdk8-m3.5.x_build] [INFO] --- maven-compiler-plugin:3.7.0:testCompile (default-testCompile)
@ maven-verifier-plugin ---
[windows-jdk8-m3.5.x_build] [INFO] Changes detected - recompiling the module!
[windows-jdk8-m3.5.x_build] [INFO] Compiling 1 source file to f:\jenkins\jenkins-slave\workspace\aven-verifier-plugin_master-HSCDHQJXT5RJNUUH6OIYTY636JPRROEDKOBLHF3ONXUPSAU6TFYQ@3@2\windows-jdk8-m3.5.x_build\target\test-classes
[windows-jdk8-m3.5.x_build] [INFO] 
[windows-jdk8-m3.5.x_build] [INFO] --- maven-surefire-plugin:2.22.0:test (default-test) @
maven-verifier-plugin ---
[windows-jdk8-m3.5.x_build] [INFO] Surefire report directory: f:\jenkins\jenkins-slave\workspace\aven-verifier-plugin_master-HSCDHQJXT5RJNUUH6OIYTY636JPRROEDKOBLHF3ONXUPSAU6TFYQ@3@2\windows-jdk8-m3.5.x_build\target\surefire-reports
[windows-jdk11-m3.5.x_build] [INFO] 
[windows-jdk11-m3.5.x_build] [INFO] --- modello-maven-plugin:1.9.1:xpp3-writer (standard)
@ maven-verifier-plugin ---
[windows-jdk11-m3.5.x_build] [INFO] outputDirectory: f:\jenkins\jenkins-slave\workspace\aven-verifier-plugin_master-HSCDHQJXT5RJNUUH6OIYTY636JPRROEDKOBLHF3ONXUPSAU6TFYQ@2\windows-jdk11-m3.5.x_build\target\generated-sources\modello
[windows-jdk11-m3.5.x_build] [INFO] Working on model: src/main/mdo/verifications.mdo
[windows-jdk11-m3.5.x_build] [INFO] Generating current version: 1.0.0
[windows-jdk11-m3.5.x_build] [INFO] 
[windows-jdk11-m3.5.x_build] [INFO] --- maven-remote-resources-plugin:1.5:process (process-resource-bundles)
@ maven-verifier-plugin ---
[windows-jdk11-m3.5.x_build] [INFO] 
[windows-jdk11-m3.5.x_build] [INFO] --- maven-resources-plugin:3.1.0:resources (default-resources)
@ maven-verifier-plugin ---
[windows-jdk8-m3.5.x_build] [INFO] 
[windows-jdk8-m3.5.x_build] [INFO] -------------------------------------------------------
[windows-jdk8-m3.5.x_build] [INFO]  T E S T S
[windows-jdk8-m3.5.x_build] [INFO] -------------------------------------------------------
[windows-jdk8-m3.5.x_build] [INFO] Running org.apache.maven.plugins.verifier.VerifierMojoTest
[windows-jdk11-m3.5.x_build] [INFO] Using 'UTF-8' encoding to copy filtered resources.
[windows-jdk11-m3.5.x_build] [INFO] skip non existing resourceDirectory f:\jenkins\jenkins-slave\workspace\aven-verifier-plugin_master-HSCDHQJXT5RJNUUH6OIYTY636JPRROEDKOBLHF3ONXUPSAU6TFYQ@2\windows-jdk11-m3.5.x_build\src\main\resources
[windows-jdk11-m3.5.x_build] [INFO] Copying 3 resources
[windows-jdk11-m3.5.x_build] [INFO] 
[windows-jdk11-m3.5.x_build] [INFO] --- maven-compiler-plugin:3.7.0:compile (default-compile)
@ maven-verifier-plugin ---
[windows-jdk11-m3.5.x_build] [INFO] Changes detected - recompiling the module!
[windows-jdk11-m3.5.x_build] [INFO] Compiling 9 source files to f:\jenkins\jenkins-slave\workspace\aven-verifier-plugin_master-HSCDHQJXT5RJNUUH6OIYTY636JPRROEDKOBLHF3ONXUPSAU6TFYQ@2\windows-jdk11-m3.5.x_build\target\classes
[windows-jdk8-m3.5.x_build] [debug] Verifying absence of f:\jenkins\jenkins-slave\workspace\aven-verifier-plugin_master-HSCDHQJXT5RJNUUH6OIYTY636JPRROEDKOBLHF3ONXUPSAU6TFYQ@3@2\windows-jdk8-m3.5.x_build\target\test-classes\InexistentFileThatExists.xml
[windows-jdk8-m3.5.x_build] [debug] Verifying existence of f:\jenkins\jenkins-slave\workspace\aven-verifier-plugin_master-HSCDHQJXT5RJNUUH6OIYTY636JPRROEDKOBLHF3ONXUPSAU6TFYQ@3@2\windows-jdk8-m3.5.x_build\target\test-classes\FileExistsValidContent.xml
[windows-jdk8-m3.5.x_build] [debug] Verifying contents of f:\jenkins\jenkins-slave\workspace\aven-verifier-plugin_master-HSCDHQJXT5RJNUUH6OIYTY636JPRROEDKOBLHF3ONXUPSAU6TFYQ@3@2\windows-jdk8-m3.5.x_build\target\test-classes\FileExistsValidContent.xml
[windows-jdk8-m3.5.x_build] [debug] Verifying existence of f:\jenkins\jenkins-slave\workspace\aven-verifier-plugin_master-HSCDHQJXT5RJNUUH6OIYTY636JPRROEDKOBLHF3ONXUPSAU6TFYQ@3@2\windows-jdk8-m3.5.x_build\target\test-classes\FileExistsValidContent.xml
[windows-jdk8-m3.5.x_build] [debug] Verifying contents of f:\jenkins\jenkins-slave\workspace\aven-verifier-plugin_master-HSCDHQJXT5RJNUUH6OIYTY636JPRROEDKOBLHF3ONXUPSAU6TFYQ@3@2\windows-jdk8-m3.5.x_build\target\test-classes\FileExistsValidContent.xml
[windows-jdk8-m3.5.x_build] [debug] Verifying absence of c:\some\path\src\test\resources\Dummy.xml
[windows-jdk8-m3.5.x_build] [debug] Verifying existence of f:\jenkins\jenkins-slave\workspace\aven-verifier-plugin_master-HSCDHQJXT5RJNUUH6OIYTY636JPRROEDKOBLHF3ONXUPSAU6TFYQ@3@2\windows-jdk8-m3.5.x_build\target\test-classes\File
Exists.xml
[windows-jdk8-m3.5.x_build] [debug] Verifying existence of c:\some\path\src\test\resources\Dummy.xml
[windows-jdk8-m3.5.x_build] [INFO] Tests run: 8, Failures: 0, Errors: 0, Skipped: 0, Time
elapsed: 0.084 s - in org.apache.maven.plugins.verifier.VerifierMojoTest
[windows-jdk8-m3.5.x_build] [INFO] 
[windows-jdk8-m3.5.x_build] [INFO] Results:
[windows-jdk8-m3.5.x_build] [INFO] 
[windows-jdk8-m3.5.x_build] [INFO] Tests run: 8, Failures: 0, Errors: 0, Skipped: 0
[windows-jdk8-m3.5.x_build] [INFO] 
[windows-jdk8-m3.5.x_build] [INFO] 
[windows-jdk8-m3.5.x_build] [INFO] --- maven-jar-plugin:3.1.0:jar (default-jar) @ maven-verifier-plugin
---
[windows-jdk8-m3.5.x_build] [INFO] Building jar: f:\jenkins\jenkins-slave\workspace\aven-verifier-plugin_master-HSCDHQJXT5RJNUUH6OIYTY636JPRROEDKOBLHF3ONXUPSAU6TFYQ@3@2\windows-jdk8-m3.5.x_build\target\maven-verifier-plugin-3.0.0-SNAPSHOT.jar
[windows-jdk8-m3.5.x_build] [INFO] 
[windows-jdk8-m3.5.x_build] [INFO] --- maven-plugin-plugin:3.5.2:addPluginArtifactMetadata
(default-addPluginArtifactMetadata) @ maven-verifier-plugin ---
[windows-jdk8-m3.5.x_build] [INFO] 
[windows-jdk8-m3.5.x_build] [INFO] --- maven-site-plugin:3.7.1:attach-descriptor (attach-descriptor)
@ maven-verifier-plugin ---
[windows-jdk8-m3.5.x_build] [INFO] Skipping because packaging 'maven-plugin' is not pom.
[windows-jdk8-m3.5.x_build] [INFO] 
[windows-jdk8-m3.5.x_build] [INFO] --- maven-invoker-plugin:3.1.0:install (integration-test)
@ maven-verifier-plugin ---
[windows-jdk8-m3.5.x_build] [INFO] Installing f:\jenkins\jenkins-slave\workspace\aven-verifier-plugin_master-HSCDHQJXT5RJNUUH6OIYTY636JPRROEDKOBLHF3ONXUPSAU6TFYQ@3@2\windows-jdk8-m3.5.x_build\pom.xml
to f:\jenkins\jenkins-slave\workspace\aven-verifier-plugin_master-HSCDHQJXT5RJNUUH6OIYTY636JPRROEDKOBLHF3ONXUPSAU6TFYQ@3@2\windows-jdk8-m3.5.x_build\target\local-repo\org\apache\maven\plugins\maven-verifier-plugin\3.0.0-SNAPSHOT\maven-verifier-plugin-3.0.0-SNAPSHOT.pom
[windows-jdk8-m3.5.x_build] [INFO] Installing f:\jenkins\jenkins-slave\workspace\aven-verifier-plugin_master-HSCDHQJXT5RJNUUH6OIYTY636JPRROEDKOBLHF3ONXUPSAU6TFYQ@3@2\windows-jdk8-m3.5.x_build\target\maven-verifier-plugin-3.0.0-SNAPSHOT.jar
to f:\jenkins\jenkins-slave\workspace\aven-verifier-plugin_master-HSCDHQJXT5RJNUUH6OIYTY636JPRROEDKOBLHF3ONXUPSAU6TFYQ@3@2\windows-jdk8-m3.5.x_build\target\local-repo\org\apache\maven\plugins\maven-verifier-plugin\3.0.0-SNAPSHOT\maven-verifier-plugin-3.0.0-SNAPSHOT.jar
[windows-jdk8-m3.5.x_build] [INFO] 
[windows-jdk8-m3.5.x_build] [INFO] --- maven-invoker-plugin:3.1.0:integration-test (integration-test)
@ maven-verifier-plugin ---
[windows-jdk8-m3.5.x_build] [INFO] Building: default\pom.xml
[windows-jdk11-m3.5.x_build] [INFO] /f:/jenkins/jenkins-slave/workspace/aven-verifier-plugin_master-HSCDHQJXT5RJNUUH6OIYTY636JPRROEDKOBLHF3ONXUPSAU6TFYQ@2/windows-jdk11-m3.5.x_build/target/generated-sources/modello/org/apache/maven/plugins/verifier/model/io/xpp3/VerificationsXpp3Reader.java:
f:\jenkins\jenkins-slave\workspace\aven-verifier-plugin_master-HSCDHQJXT5RJNUUH6OIYTY636JPRROEDKOBLHF3ONXUPSAU6TFYQ@2\windows-jdk11-m3.5.x_build\target\generated-sources\modello\org\apache\maven\plugins\verifier\model\io\xpp3\VerificationsXpp3Reader.java
uses unchecked or unsafe operations.
[windows-jdk11-m3.5.x_build] [INFO] /f:/jenkins/jenkins-slave/workspace/aven-verifier-plugin_master-HSCDHQJXT5RJNUUH6OIYTY636JPRROEDKOBLHF3ONXUPSAU6TFYQ@2/windows-jdk11-m3.5.x_build/target/generated-sources/modello/org/apache/maven/plugins/verifier/model/io/xpp3/VerificationsXpp3Reader.java:
Recompile with -Xlint:unchecked for details.
[windows-jdk11-m3.5.x_build] [INFO] 
[windows-jdk11-m3.5.x_build] [INFO] --- maven-plugin-plugin:3.5.2:descriptor (default-descriptor)
@ maven-verifier-plugin ---
[windows-jdk11-m3.5.x_build] [INFO] Using 'UTF-8' encoding to read mojo source files.
[windows-jdk11-m3.5.x_build] [INFO] java-javadoc mojo extractor found 0 mojo descriptor.
[windows-jdk11-m3.5.x_build] [INFO] java-annotations mojo extractor found 2 mojo descriptors.
[windows-jdk11-m3.5.x_build] [INFO] 
[windows-jdk11-m3.5.x_build] [INFO] --- maven-resources-plugin:3.1.0:testResources (default-testResources)
@ maven-verifier-plugin ---
[windows-jdk11-m3.5.x_build] [INFO] Using 'UTF-8' encoding to copy filtered resources.
[windows-jdk11-m3.5.x_build] [INFO] Copying 6 resources
[windows-jdk11-m3.5.x_build] [INFO] Copying 3 resources
[windows-jdk11-m3.5.x_build] [INFO] 
[windows-jdk11-m3.5.x_build] [INFO] --- maven-compiler-plugin:3.7.0:testCompile (default-testCompile)
@ maven-verifier-plugin ---
[windows-jdk11-m3.5.x_build] [INFO] Changes detected - recompiling the module!
[windows-jdk11-m3.5.x_build] [INFO] Compiling 1 source file to f:\jenkins\jenkins-slave\workspace\aven-verifier-plugin_master-HSCDHQJXT5RJNUUH6OIYTY636JPRROEDKOBLHF3ONXUPSAU6TFYQ@2\windows-jdk11-m3.5.x_build\target\test-classes
[windows-jdk11-m3.5.x_build] [INFO] 
[windows-jdk11-m3.5.x_build] [INFO] --- maven-surefire-plugin:2.22.0:test (default-test) @
maven-verifier-plugin ---
[windows-jdk7-m3.5.x_build] [INFO]           simple\pom.xml ...................................
SUCCESS (6.9 s)
[windows-jdk7-m3.5.x_build] [INFO] 
[windows-jdk7-m3.5.x_build] [INFO] --- maven-checkstyle-plugin:3.0.0:check (checkstyle-check)
@ maven-verifier-plugin ---
[windows-jdk11-m3.5.x_build] [INFO] Surefire report directory: f:\jenkins\jenkins-slave\workspace\aven-verifier-plugin_master-HSCDHQJXT5RJNUUH6OIYTY636JPRROEDKOBLHF3ONXUPSAU6TFYQ@2\windows-jdk11-m3.5.x_build\target\surefire-reports
[windows-jdk11-m3.5.x_build] [INFO] 
[windows-jdk11-m3.5.x_build] [INFO] -------------------------------------------------------
[windows-jdk11-m3.5.x_build] [INFO]  T E S T S
[windows-jdk11-m3.5.x_build] [INFO] -------------------------------------------------------
[windows-jdk11-m3.5.x_build] [INFO] Running org.apache.maven.plugins.verifier.VerifierMojoTest
[windows-jdk11-m3.5.x_build] [debug] Verifying absence of f:\jenkins\jenkins-slave\workspace\aven-verifier-plugin_master-HSCDHQJXT5RJNUUH6OIYTY636JPRROEDKOBLHF3ONXUPSAU6TFYQ@2\windows-jdk11-m3.5.x_build\target\test-classes\InexistentFileThatExists.xml
[windows-jdk11-m3.5.x_build] [debug] Verifying existence of f:\jenkins\jenkins-slave\workspace\aven-verifier-plugin_master-HSCDHQJXT5RJNUUH6OIYTY636JPRROEDKOBLHF3ONXUPSAU6TFYQ@2\windows-jdk11-m3.5.x_build\target\test-classes\FileExistsValidContent.xml
[windows-jdk11-m3.5.x_build] [debug] Verifying contents of f:\jenkins\jenkins-slave\workspace\aven-verifier-plugin_master-HSCDHQJXT5RJNUUH6OIYTY636JPRROEDKOBLHF3ONXUPSAU6TFYQ@2\windows-jdk11-m3.5.x_build\target\test-classes\FileExistsValidContent.xml
[windows-jdk11-m3.5.x_build] [debug] Verifying existence of f:\jenkins\jenkins-slave\workspace\aven-verifier-plugin_master-HSCDHQJXT5RJNUUH6OIYTY636JPRROEDKOBLHF3ONXUPSAU6TFYQ@2\windows-jdk11-m3.5.x_build\target\test-classes\FileExistsValidContent.xml
[windows-jdk11-m3.5.x_build] [debug] Verifying contents of f:\jenkins\jenkins-slave\workspace\aven-verifier-plugin_master-HSCDHQJXT5RJNUUH6OIYTY636JPRROEDKOBLHF3ONXUPSAU6TFYQ@2\windows-jdk11-m3.5.x_build\target\test-classes\FileExistsValidContent.xml
[windows-jdk11-m3.5.x_build] [debug] Verifying absence of c:\some\path\src\test\resources\Dummy.xml
[windows-jdk11-m3.5.x_build] [debug] Verifying existence of f:\jenkins\jenkins-slave\workspace\aven-verifier-plugin_master-HSCDHQJXT5RJNUUH6OIYTY636JPRROEDKOBLHF3ONXUPSAU6TFYQ@2\windows-jdk11-m3.5.x_build\target\test-classes\File
Exists.xml
[windows-jdk11-m3.5.x_build] [debug] Verifying existence of c:\some\path\src\test\resources\Dummy.xml
[windows-jdk11-m3.5.x_build] [INFO] Tests run: 8, Failures: 0, Errors: 0, Skipped: 0, Time
elapsed: 0.087 s - in org.apache.maven.plugins.verifier.VerifierMojoTest
[windows-jdk11-m3.5.x_build] [INFO] 
[windows-jdk11-m3.5.x_build] [INFO] Results:
[windows-jdk11-m3.5.x_build] [INFO] 
[windows-jdk11-m3.5.x_build] [INFO] Tests run: 8, Failures: 0, Errors: 0, Skipped: 0
[windows-jdk11-m3.5.x_build] [INFO] 
[windows-jdk11-m3.5.x_build] [INFO] 
[windows-jdk11-m3.5.x_build] [INFO] --- maven-jar-plugin:3.1.0:jar (default-jar) @ maven-verifier-plugin
---
[windows-jdk11-m3.5.x_build] [INFO] Building jar: f:\jenkins\jenkins-slave\workspace\aven-verifier-plugin_master-HSCDHQJXT5RJNUUH6OIYTY636JPRROEDKOBLHF3ONXUPSAU6TFYQ@2\windows-jdk11-m3.5.x_build\target\maven-verifier-plugin-3.0.0-SNAPSHOT.jar
[windows-jdk11-m3.5.x_build] [INFO] 
[windows-jdk11-m3.5.x_build] [INFO] --- maven-plugin-plugin:3.5.2:addPluginArtifactMetadata
(default-addPluginArtifactMetadata) @ maven-verifier-plugin ---
[windows-jdk11-m3.5.x_build] [INFO] 
[windows-jdk11-m3.5.x_build] [INFO] --- maven-site-plugin:3.7.1:attach-descriptor (attach-descriptor)
@ maven-verifier-plugin ---
[windows-jdk7-m3.5.x_build] [INFO] 
[windows-jdk7-m3.5.x_build] [INFO] --- maven-invoker-plugin:3.1.0:verify (integration-test)
@ maven-verifier-plugin ---
[windows-jdk7-m3.5.x_build] [INFO] -------------------------------------------------
[windows-jdk7-m3.5.x_build] [INFO] Build Summary:
[windows-jdk7-m3.5.x_build] [INFO]   Passed: 2, Failed: 0, Errors: 0, Skipped: 0
[windows-jdk7-m3.5.x_build] [INFO] -------------------------------------------------
[windows-jdk7-m3.5.x_build] [INFO] ------------------------------------------------------------------------
[windows-jdk7-m3.5.x_build] [INFO] BUILD SUCCESS
[windows-jdk7-m3.5.x_build] [INFO] ------------------------------------------------------------------------
[windows-jdk7-m3.5.x_build] [INFO] Total time: 33.237 s
[windows-jdk7-m3.5.x_build] [INFO] Finished at: 2018-12-30T14:19:49Z
[windows-jdk7-m3.5.x_build] [INFO] Final Memory: 47M/532M
[windows-jdk7-m3.5.x_build] [INFO] ------------------------------------------------------------------------
[windows-jdk7-m3.5.x_build] [INFO] [jenkins-event-spy] Generated F:\jenkins\jenkins-slave\workspace\aven-verifier-plugin_master-HSCDHQJXT5RJNUUH6OIYTY636JPRROEDKOBLHF3ONXUPSAU6TFYQ@2@tmp\withMavenf70aca9f\maven-spy-20181230-141916-2126506939443995481689.log
[windows-jdk7-m3.5.x_build] Picked up JAVA_TOOL_OPTIONS: -Dmaven.ext.class.path="f:\jenkins\jenkins-slave\workspace\aven-verifier-plugin_master-HSCDHQJXT5RJNUUH6OIYTY636JPRROEDKOBLHF3ONXUPSAU6TFYQ@2@tmp\withMavenf70aca9f\pipeline-maven-spy.jar"
-Dorg.jenkinsci.plugins.pipeline.maven.reportsFolder="f:\jenkins\jenkins-slave\workspace\aven-verifier-plugin_master-HSCDHQJXT5RJNUUH6OIYTY636JPRROEDKOBLHF3ONXUPSAU6TFYQ@2@tmp\withMavenf70aca9f"

[Pipeline] [windows-jdk7-m3.5.x_build] }
[Pipeline] [windows-jdk7-m3.5.x_build] // dir
[windows-jdk11-m3.5.x_build] [INFO] Skipping because packaging 'maven-plugin' is not pom.
[windows-jdk11-m3.5.x_build] [INFO] 
[windows-jdk11-m3.5.x_build] [INFO] --- maven-invoker-plugin:3.1.0:install (integration-test)
@ maven-verifier-plugin ---
[Pipeline] [windows-jdk7-m3.5.x_build] }
[windows-jdk7-m3.5.x_build] [withMaven] artifactsPublisher - Archive artifact windows-jdk7-m3.5.x_build\pom.xml
under org\apache\maven\plugins\maven-verifier-plugin\3.0.0-SNAPSHOT\maven-verifier-plugin-3.0.0-SNAPSHOT.pom
[windows-jdk7-m3.5.x_build] [withMaven] artifactsPublisher - Archive artifact windows-jdk7-m3.5.x_build\target\maven-verifier-plugin-3.0.0-SNAPSHOT.jar
under org\apache\maven\plugins\maven-verifier-plugin\3.0.0-SNAPSHOT\maven-verifier-plugin-3.0.0-SNAPSHOT.jar
[windows-jdk7-m3.5.x_build] [withMaven] junitPublisher - Archive test results for Maven artifact
org.apache.maven.plugins:maven-verifier-plugin:3.0.0-SNAPSHOT generated by maven-surefire-plugin:test
(default-test): windows-jdk7-m3.5.x_build\target\surefire-reports\*.xml
[windows-jdk7-m3.5.x_build] Recording test results
[windows-jdk7-m3.5.x_build] [withMaven] openTasksPublisher - Scan Tasks for Maven artifact
org.apache.maven.plugins:maven-verifier-plugin:3.0.0-SNAPSHOT in source directory windows-jdk7-m3.5.x_build\src\main\java
[windows-jdk7-m3.5.x_build] [TASKS] Scanning folder 'f:\jenkins\jenkins-slave\workspace\aven-verifier-plugin_master-HSCDHQJXT5RJNUUH6OIYTY636JPRROEDKOBLHF3ONXUPSAU6TFYQ@2'
for files matching the pattern 'windows-jdk7-m3.5.x_build\src\main\java\**\*' - excludes:
null
[windows-jdk7-m3.5.x_build] [TASKS] Found 4 files to scan for tasks
[windows-jdk7-m3.5.x_build] [TASKS] Found 0 open tasks.
[windows-jdk7-m3.5.x_build] Skipping warnings blame since pipelines do not have an SCM link.%n
[windows-jdk7-m3.5.x_build] [TASKS] Computing warning deltas based on reference build #35
[windows-jdk7-m3.5.x_build] [withMaven] invokerPublisher - Archive invoker results for Maven
artifact MavenArtifact{org.apache.maven.plugins:maven-verifier-plugin::3.0.0-SNAPSHOT(version:
3.0.0-SNAPSHOT, snapshot:false) } generated by PluginInvocation{org.apache.maven.plugins:maven-invoker-plugin:3.1.0@integration-test
 integration-test}: windows-jdk7-m3.5.x_build\target\invoker-reports\*.xml
[Pipeline] [windows-jdk7-m3.5.x_build] // withMaven
[Pipeline] [windows-jdk7-m3.5.x_build] cleanWs
[windows-jdk7-m3.5.x_build] [WS-CLEANUP] Deleting project workspace...Cannot delete workspace
:remote file operation failed: f:\jenkins\jenkins-slave\workspace\aven-verifier-plugin_master-HSCDHQJXT5RJNUUH6OIYTY636JPRROEDKOBLHF3ONXUPSAU6TFYQ@2
at hudson.remoting.Channel@4ee2423:JNLP4-connect connection from 37.48.69.226/37.48.69.226:64887:
java.nio.file.AccessDeniedException: f:\jenkins\jenkins-slave\workspace\aven-verifier-plugin_master-HSCDHQJXT5RJNUUH6OIYTY636JPRROEDKOBLHF3ONXUPSAU6TFYQ@2
-> f:\jenkins\jenkins-slave\workspace\aven-verifier-plugin_master-HSCDHQJXT5RJNUUH6OIYTY636JPRROEDKOBLHF3ONXUPSAU6TFYQ@2_ws-cleanup_1546179592173
[Pipeline] [windows-jdk7-m3.5.x_build] }
[Pipeline] [windows-jdk7-m3.5.x_build] // stage
[Pipeline] [windows-jdk7-m3.5.x_build] }
[Pipeline] [windows-jdk7-m3.5.x_build] // ws
[Pipeline] [windows-jdk7-m3.5.x_build] }
[Pipeline] [windows-jdk7-m3.5.x_build] // node
[Pipeline] [windows-jdk7-m3.5.x_build] }
[windows-jdk7-m3.5.x_build] Failed in branch windows-jdk7-m3.5.x_build
[windows-jdk11-m3.5.x_build] [INFO] Installing f:\jenkins\jenkins-slave\workspace\aven-verifier-plugin_master-HSCDHQJXT5RJNUUH6OIYTY636JPRROEDKOBLHF3ONXUPSAU6TFYQ@2\windows-jdk11-m3.5.x_build\pom.xml
to f:\jenkins\jenkins-slave\workspace\aven-verifier-plugin_master-HSCDHQJXT5RJNUUH6OIYTY636JPRROEDKOBLHF3ONXUPSAU6TFYQ@2\windows-jdk11-m3.5.x_build\target\local-repo\org\apache\maven\plugins\maven-verifier-plugin\3.0.0-SNAPSHOT\maven-verifier-plugin-3.0.0-SNAPSHOT.pom
[windows-jdk11-m3.5.x_build] [INFO] Installing f:\jenkins\jenkins-slave\workspace\aven-verifier-plugin_master-HSCDHQJXT5RJNUUH6OIYTY636JPRROEDKOBLHF3ONXUPSAU6TFYQ@2\windows-jdk11-m3.5.x_build\target\maven-verifier-plugin-3.0.0-SNAPSHOT.jar
to f:\jenkins\jenkins-slave\workspace\aven-verifier-plugin_master-HSCDHQJXT5RJNUUH6OIYTY636JPRROEDKOBLHF3ONXUPSAU6TFYQ@2\windows-jdk11-m3.5.x_build\target\local-repo\org\apache\maven\plugins\maven-verifier-plugin\3.0.0-SNAPSHOT\maven-verifier-plugin-3.0.0-SNAPSHOT.jar
[windows-jdk11-m3.5.x_build] [INFO] 
[windows-jdk11-m3.5.x_build] [INFO] --- maven-invoker-plugin:3.1.0:integration-test (integration-test)
@ maven-verifier-plugin ---
[windows-jdk11-m3.5.x_build] [INFO] Building: default\pom.xml
[windows-jdk8-m3.5.x_build] [INFO]           default\pom.xml ..................................
SUCCESS (10.8 s)
[windows-jdk8-m3.5.x_build] [INFO] Building: simple\pom.xml
[windows-jdk8-m3.5.x_build] [INFO]           simple\pom.xml ...................................
SUCCESS (6.6 s)
[windows-jdk8-m3.5.x_build] [INFO] 
[windows-jdk8-m3.5.x_build] [INFO] --- maven-checkstyle-plugin:3.0.0:check (checkstyle-check)
@ maven-verifier-plugin ---
[windows-jdk8-m3.5.x_build] [INFO] 
[windows-jdk8-m3.5.x_build] [INFO] --- maven-invoker-plugin:3.1.0:verify (integration-test)
@ maven-verifier-plugin ---
[windows-jdk8-m3.5.x_build] [INFO] -------------------------------------------------
[windows-jdk8-m3.5.x_build] [INFO] Build Summary:
[windows-jdk8-m3.5.x_build] [INFO]   Passed: 2, Failed: 0, Errors: 0, Skipped: 0
[windows-jdk8-m3.5.x_build] [INFO] -------------------------------------------------
[windows-jdk8-m3.5.x_build] [INFO] ------------------------------------------------------------------------
[windows-jdk8-m3.5.x_build] [INFO] BUILD SUCCESS
[windows-jdk8-m3.5.x_build] [INFO] ------------------------------------------------------------------------
[windows-jdk8-m3.5.x_build] [INFO] Total time: 33.764 s
[windows-jdk8-m3.5.x_build] [INFO] Finished at: 2018-12-30T14:20:05Z
[windows-jdk8-m3.5.x_build] [INFO] Final Memory: 46M/634M
[windows-jdk8-m3.5.x_build] [INFO] ------------------------------------------------------------------------
[windows-jdk8-m3.5.x_build] [INFO] [jenkins-event-spy] Generated F:\jenkins\jenkins-slave\workspace\aven-verifier-plugin_master-HSCDHQJXT5RJNUUH6OIYTY636JPRROEDKOBLHF3ONXUPSAU6TFYQ@3@2@tmp\withMaven171ede52\maven-spy-20181230-141931-1984959506278903421218.log
[windows-jdk8-m3.5.x_build] Picked up JAVA_TOOL_OPTIONS: -Dmaven.ext.class.path="f:\jenkins\jenkins-slave\workspace\aven-verifier-plugin_master-HSCDHQJXT5RJNUUH6OIYTY636JPRROEDKOBLHF3ONXUPSAU6TFYQ@3@2@tmp\withMaven171ede52\pipeline-maven-spy.jar"
-Dorg.jenkinsci.plugins.pipeline.maven.reportsFolder="f:\jenkins\jenkins-slave\workspace\aven-verifier-plugin_master-HSCDHQJXT5RJNUUH6OIYTY636JPRROEDKOBLHF3ONXUPSAU6TFYQ@3@2@tmp\withMaven171ede52"

[Pipeline] [windows-jdk8-m3.5.x_build] }
[Pipeline] [windows-jdk8-m3.5.x_build] // dir
[Pipeline] [windows-jdk8-m3.5.x_build] }
[windows-jdk8-m3.5.x_build] [withMaven] artifactsPublisher - Archive artifact windows-jdk8-m3.5.x_build\pom.xml
under org\apache\maven\plugins\maven-verifier-plugin\3.0.0-SNAPSHOT\maven-verifier-plugin-3.0.0-SNAPSHOT.pom
[windows-jdk8-m3.5.x_build] [withMaven] artifactsPublisher - Archive artifact windows-jdk8-m3.5.x_build\target\maven-verifier-plugin-3.0.0-SNAPSHOT.jar
under org\apache\maven\plugins\maven-verifier-plugin\3.0.0-SNAPSHOT\maven-verifier-plugin-3.0.0-SNAPSHOT.jar
[windows-jdk8-m3.5.x_build] [withMaven] junitPublisher - Archive test results for Maven artifact
org.apache.maven.plugins:maven-verifier-plugin:3.0.0-SNAPSHOT generated by maven-surefire-plugin:test
(default-test): windows-jdk8-m3.5.x_build\target\surefire-reports\*.xml
[windows-jdk8-m3.5.x_build] Recording test results
[windows-jdk8-m3.5.x_build] [withMaven] openTasksPublisher - Scan Tasks for Maven artifact
org.apache.maven.plugins:maven-verifier-plugin:3.0.0-SNAPSHOT in source directory windows-jdk8-m3.5.x_build\src\main\java
[windows-jdk8-m3.5.x_build] [TASKS] Scanning folder 'f:\jenkins\jenkins-slave\workspace\aven-verifier-plugin_master-HSCDHQJXT5RJNUUH6OIYTY636JPRROEDKOBLHF3ONXUPSAU6TFYQ@3@2'
for files matching the pattern 'windows-jdk8-m3.5.x_build\src\main\java\**\*' - excludes:
null
[windows-jdk8-m3.5.x_build] [TASKS] Found 4 files to scan for tasks
[windows-jdk8-m3.5.x_build] [TASKS] Found 0 open tasks.
[windows-jdk8-m3.5.x_build] Skipping warnings blame since pipelines do not have an SCM link.%n
[windows-jdk8-m3.5.x_build] [TASKS] Computing warning deltas based on reference build #35
[windows-jdk8-m3.5.x_build] [withMaven] invokerPublisher - Archive invoker results for Maven
artifact MavenArtifact{org.apache.maven.plugins:maven-verifier-plugin::3.0.0-SNAPSHOT(version:
3.0.0-SNAPSHOT, snapshot:false) } generated by PluginInvocation{org.apache.maven.plugins:maven-invoker-plugin:3.1.0@integration-test
 integration-test}: windows-jdk8-m3.5.x_build\target\invoker-reports\*.xml
[Pipeline] [windows-jdk8-m3.5.x_build] // withMaven
[Pipeline] [windows-jdk8-m3.5.x_build] cleanWs
[windows-jdk8-m3.5.x_build] [WS-CLEANUP] Deleting project workspace...Cannot delete workspace
:remote file operation failed: f:\jenkins\jenkins-slave\workspace\aven-verifier-plugin_master-HSCDHQJXT5RJNUUH6OIYTY636JPRROEDKOBLHF3ONXUPSAU6TFYQ@3@2
at hudson.remoting.Channel@4ee2423:JNLP4-connect connection from 37.48.69.226/37.48.69.226:64887:
java.nio.file.AccessDeniedException: f:\jenkins\jenkins-slave\workspace\aven-verifier-plugin_master-HSCDHQJXT5RJNUUH6OIYTY636JPRROEDKOBLHF3ONXUPSAU6TFYQ@3@2
-> f:\jenkins\jenkins-slave\workspace\aven-verifier-plugin_master-HSCDHQJXT5RJNUUH6OIYTY636JPRROEDKOBLHF3ONXUPSAU6TFYQ@3@2_ws-cleanup_1546179607625
[Pipeline] [windows-jdk8-m3.5.x_build] }
[Pipeline] [windows-jdk8-m3.5.x_build] // stage
[Pipeline] [windows-jdk8-m3.5.x_build] }
[Pipeline] [windows-jdk8-m3.5.x_build] // ws
[Pipeline] [windows-jdk8-m3.5.x_build] }
[Pipeline] [windows-jdk8-m3.5.x_build] // node
[Pipeline] [windows-jdk8-m3.5.x_build] }
[windows-jdk8-m3.5.x_build] Failed in branch windows-jdk8-m3.5.x_build
[windows-jdk11-m3.5.x_build] [INFO]           default\pom.xml ..................................
SUCCESS (15.6 s)
[windows-jdk11-m3.5.x_build] [INFO] Building: simple\pom.xml
[windows-jdk11-m3.5.x_build] [INFO]           simple\pom.xml ...................................
SUCCESS (6.1 s)
[windows-jdk11-m3.5.x_build] [INFO] 
[windows-jdk11-m3.5.x_build] [INFO] --- maven-checkstyle-plugin:3.0.0:check (checkstyle-check)
@ maven-verifier-plugin ---
[windows-jdk11-m3.5.x_build] [INFO] 
[windows-jdk11-m3.5.x_build] [INFO] --- maven-invoker-plugin:3.1.0:verify (integration-test)
@ maven-verifier-plugin ---
[windows-jdk11-m3.5.x_build] [INFO] -------------------------------------------------
[windows-jdk11-m3.5.x_build] [INFO] Build Summary:
[windows-jdk11-m3.5.x_build] [INFO]   Passed: 2, Failed: 0, Errors: 0, Skipped: 0
[windows-jdk11-m3.5.x_build] [INFO] -------------------------------------------------
[windows-jdk11-m3.5.x_build] [INFO] ------------------------------------------------------------------------
[windows-jdk11-m3.5.x_build] [INFO] BUILD SUCCESS
[windows-jdk11-m3.5.x_build] [INFO] ------------------------------------------------------------------------
[windows-jdk11-m3.5.x_build] [INFO] Total time: 42.784 s
[windows-jdk11-m3.5.x_build] [INFO] Finished at: 2018-12-30T06:20:16-08:00
[windows-jdk11-m3.5.x_build] [INFO] Final Memory: 38M/140M
[windows-jdk11-m3.5.x_build] [INFO] ------------------------------------------------------------------------
[windows-jdk11-m3.5.x_build] [INFO] [jenkins-event-spy] Generated F:\jenkins\jenkins-slave\workspace\aven-verifier-plugin_master-HSCDHQJXT5RJNUUH6OIYTY636JPRROEDKOBLHF3ONXUPSAU6TFYQ@2@tmp\withMaven0bd3b652\maven-spy-20181230-061933-6142235080766334951421.log
[Pipeline] [windows-jdk11-m3.5.x_build] }
[Pipeline] [windows-jdk11-m3.5.x_build] // dir
[Pipeline] [windows-jdk11-m3.5.x_build] }
[windows-jdk11-m3.5.x_build] [withMaven] artifactsPublisher - Archive artifact windows-jdk11-m3.5.x_build\pom.xml
under org\apache\maven\plugins\maven-verifier-plugin\3.0.0-SNAPSHOT\maven-verifier-plugin-3.0.0-SNAPSHOT.pom
[windows-jdk11-m3.5.x_build] [withMaven] artifactsPublisher - Archive artifact windows-jdk11-m3.5.x_build\target\maven-verifier-plugin-3.0.0-SNAPSHOT.jar
under org\apache\maven\plugins\maven-verifier-plugin\3.0.0-SNAPSHOT\maven-verifier-plugin-3.0.0-SNAPSHOT.jar
[windows-jdk11-m3.5.x_build] [withMaven] junitPublisher - Archive test results for Maven artifact
org.apache.maven.plugins:maven-verifier-plugin:3.0.0-SNAPSHOT generated by maven-surefire-plugin:test
(default-test): windows-jdk11-m3.5.x_build\target\surefire-reports\*.xml
[windows-jdk11-m3.5.x_build] Recording test results
[windows-jdk11-m3.5.x_build] [withMaven] openTasksPublisher - Scan Tasks for Maven artifact
org.apache.maven.plugins:maven-verifier-plugin:3.0.0-SNAPSHOT in source directory windows-jdk11-m3.5.x_build\src\main\java
[windows-jdk11-m3.5.x_build] [TASKS] Scanning folder 'f:\jenkins\jenkins-slave\workspace\aven-verifier-plugin_master-HSCDHQJXT5RJNUUH6OIYTY636JPRROEDKOBLHF3ONXUPSAU6TFYQ@2'
for files matching the pattern 'windows-jdk11-m3.5.x_build\src\main\java\**\*' - excludes:
null
[windows-jdk11-m3.5.x_build] [TASKS] Found 4 files to scan for tasks
[windows-jdk11-m3.5.x_build] [TASKS] Found 0 open tasks.
[windows-jdk11-m3.5.x_build] Skipping warnings blame since pipelines do not have an SCM link.%n
[windows-jdk11-m3.5.x_build] [TASKS] Computing warning deltas based on reference build #35
[windows-jdk11-m3.5.x_build] [withMaven] invokerPublisher - Archive invoker results for Maven
artifact MavenArtifact{org.apache.maven.plugins:maven-verifier-plugin::3.0.0-SNAPSHOT(version:
3.0.0-SNAPSHOT, snapshot:false) } generated by PluginInvocation{org.apache.maven.plugins:maven-invoker-plugin:3.1.0@integration-test
 integration-test}: windows-jdk11-m3.5.x_build\target\invoker-reports\*.xml
[Pipeline] [windows-jdk11-m3.5.x_build] // withMaven
[Pipeline] [windows-jdk11-m3.5.x_build] cleanWs
[windows-jdk11-m3.5.x_build] [WS-CLEANUP] Deleting project workspace...Cannot delete workspace
:remote file operation failed: f:\jenkins\jenkins-slave\workspace\aven-verifier-plugin_master-HSCDHQJXT5RJNUUH6OIYTY636JPRROEDKOBLHF3ONXUPSAU6TFYQ@2
at hudson.remoting.Channel@121270d5:JNLP4-connect connection from 37.48.69.226/37.48.69.226:54213:
java.nio.file.AccessDeniedException: f:\jenkins\jenkins-slave\workspace\aven-verifier-plugin_master-HSCDHQJXT5RJNUUH6OIYTY636JPRROEDKOBLHF3ONXUPSAU6TFYQ@2
-> f:\jenkins\jenkins-slave\workspace\aven-verifier-plugin_master-HSCDHQJXT5RJNUUH6OIYTY636JPRROEDKOBLHF3ONXUPSAU6TFYQ@2_ws-cleanup_1546179618109
[Pipeline] [windows-jdk11-m3.5.x_build] }
[Pipeline] [windows-jdk11-m3.5.x_build] // stage
[Pipeline] [windows-jdk11-m3.5.x_build] }
[Pipeline] [windows-jdk11-m3.5.x_build] // ws
[Pipeline] [windows-jdk11-m3.5.x_build] }
[Pipeline] [windows-jdk11-m3.5.x_build] // node
[Pipeline] [windows-jdk11-m3.5.x_build] }
[windows-jdk11-m3.5.x_build] Failed in branch windows-jdk11-m3.5.x_build
[Pipeline] // parallel
[Pipeline] stage
[Pipeline] { (Notifications)
[Pipeline] echo
Build result: FAILURE
[Pipeline] jiraIssueSelector
[Pipeline] emailext
Mime
  • Unnamed multipart/mixed (inline, None, 0 bytes)
View raw message