maven-notifications mailing list archives

Site index · List index
Message view « Date » · « Thread »
Top « Date » · « Thread »
From Apache Jenkins Server <jenk...@builds.apache.org>
Subject Build unstable in Jenkins: Maven TLP » maven-remote-resources-plugin » TEST-UPGRADE-MAVEN-VERIFIER #24
Date Fri, 02 Nov 2018 06:56:07 GMT
See https://builds.apache.org/job/maven-box/job/maven-remote-resources-plugin/job/TEST-UPGRADE-MAVEN-VERIFIER/24/

No changes.

1 tests failed.
FAILED:  org.apache.maven.plugin.resources.remote.it.IT_RunOnlyAtExecutionRoot.test

Error Message:
Exit code was non-zero: 1; command line and log = 
F:\jenkins\tools\maven\apache-maven-3.5.2\bin\mvn -e --batch-mode -Dmaven.repo.local=f:\jenkins\jenkins-slave\workspace\TEST-UPGRADE-MAVEN-VERIFIER-MSRSEKFUTUGOFVEJX5JT6F73SQREM3WXYQI6H56P3MSWQOA4DOVQ\m\target/it-repo org.apache.maven.plugins:maven-clean-plugin:clean generate-resources
[INFO] [jenkins-event-spy] Generate F:\jenkins\jenkins-slave\workspace\TEST-UPGRADE-MAVEN-VERIFIER-MSRSEKFUTUGOFVEJX5JT6F73SQREM3WXYQI6H56P3MSWQOA4DOVQ@tmp\withMaven10348613\maven-spy-20181102-065534-8597514404824898949751.log.tmp ...
[INFO] Error stacktraces are turned on.
[INFO] Scanning for projects...
[INFO] Downloading from apache-snapshots: http://repository.apache.org/snapshots/org/apache/maven/plugin/rresource/it/it-parent/1.6-SNAPSHOT/maven-metadata.xml
[INFO] Downloading from apache-snapshots: http://repository.apache.org/snapshots/org/apache/maven/plugin/rresource/it/it-parent/1.6-SNAPSHOT/it-parent-1.6-SNAPSHOT.pom
[ERROR] [ERROR] Some problems were encountered while processing the POMs:
[FATAL] Non-resolvable parent POM for org.apache.maven.plugin.rresource.it.mrr41:parent:[unknown-version]: Could not find artifact org.apache.maven.plugin.rresource.it:it-parent:pom:1.6-SNAPSHOT in apache-snapshots (http://repository.apache.org/snapshots/) and 'parent.relativePath' points at wrong local POM @ org.apache.maven.plugin.rresource.it.mrr41:parent:[unknown-version], F:\jenkins\jenkins-slave\workspace\TEST-UPGRADE-MAVEN-VERIFIER-MSRSEKFUTUGOFVEJX5JT6F73SQREM3WXYQI6H56P3MSWQOA4DOVQ\m\target\test-classes\run-only-at-execution-root\pom.xml, line 24, column 11
[FATAL] Non-resolvable parent POM for org.apache.maven.plugin.rresource.it.mrr41:parent:[unknown-version]: Failure to find org.apache.maven.plugin.rresource.it:it-parent:pom:1.6-SNAPSHOT in http://repository.apache.org/snapshots/ was cached in the local repository, resolution will not be reattempted until the update interval of apache-snapshots has elapsed or updates are forced and 'parent.relativePath' points at wrong local POM @ org.apache.maven.plugin.rresource.it.mrr41:parent:[unknown-version], F:\jenkins\jenkins-slave\workspace\TEST-UPGRADE-MAVEN-VERIFIER-MSRSEKFUTUGOFVEJX5JT6F73SQREM3WXYQI6H56P3MSWQOA4DOVQ\m\target\test-classes\run-only-at-execution-root\pom.xml, line 24, column 11
 @ 
[INFO] [jenkins-event-spy] Generated F:\jenkins\jenkins-slave\workspace\TEST-UPGRADE-MAVEN-VERIFIER-MSRSEKFUTUGOFVEJX5JT6F73SQREM3WXYQI6H56P3MSWQOA4DOVQ@tmp\withMaven10348613\maven-spy-20181102-065534-8597514404824898949751.log
[ERROR] The build could not read 2 projects -> [Help 1]
org.apache.maven.project.ProjectBuildingException: Some problems were encountered while processing the POMs:
[FATAL] Non-resolvable parent POM for org.apache.maven.plugin.rresource.it.mrr41:parent:[unknown-version]: Could not find artifact org.apache.maven.plugin.rresource.it:it-parent:pom:1.6-SNAPSHOT in apache-snapshots (http://repository.apache.org/snapshots/) and 'parent.relativePath' points at wrong local POM @ org.apache.maven.plugin.rresource.it.mrr41:parent:[unknown-version], F:\jenkins\jenkins-slave\workspace\TEST-UPGRADE-MAVEN-VERIFIER-MSRSEKFUTUGOFVEJX5JT6F73SQREM3WXYQI6H56P3MSWQOA4DOVQ\m\target\test-classes\run-only-at-execution-root\pom.xml, line 24, column 11
[FATAL] Non-resolvable parent POM for org.apache.maven.plugin.rresource.it.mrr41:parent:[unknown-version]: Failure to find org.apache.maven.plugin.rresource.it:it-parent:pom:1.6-SNAPSHOT in http://repository.apache.org/snapshots/ was cached in the local repository, resolution will not be reattempted until the update interval of apache-snapshots has elapsed or updates are forced and 'parent.relativePath' points at wrong local POM @ org.apache.maven.plugin.rresource.it.mrr41:parent:[unknown-version], F:\jenkins\jenkins-slave\workspace\TEST-UPGRADE-MAVEN-VERIFIER-MSRSEKFUTUGOFVEJX5JT6F73SQREM3WXYQI6H56P3MSWQOA4DOVQ\m\target\test-classes\run-only-at-execution-root\pom.xml, line 24, column 11

    at org.apache.maven.project.DefaultProjectBuilder.build (DefaultProjectBuilder.java:382)
    at org.apache.maven.graph.DefaultGraphBuilder.collectProjects (DefaultGraphBuilder.java:400)
    at org.apache.maven.graph.DefaultGraphBuilder.getProjectsForMavenReactor (DefaultGraphBuilder.java:391)
    at org.apache.maven.graph.DefaultGraphBuilder.build (DefaultGraphBuilder.java:78)
    at org.apache.maven.DefaultMaven.buildGraph (DefaultMaven.java:511)
    at org.apache.maven.DefaultMaven.doExecute (DefaultMaven.java:221)
    at org.apache.maven.DefaultMaven.doExecute (DefaultMaven.java:194)
    at org.apache.maven.DefaultMaven.execute (DefaultMaven.java:107)
    at org.apache.maven.cli.MavenCli.execute (MavenCli.java:955)
    at org.apache.maven.cli.MavenCli.doMain (MavenCli.java:290)
    at org.apache.maven.cli.MavenCli.main (MavenCli.java:194)
    at sun.reflect.NativeMethodAccessorImpl.invoke0 (Native Method)
    at sun.reflect.NativeMethodAccessorImpl.invoke (NativeMethodAccessorImpl.java:62)
    at sun.reflect.DelegatingMethodAccessorImpl.invoke (DelegatingMethodAccessorImpl.java:43)
    at java.lang.reflect.Method.invoke (Method.java:498)
    at org.codehaus.plexus.classworlds.launcher.Launcher.launchEnhanced (Launcher.java:289)
    at org.codehaus.plexus.classworlds.launcher.Launcher.launch (Launcher.java:229)
    at org.codehaus.plexus.classworlds.launcher.Launcher.mainWithExitCode (Launcher.java:415)
    at org.codehaus.plexus.classworlds.launcher.Launcher.main (Launcher.java:356)
[ERROR]   
[ERROR]   The project org.apache.maven.plugin.rresource.it.mrr41:child-1:[unknown-version] (F:\jenkins\jenkins-slave\workspace\TEST-UPGRADE-MAVEN-VERIFIER-MSRSEKFUTUGOFVEJX5JT6F73SQREM3WXYQI6H56P3MSWQOA4DOVQ\m\target\test-classes\run-only-at-execution-root\child1\pom.xml) has 1 error
[ERROR]     Non-resolvable parent POM for org.apache.maven.plugin.rresource.it.mrr41:parent:[unknown-version]: Could not find artifact org.apache.maven.plugin.rresource.it:it-parent:pom:1.6-SNAPSHOT in apache-snapshots (http://repository.apache.org/snapshots/) and 'parent.relativePath' points at wrong local POM @ org.apache.maven.plugin.rresource.it.mrr41:parent:[unknown-version], F:\jenkins\jenkins-slave\workspace\TEST-UPGRADE-MAVEN-VERIFIER-MSRSEKFUTUGOFVEJX5JT6F73SQREM3WXYQI6H56P3MSWQOA4DOVQ\m\target\test-classes\run-only-at-execution-root\pom.xml, line 24, column 11 -> [Help 2]
org.apache.maven.model.resolution.UnresolvableModelException: Could not find artifact org.apache.maven.plugin.rresource.it:it-parent:pom:1.6-SNAPSHOT in apache-snapshots (http://repository.apache.org/snapshots/)
    at org.apache.maven.project.ProjectModelResolver.resolveModel (ProjectModelResolver.java:197)
    at org.apache.maven.project.ProjectModelResolver.resolveModel (ProjectModelResolver.java:243)
    at org.apache.maven.model.building.DefaultModelBuilder.readParentExternally (DefaultModelBuilder.java:1051)
    at org.apache.maven.model.building.DefaultModelBuilder.readParent (DefaultModelBuilder.java:851)
    at org.apache.maven.model.building.DefaultModelBuilder.build (DefaultModelBuilder.java:331)
    at org.apache.maven.project.DefaultProjectBuilder.build (DefaultProjectBuilder.java:429)
    at org.apache.maven.project.DefaultProjectBuilder.build (DefaultProjectBuilder.java:398)
    at org.apache.maven.project.DefaultProjectBuilder.build (DefaultProjectBuilder.java:515)
    at org.apache.maven.project.DefaultProjectBuilder.build (DefaultProjectBuilder.java:398)
    at org.apache.maven.project.DefaultProjectBuilder.build (DefaultProjectBuilder.java:362)
    at org.apache.maven.graph.DefaultGraphBuilder.collectProjects (DefaultGraphBuilder.java:400)
    at org.apache.maven.graph.DefaultGraphBuilder.getProjectsForMavenReactor (DefaultGraphBuilder.java:391)
    at org.apache.maven.graph.DefaultGraphBuilder.build (DefaultGraphBuilder.java:78)
    at org.apache.maven.DefaultMaven.buildGraph (DefaultMaven.java:511)
    at org.apache.maven.DefaultMaven.doExecute (DefaultMaven.java:221)
    at org.apache.maven.DefaultMaven.doExecute (DefaultMaven.java:194)
    at org.apache.maven.DefaultMaven.execute (DefaultMaven.java:107)
    at org.apache.maven.cli.MavenCli.execute (MavenCli.java:955)
    at org.apache.maven.cli.MavenCli.doMain (MavenCli.java:290)
    at org.apache.maven.cli.MavenCli.main (MavenCli.java:194)
    at sun.reflect.NativeMethodAccessorImpl.invoke0 (Native Method)
    at sun.reflect.NativeMethodAccessorImpl.invoke (NativeMethodAccessorImpl.java:62)
    at sun.reflect.DelegatingMethodAccessorImpl.invoke (DelegatingMethodAccessorImpl.java:43)
    at java.lang.reflect.Method.invoke (Method.java:498)
    at org.codehaus.plexus.classworlds.launcher.Launcher.launchEnhanced (Launcher.java:289)
    at org.codehaus.plexus.classworlds.launcher.Launcher.launch (Launcher.java:229)
    at org.codehaus.plexus.classworlds.launcher.Launcher.mainWithExitCode (Launcher.java:415)
    at org.codehaus.plexus.classworlds.launcher.Launcher.main (Launcher.java:356)
Caused by: org.eclipse.aether.resolution.ArtifactResolutionException: Could not find artifact org.apache.maven.plugin.rresource.it:it-parent:pom:1.6-SNAPSHOT in apache-snapshots (http://repository.apache.org/snapshots/)
    at org.eclipse.aether.internal.impl.DefaultArtifactResolver.resolve (DefaultArtifactResolver.java:422)
    at org.eclipse.aether.internal.impl.DefaultArtifactResolver.resolveArtifacts (DefaultArtifactResolver.java:224)
    at org.eclipse.aether.internal.impl.DefaultArtifactResolver.resolveArtifact (DefaultArtifactResolver.java:201)
    at org.eclipse.aether.internal.impl.DefaultRepositorySystem.resolveArtifact (DefaultRepositorySystem.java:260)
    at org.apache.maven.project.ProjectModelResolver.resolveModel (ProjectModelResolver.java:193)
    at org.apache.maven.project.ProjectModelResolver.resolveModel (ProjectModelResolver.java:243)
    at org.apache.maven.model.building.DefaultModelBuilder.readParentExternally (DefaultModelBuilder.java:1051)
    at org.apache.maven.model.building.DefaultModelBuilder.readParent (DefaultModelBuilder.java:851)
    at org.apache.maven.model.building.DefaultModelBuilder.build (DefaultModelBuilder.java:331)
    at org.apache.maven.project.DefaultProjectBuilder.build (DefaultProjectBuilder.java:429)
    at org.apache.maven.project.DefaultProjectBuilder.build (DefaultProjectBuilder.java:398)
    at org.apache.maven.project.DefaultProjectBuilder.build (DefaultProjectBuilder.java:515)
    at org.apache.maven.project.DefaultProjectBuilder.build (DefaultProjectBuilder.java:398)
    at org.apache.maven.project.DefaultProjectBuilder.build (DefaultProjectBuilder.java:362)
    at org.apache.maven.graph.DefaultGraphBuilder.collectProjects (DefaultGraphBuilder.java:400)
    at org.apache.maven.graph.DefaultGraphBuilder.getProjectsForMavenReactor (DefaultGraphBuilder.java:391)
    at org.apache.maven.graph.DefaultGraphBuilder.build (DefaultGraphBuilder.java:78)
    at org.apache.maven.DefaultMaven.buildGraph (DefaultMaven.java:511)
    at org.apache.maven.DefaultMaven.doExecute (DefaultMaven.java:221)
    at org.apache.maven.DefaultMaven.doExecute (DefaultMaven.java:194)
    at org.apache.maven.DefaultMaven.execute (DefaultMaven.java:107)
    at org.apache.maven.cli.MavenCli.execute (MavenCli.java:955)
    at org.apache.maven.cli.MavenCli.doMain (MavenCli.java:290)
    at org.apache.maven.cli.MavenCli.main (MavenCli.java:194)
    at sun.reflect.NativeMethodAccessorImpl.invoke0 (Native Method)
    at sun.reflect.NativeMethodAccessorImpl.invoke (NativeMethodAccessorImpl.java:62)
    at sun.reflect.DelegatingMethodAccessorImpl.invoke (DelegatingMethodAccessorImpl.java:43)
    at java.lang.reflect.Method.invoke (Method.java:498)
    at org.codehaus.plexus.classworlds.launcher.Launcher.launchEnhanced (Launcher.java:289)
    at org.codehaus.plexus.classworlds.launcher.Launcher.launch (Launcher.java:229)
    at org.codehaus.plexus.classworlds.launcher.Launcher.mainWithExitCode (Launcher.java:415)
    at org.codehaus.plexus.classworlds.launcher.Launcher.main (Launcher.java:356)
Caused by: org.eclipse.aether.transfer.ArtifactNotFoundException: Could not find artifact org.apache.maven.plugin.rresource.it:it-parent:pom:1.6-SNAPSHOT in apache-snapshots (http://repository.apache.org/snapshots/)
    at org.eclipse.aether.connector.basic.ArtifactTransportListener.transferFailed (ArtifactTransportListener.java:48)
    at org.eclipse.aether.connector.basic.BasicRepositoryConnector$TaskRunner.run (BasicRepositoryConnector.java:365)
    at org.eclipse.aether.util.concurrency.RunnableErrorForwarder$1.run (RunnableErrorForwarder.java:75)
    at org.eclipse.aether.connector.basic.BasicRepositoryConnector$DirectExecutor.execute (BasicRepositoryConnector.java:583)
    at org.eclipse.aether.connector.basic.BasicRepositoryConnector.get (BasicRepositoryConnector.java:259)
    at org.eclipse.aether.internal.impl.DefaultArtifactResolver.performDownloads (DefaultArtifactResolver.java:498)
    at org.eclipse.aether.internal.impl.DefaultArtifactResolver.resolve (DefaultArtifactResolver.java:399)
    at org.eclipse.aether.internal.impl.DefaultArtifactResolver.resolveArtifacts (DefaultArtifactResolver.java:224)
    at org.eclipse.aether.internal.impl.DefaultArtifactResolver.resolveArtifact (DefaultArtifactResolver.java:201)
    at org.eclipse.aether.internal.impl.DefaultRepositorySystem.resolveArtifact (DefaultRepositorySystem.java:260)
    at org.apache.maven.project.ProjectModelResolver.resolveModel (ProjectModelResolver.java:193)
    at org.apache.maven.project.ProjectModelResolver.resolveModel (ProjectModelResolver.java:243)
    at org.apache.maven.model.building.DefaultModelBuilder.readParentExternally (DefaultModelBuilder.java:1051)
    at org.apache.maven.model.building.DefaultModelBuilder.readParent (DefaultModelBuilder.java:851)
    at org.apache.maven.model.building.DefaultModelBuilder.build (DefaultModelBuilder.java:331)
    at org.apache.maven.project.DefaultProjectBuilder.build (DefaultProjectBuilder.java:429)
    at org.apache.maven.project.DefaultProjectBuilder.build (DefaultProjectBuilder.java:398)
    at org.apache.maven.project.DefaultProjectBuilder.build (DefaultProjectBuilder.java:515)
    at org.apache.maven.project.DefaultProjectBuilder.build (DefaultProjectBuilder.java:398)
    at org.apache.maven.project.DefaultProjectBuilder.build (DefaultProjectBuilder.java:362)
    at org.apache.maven.graph.DefaultGraphBuilder.collectProjects (DefaultGraphBuilder.java:400)
    at org.apache.maven.graph.DefaultGraphBuilder.getProjectsForMavenReactor (DefaultGraphBuilder.java:391)
    at org.apache.maven.graph.DefaultGraphBuilder.build (DefaultGraphBuilder.java:78)
    at org.apache.maven.DefaultMaven.buildGraph (DefaultMaven.java:511)
    at org.apache.maven.DefaultMaven.doExecute (DefaultMaven.java:221)
    at org.apache.maven.DefaultMaven.doExecute (DefaultMaven.java:194)
    at org.apache.maven.DefaultMaven.execute (DefaultMaven.java:107)
    at org.apache.maven.cli.MavenCli.execute (MavenCli.java:955)
    at org.apache.maven.cli.MavenCli.doMain (MavenCli.java:290)
    at org.apache.maven.cli.MavenCli.main (MavenCli.java:194)
    at sun.reflect.NativeMethodAccessorImpl.invoke0 (Native Method)
    at sun.reflect.NativeMethodAccessorImpl.invoke (NativeMethodAccessorImpl.java:62)
    at sun.reflect.DelegatingMethodAccessorImpl.invoke (DelegatingMethodAccessorImpl.java:43)
    at java.lang.reflect.Method.invoke (Method.java:498)
    at org.codehaus.plexus.classworlds.launcher.Launcher.launchEnhanced (Launcher.java:289)
    at org.codehaus.plexus.classworlds.launcher.Launcher.launch (Launcher.java:229)
    at org.codehaus.plexus.classworlds.launcher.Launcher.mainWithExitCode (Launcher.java:415)
    at org.codehaus.plexus.classworlds.launcher.Launcher.main (Launcher.java:356)
[ERROR]   
[ERROR]   The project org.apache.maven.plugin.rresource.it.mrr41:child-2:[unknown-version] (F:\jenkins\jenkins-slave\workspace\TEST-UPGRADE-MAVEN-VERIFIER-MSRSEKFUTUGOFVEJX5JT6F73SQREM3WXYQI6H56P3MSWQOA4DOVQ\m\target\test-classes\run-only-at-execution-root\child2\pom.xml) has 1 error
[ERROR]     Non-resolvable parent POM for org.apache.maven.plugin.rresource.it.mrr41:parent:[unknown-version]: Failure to find org.apache.maven.plugin.rresource.it:it-parent:pom:1.6-SNAPSHOT in http://repository.apache.org/snapshots/ was cached in the local repository, resolution will not be reattempted until the update interval of apache-snapshots has elapsed or updates are forced and 'parent.relativePath' points at wrong local POM @ org.apache.maven.plugin.rresource.it.mrr41:parent:[unknown-version], F:\jenkins\jenkins-slave\workspace\TEST-UPGRADE-MAVEN-VERIFIER-MSRSEKFUTUGOFVEJX5JT6F73SQREM3WXYQI6H56P3MSWQOA4DOVQ\m\target\test-classes\run-only-at-execution-root\pom.xml, line 24, column 11 -> [Help 2]
org.apache.maven.model.resolution.UnresolvableModelException: Failure to find org.apache.maven.plugin.rresource.it:it-parent:pom:1.6-SNAPSHOT in http://repository.apache.org/snapshots/ was cached in the local repository, resolution will not be reattempted until the update interval of apache-snapshots has elapsed or updates are forced
    at org.apache.maven.project.ProjectModelResolver.resolveModel (ProjectModelResolver.java:197)
    at org.apache.maven.project.ProjectModelResolver.resolveModel (ProjectModelResolver.java:243)
    at org.apache.maven.model.building.DefaultModelBuilder.readParentExternally (DefaultModelBuilder.java:1051)
    at org.apache.maven.model.building.DefaultModelBuilder.readParent (DefaultModelBuilder.java:851)
    at org.apache.maven.model.building.DefaultModelBuilder.build (DefaultModelBuilder.java:331)
    at org.apache.maven.project.DefaultProjectBuilder.build (DefaultProjectBuilder.java:429)
    at org.apache.maven.project.DefaultProjectBuilder.build (DefaultProjectBuilder.java:398)
    at org.apache.maven.project.DefaultProjectBuilder.build (DefaultProjectBuilder.java:515)
    at org.apache.maven.project.DefaultProjectBuilder.build (DefaultProjectBuilder.java:398)
    at org.apache.maven.project.DefaultProjectBuilder.build (DefaultProjectBuilder.java:362)
    at org.apache.maven.graph.DefaultGraphBuilder.collectProjects (DefaultGraphBuilder.java:400)
    at org.apache.maven.graph.DefaultGraphBuilder.getProjectsForMavenReactor (DefaultGraphBuilder.java:391)
    at org.apache.maven.graph.DefaultGraphBuilder.build (DefaultGraphBuilder.java:78)
    at org.apache.maven.DefaultMaven.buildGraph (DefaultMaven.java:511)
    at org.apache.maven.DefaultMaven.doExecute (DefaultMaven.java:221)
    at org.apache.maven.DefaultMaven.doExecute (DefaultMaven.java:194)
    at org.apache.maven.DefaultMaven.execute (DefaultMaven.java:107)
    at org.apache.maven.cli.MavenCli.execute (MavenCli.java:955)
    at org.apache.maven.cli.MavenCli.doMain (MavenCli.java:290)
    at org.apache.maven.cli.MavenCli.main (MavenCli.java:194)
    at sun.reflect.NativeMethodAccessorImpl.invoke0 (Native Method)
    at sun.reflect.NativeMethodAccessorImpl.invoke (NativeMethodAccessorImpl.java:62)
    at sun.reflect.DelegatingMethodAccessorImpl.invoke (DelegatingMethodAccessorImpl.java:43)
    at java.lang.reflect.Method.invoke (Method.java:498)
    at org.codehaus.plexus.classworlds.launcher.Launcher.launchEnhanced (Launcher.java:289)
    at org.codehaus.plexus.classworlds.launcher.Launcher.launch (Launcher.java:229)
    at org.codehaus.plexus.classworlds.launcher.Launcher.mainWithExitCode (Launcher.java:415)
    at org.codehaus.plexus.classworlds.launcher.Launcher.main (Launcher.java:356)
Caused by: org.eclipse.aether.resolution.ArtifactResolutionException: Failure to find org.apache.maven.plugin.rresource.it:it-parent:pom:1.6-SNAPSHOT in http://repository.apache.org/snapshots/ was cached in the local repository, resolution will not be reattempted until the update interval of apache-snapshots has elapsed or updates are forced
    at org.eclipse.aether.internal.impl.DefaultArtifactResolver.resolve (DefaultArtifactResolver.java:422)
    at org.eclipse.aether.internal.impl.DefaultArtifactResolver.resolveArtifacts (DefaultArtifactResolver.java:224)
    at org.eclipse.aether.internal.impl.DefaultArtifactResolver.resolveArtifact (DefaultArtifactResolver.java:201)
    at org.eclipse.aether.internal.impl.DefaultRepositorySystem.resolveArtifact (DefaultRepositorySystem.java:260)
    at org.apache.maven.project.ProjectModelResolver.resolveModel (ProjectModelResolver.java:193)
    at org.apache.maven.project.ProjectModelResolver.resolveModel (ProjectModelResolver.java:243)
    at org.apache.maven.model.building.DefaultModelBuilder.readParentExternally (DefaultModelBuilder.java:1051)
    at org.apache.maven.model.building.DefaultModelBuilder.readParent (DefaultModelBuilder.java:851)
    at org.apache.maven.model.building.DefaultModelBuilder.build (DefaultModelBuilder.java:331)
    at org.apache.maven.project.DefaultProjectBuilder.build (DefaultProjectBuilder.java:429)
    at org.apache.maven.project.DefaultProjectBuilder.build (DefaultProjectBuilder.java:398)
    at org.apache.maven.project.DefaultProjectBuilder.build (DefaultProjectBuilder.java:515)
    at org.apache.maven.project.DefaultProjectBuilder.build (DefaultProjectBuilder.java:398)
    at org.apache.maven.project.DefaultProjectBuilder.build (DefaultProjectBuilder.java:362)
    at org.apache.maven.graph.DefaultGraphBuilder.collectProjects (DefaultGraphBuilder.java:400)
    at org.apache.maven.graph.DefaultGraphBuilder.getProjectsForMavenReactor (DefaultGraphBuilder.java:391)
    at org.apache.maven.graph.DefaultGraphBuilder.build (DefaultGraphBuilder.java:78)
    at org.apache.maven.DefaultMaven.buildGraph (DefaultMaven.java:511)
    at org.apache.maven.DefaultMaven.doExecute (DefaultMaven.java:221)
    at org.apache.maven.DefaultMaven.doExecute (DefaultMaven.java:194)
    at org.apache.maven.DefaultMaven.execute (DefaultMaven.java:107)
    at org.apache.maven.cli.MavenCli.execute (MavenCli.java:955)
    at org.apache.maven.cli.MavenCli.doMain (MavenCli.java:290)
    at org.apache.maven.cli.MavenCli.main (MavenCli.java:194)
    at sun.reflect.NativeMethodAccessorImpl.invoke0 (Native Method)
    at sun.reflect.NativeMethodAccessorImpl.invoke (NativeMethodAccessorImpl.java:62)
    at sun.reflect.DelegatingMethodAccessorImpl.invoke (DelegatingMethodAccessorImpl.java:43)
    at java.lang.reflect.Method.invoke (Method.java:498)
    at org.codehaus.plexus.classworlds.launcher.Launcher.launchEnhanced (Launcher.java:289)
    at org.codehaus.plexus.classworlds.launcher.Launcher.launch (Launcher.java:229)
    at org.codehaus.plexus.classworlds.launcher.Launcher.mainWithExitCode (Launcher.java:415)
    at org.codehaus.plexus.classworlds.launcher.Launcher.main (Launcher.java:356)
Caused by: org.eclipse.aether.transfer.ArtifactNotFoundException: Failure to find org.apache.maven.plugin.rresource.it:it-parent:pom:1.6-SNAPSHOT in http://repository.apache.org/snapshots/ was cached in the local repository, resolution will not be reattempted until the update interval of apache-snapshots has elapsed or updates are forced
    at org.eclipse.aether.internal.impl.DefaultUpdateCheckManager.newException (DefaultUpdateCheckManager.java:233)
    at org.eclipse.aether.internal.impl.DefaultUpdateCheckManager.checkArtifact (DefaultUpdateCheckManager.java:185)
    at org.eclipse.aether.internal.impl.DefaultArtifactResolver.gatherDownloads (DefaultArtifactResolver.java:563)
    at org.eclipse.aether.internal.impl.DefaultArtifactResolver.performDownloads (DefaultArtifactResolver.java:481)
    at org.eclipse.aether.internal.impl.DefaultArtifactResolver.resolve (DefaultArtifactResolver.java:399)
    at org.eclipse.aether.internal.impl.DefaultArtifactResolver.resolveArtifacts (DefaultArtifactResolver.java:224)
    at org.eclipse.aether.internal.impl.DefaultArtifactResolver.resolveArtifact (DefaultArtifactResolver.java:201)
    at org.eclipse.aether.internal.impl.DefaultRepositorySystem.resolveArtifact (DefaultRepositorySystem.java:260)
    at org.apache.maven.project.ProjectModelResolver.resolveModel (ProjectModelResolver.java:193)
    at org.apache.maven.project.ProjectModelResolver.resolveModel (ProjectModelResolver.java:243)
    at org.apache.maven.model.building.DefaultModelBuilder.readParentExternally (DefaultModelBuilder.java:1051)
    at org.apache.maven.model.building.DefaultModelBuilder.readParent (DefaultModelBuilder.java:851)
    at org.apache.maven.model.building.DefaultModelBuilder.build (DefaultModelBuilder.java:331)
    at org.apache.maven.project.DefaultProjectBuilder.build (DefaultProjectBuilder.java:429)
    at org.apache.maven.project.DefaultProjectBuilder.build (DefaultProjectBuilder.java:398)
    at org.apache.maven.project.DefaultProjectBuilder.build (DefaultProjectBuilder.java:515)
    at org.apache.maven.project.DefaultProjectBuilder.build (DefaultProjectBuilder.java:398)
    at org.apache.maven.project.DefaultProjectBuilder.build (DefaultProjectBuilder.java:362)
    at org.apache.maven.graph.DefaultGraphBuilder.collectProjects (DefaultGraphBuilder.java:400)
    at org.apache.maven.graph.DefaultGraphBuilder.getProjectsForMavenReactor (DefaultGraphBuilder.java:391)
    at org.apache.maven.graph.DefaultGraphBuilder.build (DefaultGraphBuilder.java:78)
    at org.apache.maven.DefaultMaven.buildGraph (DefaultMaven.java:511)
    at org.apache.maven.DefaultMaven.doExecute (DefaultMaven.java:221)
    at org.apache.maven.DefaultMaven.doExecute (DefaultMaven.java:194)
    at org.apache.maven.DefaultMaven.execute (DefaultMaven.java:107)
    at org.apache.maven.cli.MavenCli.execute (MavenCli.java:955)
    at org.apache.maven.cli.MavenCli.doMain (MavenCli.java:290)
    at org.apache.maven.cli.MavenCli.main (MavenCli.java:194)
    at sun.reflect.NativeMethodAccessorImpl.invoke0 (Native Method)
    at sun.reflect.NativeMethodAccessorImpl.invoke (NativeMethodAccessorImpl.java:62)
    at sun.reflect.DelegatingMethodAccessorImpl.invoke (DelegatingMethodAccessorImpl.java:43)
    at java.lang.reflect.Method.invoke (Method.java:498)
    at org.codehaus.plexus.classworlds.launcher.Launcher.launchEnhanced (Launcher.java:289)
    at org.codehaus.plexus.classworlds.launcher.Launcher.launch (Launcher.java:229)
    at org.codehaus.plexus.classworlds.launcher.Launcher.mainWithExitCode (Launcher.java:415)
    at org.codehaus.plexus.classworlds.launcher.Launcher.main (Launcher.java:356)
[ERROR] 
[ERROR] Re-run Maven using the -X switch to enable full debug logging.
[ERROR] 
[ERROR] For more information about the errors and possible solutions, please read the following articles:
[ERROR] [Help 1] http://cwiki.apache.org/confluence/display/MAVEN/ProjectBuildingException
[ERROR] [Help 2] http://cwiki.apache.org/confluence/display/MAVEN/UnresolvableModelException
Picked up JAVA_TOOL_OPTIONS: -Dmaven.ext.class.path="f:\jenkins\jenkins-slave\workspace\TEST-UPGRADE-MAVEN-VERIFIER-MSRSEKFUTUGOFVEJX5JT6F73SQREM3WXYQI6H56P3MSWQOA4DOVQ@tmp\withMaven10348613\pipeline-maven-spy.jar" -Dorg.jenkinsci.plugins.pipeline.maven.reportsFolder="f:\jenkins\jenkins-slave\workspace\TEST-UPGRADE-MAVEN-VERIFIER-MSRSEKFUTUGOFVEJX5JT6F73SQREM3WXYQI6H56P3MSWQOA4DOVQ@tmp\withMaven10348613" 


Stack Trace:
org.apache.maven.it.VerificationException: 
Exit code was non-zero: 1; command line and log = 
F:\jenkins\tools\maven\apache-maven-3.5.2\bin\mvn -e --batch-mode -Dmaven.repo.local=f:\jenkins\jenkins-slave\workspace\TEST-UPGRADE-MAVEN-VERIFIER-MSRSEKFUTUGOFVEJX5JT6F73SQREM3WXYQI6H56P3MSWQOA4DOVQ\m\target/it-repo org.apache.maven.plugins:maven-clean-plugin:clean generate-resources
[INFO] [jenkins-event-spy] Generate F:\jenkins\jenkins-slave\workspace\TEST-UPGRADE-MAVEN-VERIFIER-MSRSEKFUTUGOFVEJX5JT6F73SQREM3WXYQI6H56P3MSWQOA4DOVQ@tmp\withMaven10348613\maven-spy-20181102-065534-8597514404824898949751.log.tmp ...
[INFO] Error stacktraces are turned on.
[INFO] Scanning for projects...
[INFO] Downloading from apache-snapshots: http://repository.apache.org/snapshots/org/apache/maven/plugin/rresource/it/it-parent/1.6-SNAPSHOT/maven-metadata.xml
[INFO] Downloading from apache-snapshots: http://repository.apache.org/snapshots/org/apache/maven/plugin/rresource/it/it-parent/1.6-SNAPSHOT/it-parent-1.6-SNAPSHOT.pom
[ERROR] [ERROR] Some problems were encountered while processing the POMs:
[FATAL] Non-resolvable parent POM for org.apache.maven.plugin.rresource.it.mrr41:parent:[unknown-version]: Could not find artifact org.apache.maven.plugin.rresource.it:it-parent:pom:1.6-SNAPSHOT in apache-snapshots (http://repository.apache.org/snapshots/) and 'parent.relativePath' points at wrong local POM @ org.apache.maven.plugin.rresource.it.mrr41:parent:[unknown-version], F:\jenkins\jenkins-slave\workspace\TEST-UPGRADE-MAVEN-VERIFIER-MSRSEKFUTUGOFVEJX5JT6F73SQREM3WXYQI6H56P3MSWQOA4DOVQ\m\target\test-classes\run-only-at-execution-root\pom.xml, line 24, column 11
[FATAL] Non-resolvable parent POM for org.apache.maven.plugin.rresource.it.mrr41:parent:[unknown-version]: Failure to find org.apache.maven.plugin.rresource.it:it-parent:pom:1.6-SNAPSHOT in http://repository.apache.org/snapshots/ was cached in the local repository, resolution will not be reattempted until the update interval of apache-snapshots has elapsed or updates are forced and 'parent.relativePath' points at wrong local POM @ org.apache.maven.plugin.rresource.it.mrr41:parent:[unknown-version], F:\jenkins\jenkins-slave\workspace\TEST-UPGRADE-MAVEN-VERIFIER-MSRSEKFUTUGOFVEJX5JT6F73SQREM3WXYQI6H56P3MSWQOA4DOVQ\m\target\test-classes\run-only-at-execution-root\pom.xml, line 24, column 11
 @ 
[INFO] [jenkins-event-spy] Generated F:\jenkins\jenkins-slave\workspace\TEST-UPGRADE-MAVEN-VERIFIER-MSRSEKFUTUGOFVEJX5JT6F73SQREM3WXYQI6H56P3MSWQOA4DOVQ@tmp\withMaven10348613\maven-spy-20181102-065534-8597514404824898949751.log
[ERROR] The build could not read 2 projects -> [Help 1]
org.apache.maven.project.ProjectBuildingException: Some problems were encountered while processing the POMs:
[FATAL] Non-resolvable parent POM for org.apache.maven.plugin.rresource.it.mrr41:parent:[unknown-version]: Could not find artifact org.apache.maven.plugin.rresource.it:it-parent:pom:1.6-SNAPSHOT in apache-snapshots (http://repository.apache.org/snapshots/) and 'parent.relativePath' points at wrong local POM @ org.apache.maven.plugin.rresource.it.mrr41:parent:[unknown-version], F:\jenkins\jenkins-slave\workspace\TEST-UPGRADE-MAVEN-VERIFIER-MSRSEKFUTUGOFVEJX5JT6F73SQREM3WXYQI6H56P3MSWQOA4DOVQ\m\target\test-classes\run-only-at-execution-root\pom.xml, line 24, column 11
[FATAL] Non-resolvable parent POM for org.apache.maven.plugin.rresource.it.mrr41:parent:[unknown-version]: Failure to find org.apache.maven.plugin.rresource.it:it-parent:pom:1.6-SNAPSHOT in http://repository.apache.org/snapshots/ was cached in the local repository, resolution will not be reattempted until the update interval of apache-snapshots has elapsed or updates are forced and 'parent.relativePath' points at wrong local POM @ org.apache.maven.plugin.rresource.it.mrr41:parent:[unknown-version], F:\jenkins\jenkins-slave\workspace\TEST-UPGRADE-MAVEN-VERIFIER-MSRSEKFUTUGOFVEJX5JT6F73SQREM3WXYQI6H56P3MSWQOA4DOVQ\m\target\test-classes\run-only-at-execution-root\pom.xml, line 24, column 11

    at org.apache.maven.project.DefaultProjectBuilder.build (DefaultProjectBuilder.java:382)
    at org.apache.maven.graph.DefaultGraphBuilder.collectProjects (DefaultGraphBuilder.java:400)
    at org.apache.maven.graph.DefaultGraphBuilder.getProjectsForMavenReactor (DefaultGraphBuilder.java:391)
    at org.apache.maven.graph.DefaultGraphBuilder.build (DefaultGraphBuilder.java:78)
    at org.apache.maven.DefaultMaven.buildGraph (DefaultMaven.java:511)
    at org.apache.maven.DefaultMaven.doExecute (DefaultMaven.java:221)
    at org.apache.maven.DefaultMaven.doExecute (DefaultMaven.java:194)
    at org.apache.maven.DefaultMaven.execute (DefaultMaven.java:107)
    at org.apache.maven.cli.MavenCli.execute (MavenCli.java:955)
    at org.apache.maven.cli.MavenCli.doMain (MavenCli.java:290)
    at org.apache.maven.cli.MavenCli.main (MavenCli.java:194)
    at sun.reflect.NativeMethodAccessorImpl.invoke0 (Native Method)
    at sun.reflect.NativeMethodAccessorImpl.invoke (NativeMethodAccessorImpl.java:62)
    at sun.reflect.DelegatingMethodAccessorImpl.invoke (DelegatingMethodAccessorImpl.java:43)
    at java.lang.reflect.Method.invoke (Method.java:498)
    at org.codehaus.plexus.classworlds.launcher.Launcher.launchEnhanced (Launcher.java:289)
    at org.codehaus.plexus.classworlds.launcher.Launcher.launch (Launcher.java:229)
    at org.codehaus.plexus.classworlds.launcher.Launcher.mainWithExitCode (Launcher.java:415)
    at org.codehaus.plexus.classworlds.launcher.Launcher.main (Launcher.java:356)
[ERROR]   
[ERROR]   The project org.apache.maven.plugin.rresource.it.mrr41:child-1:[unknown-version] (F:\jenkins\jenkins-slave\workspace\TEST-UPGRADE-MAVEN-VERIFIER-MSRSEKFUTUGOFVEJX5JT6F73SQREM3WXYQI6H56P3MSWQOA4DOVQ\m\target\test-classes\run-only-at-execution-root\child1\pom.xml) has 1 error
[ERROR]     Non-resolvable parent POM for org.apache.maven.plugin.rresource.it.mrr41:parent:[unknown-version]: Could not find artifact org.apache.maven.plugin.rresource.it:it-parent:pom:1.6-SNAPSHOT in apache-snapshots (http://repository.apache.org/snapshots/) and 'parent.relativePath' points at wrong local POM @ org.apache.maven.plugin.rresource.it.mrr41:parent:[unknown-version], F:\jenkins\jenkins-slave\workspace\TEST-UPGRADE-MAVEN-VERIFIER-MSRSEKFUTUGOFVEJX5JT6F73SQREM3WXYQI6H56P3MSWQOA4DOVQ\m\target\test-classes\run-only-at-execution-root\pom.xml, line 24, column 11 -> [Help 2]
org.apache.maven.model.resolution.UnresolvableModelException: Could not find artifact org.apache.maven.plugin.rresource.it:it-parent:pom:1.6-SNAPSHOT in apache-snapshots (http://repository.apache.org/snapshots/)
    at org.apache.maven.project.ProjectModelResolver.resolveModel (ProjectModelResolver.java:197)
    at org.apache.maven.project.ProjectModelResolver.resolveModel (ProjectModelResolver.java:243)
    at org.apache.maven.model.building.DefaultModelBuilder.readParentExternally (DefaultModelBuilder.java:1051)
    at org.apache.maven.model.building.DefaultModelBuilder.readParent (DefaultModelBuilder.java:851)
    at org.apache.maven.model.building.DefaultModelBuilder.build (DefaultModelBuilder.java:331)
    at org.apache.maven.project.DefaultProjectBuilder.build (DefaultProjectBuilder.java:429)
    at org.apache.maven.project.DefaultProjectBuilder.build (DefaultProjectBuilder.java:398)
    at org.apache.maven.project.DefaultProjectBuilder.build (DefaultProjectBuilder.java:515)
    at org.apache.maven.project.DefaultProjectBuilder.build (DefaultProjectBuilder.java:398)
    at org.apache.maven.project.DefaultProjectBuilder.build (DefaultProjectBuilder.java:362)
    at org.apache.maven.graph.DefaultGraphBuilder.collectProjects (DefaultGraphBuilder.java:400)
    at org.apache.maven.graph.DefaultGraphBuilder.getProjectsForMavenReactor (DefaultGraphBuilder.java:391)
    at org.apache.maven.graph.DefaultGraphBuilder.build (DefaultGraphBuilder.java:78)
    at org.apache.maven.DefaultMaven.buildGraph (DefaultMaven.java:511)
    at org.apache.maven.DefaultMaven.doExecute (DefaultMaven.java:221)
    at org.apache.maven.DefaultMaven.doExecute (DefaultMaven.java:194)
    at org.apache.maven.DefaultMaven.execute (DefaultMaven.java:107)
    at org.apache.maven.cli.MavenCli.execute (MavenCli.java:955)
    at org.apache.maven.cli.MavenCli.doMain (MavenCli.java:290)
    at org.apache.maven.cli.MavenCli.main (MavenCli.java:194)
    at sun.reflect.NativeMethodAccessorImpl.invoke0 (Native Method)
    at sun.reflect.NativeMethodAccessorImpl.invoke (NativeMethodAccessorImpl.java:62)
    at sun.reflect.DelegatingMethodAccessorImpl.invoke (DelegatingMethodAccessorImpl.java:43)
    at java.lang.reflect.Method.invoke (Method.java:498)
    at org.codehaus.plexus.classworlds.launcher.Launcher.launchEnhanced (Launcher.java:289)
    at org.codehaus.plexus.classworlds.launcher.Launcher.launch (Launcher.java:229)
    at org.codehaus.plexus.classworlds.launcher.Launcher.mainWithExitCode (Launcher.java:415)
    at org.codehaus.plexus.classworlds.launcher.Launcher.main (Launcher.java:356)
Caused by: org.eclipse.aether.resolution.ArtifactResolutionException: Could not find artifact org.apache.maven.plugin.rresource.it:it-parent:pom:1.6-SNAPSHOT in apache-snapshots (http://repository.apache.org/snapshots/)
    at org.eclipse.aether.internal.impl.DefaultArtifactResolver.resolve (DefaultArtifactResolver.java:422)
    at org.eclipse.aether.internal.impl.DefaultArtifactResolver.resolveArtifacts (DefaultArtifactResolver.java:224)
    at org.eclipse.aether.internal.impl.DefaultArtifactResolver.resolveArtifact (DefaultArtifactResolver.java:201)
    at org.eclipse.aether.internal.impl.DefaultRepositorySystem.resolveArtifact (DefaultRepositorySystem.java:260)
    at org.apache.maven.project.ProjectModelResolver.resolveModel (ProjectModelResolver.java:193)
    at org.apache.maven.project.ProjectModelResolver.resolveModel (ProjectModelResolver.java:243)
    at org.apache.maven.model.building.DefaultModelBuilder.readParentExternally (DefaultModelBuilder.java:1051)
    at org.apache.maven.model.building.DefaultModelBuilder.readParent (DefaultModelBuilder.java:851)
    at org.apache.maven.model.building.DefaultModelBuilder.build (DefaultModelBuilder.java:331)
    at org.apache.maven.project.DefaultProjectBuilder.build (DefaultProjectBuilder.java:429)
    at org.apache.maven.project.DefaultProjectBuilder.build (DefaultProjectBuilder.java:398)
    at org.apache.maven.project.DefaultProjectBuilder.build (DefaultProjectBuilder.java:515)
    at org.apache.maven.project.DefaultProjectBuilder.build (DefaultProjectBuilder.java:398)
    at org.apache.maven.project.DefaultProjectBuilder.build (DefaultProjectBuilder.java:362)
    at org.apache.maven.graph.DefaultGraphBuilder.collectProjects (DefaultGraphBuilder.java:400)
    at org.apache.maven.graph.DefaultGraphBuilder.getProjectsForMavenReactor (DefaultGraphBuilder.java:391)
    at org.apache.maven.graph.DefaultGraphBuilder.build (DefaultGraphBuilder.java:78)
    at org.apache.maven.DefaultMaven.buildGraph (DefaultMaven.java:511)
    at org.apache.maven.DefaultMaven.doExecute (DefaultMaven.java:221)
    at org.apache.maven.DefaultMaven.doExecute (DefaultMaven.java:194)
    at org.apache.maven.DefaultMaven.execute (DefaultMaven.java:107)
    at org.apache.maven.cli.MavenCli.execute (MavenCli.java:955)
    at org.apache.maven.cli.MavenCli.doMain (MavenCli.java:290)
    at org.apache.maven.cli.MavenCli.main (MavenCli.java:194)
    at sun.reflect.NativeMethodAccessorImpl.invoke0 (Native Method)
    at sun.reflect.NativeMethodAccessorImpl.invoke (NativeMethodAccessorImpl.java:62)
    at sun.reflect.DelegatingMethodAccessorImpl.invoke (DelegatingMethodAccessorImpl.java:43)
    at java.lang.reflect.Method.invoke (Method.java:498)
    at org.codehaus.plexus.classworlds.launcher.Launcher.launchEnhanced (Launcher.java:289)
    at org.codehaus.plexus.classworlds.launcher.Launcher.launch (Launcher.java:229)
    at org.codehaus.plexus.classworlds.launcher.Launcher.mainWithExitCode (Launcher.java:415)
    at org.codehaus.plexus.classworlds.launcher.Launcher.main (Launcher.java:356)
Caused by: org.eclipse.aether.transfer.ArtifactNotFoundException: Could not find artifact org.apache.maven.plugin.rresource.it:it-parent:pom:1.6-SNAPSHOT in apache-snapshots (http://repository.apache.org/snapshots/)
    at org.eclipse.aether.connector.basic.ArtifactTransportListener.transferFailed (ArtifactTransportListener.java:48)
    at org.eclipse.aether.connector.basic.BasicRepositoryConnector$TaskRunner.run (BasicRepositoryConnector.java:365)
    at org.eclipse.aether.util.concurrency.RunnableErrorForwarder$1.run (RunnableErrorForwarder.java:75)
    at org.eclipse.aether.connector.basic.BasicRepositoryConnector$DirectExecutor.execute (BasicRepositoryConnector.java:583)
    at org.eclipse.aether.connector.basic.BasicRepositoryConnector.get (BasicRepositoryConnector.java:259)
    at org.eclipse.aether.internal.impl.DefaultArtifactResolver.performDownloads (DefaultArtifactResolver.java:498)
    at org.eclipse.aether.internal.impl.DefaultArtifactResolver.resolve (DefaultArtifactResolver.java:399)
    at org.eclipse.aether.internal.impl.DefaultArtifactResolver.resolveArtifacts (DefaultArtifactResolver.java:224)
    at org.eclipse.aether.internal.impl.DefaultArtifactResolver.resolveArtifact (DefaultArtifactResolver.java:201)
    at org.eclipse.aether.internal.impl.DefaultRepositorySystem.resolveArtifact (DefaultRepositorySystem.java:260)
    at org.apache.maven.project.ProjectModelResolver.resolveModel (ProjectModelResolver.java:193)
    at org.apache.maven.project.ProjectModelResolver.resolveModel (ProjectModelResolver.java:243)
    at org.apache.maven.model.building.DefaultModelBuilder.readParentExternally (DefaultModelBuilder.java:1051)
    at org.apache.maven.model.building.DefaultModelBuilder.readParent (DefaultModelBuilder.java:851)
    at org.apache.maven.model.building.DefaultModelBuilder.build (DefaultModelBuilder.java:331)
    at org.apache.maven.project.DefaultProjectBuilder.build (DefaultProjectBuilder.java:429)
    at org.apache.maven.project.DefaultProjectBuilder.build (DefaultProjectBuilder.java:398)
    at org.apache.maven.project.DefaultProjectBuilder.build (DefaultProjectBuilder.java:515)
    at org.apache.maven.project.DefaultProjectBuilder.build (DefaultProjectBuilder.java:398)
    at org.apache.maven.project.DefaultProjectBuilder.build (DefaultProjectBuilder.java:362)
    at org.apache.maven.graph.DefaultGraphBuilder.collectProjects (DefaultGraphBuilder.java:400)
    at org.apache.maven.graph.DefaultGraphBuilder.getProjectsForMavenReactor (DefaultGraphBuilder.java:391)
    at org.apache.maven.graph.DefaultGraphBuilder.build (DefaultGraphBuilder.java:78)
    at org.apache.maven.DefaultMaven.buildGraph (DefaultMaven.java:511)
    at org.apache.maven.DefaultMaven.doExecute (DefaultMaven.java:221)
    at org.apache.maven.DefaultMaven.doExecute (DefaultMaven.java:194)
    at org.apache.maven.DefaultMaven.execute (DefaultMaven.java:107)
    at org.apache.maven.cli.MavenCli.execute (MavenCli.java:955)
    at org.apache.maven.cli.MavenCli.doMain (MavenCli.java:290)
    at org.apache.maven.cli.MavenCli.main (MavenCli.java:194)
    at sun.reflect.NativeMethodAccessorImpl.invoke0 (Native Method)
    at sun.reflect.NativeMethodAccessorImpl.invoke (NativeMethodAccessorImpl.java:62)
    at sun.reflect.DelegatingMethodAccessorImpl.invoke (DelegatingMethodAccessorImpl.java:43)
    at java.lang.reflect.Method.invoke (Method.java:498)
    at org.codehaus.plexus.classworlds.launcher.Launcher.launchEnhanced (Launcher.java:289)
    at org.codehaus.plexus.classworlds.launcher.Launcher.launch (Launcher.java:229)
    at org.codehaus.plexus.classworlds.launcher.Launcher.mainWithExitCode (Launcher.java:415)
    at org.codehaus.plexus.classworlds.launcher.Launcher.main (Launcher.java:356)
[ERROR]   
[ERROR]   The project org.apache.maven.plugin.rresource.it.mrr41:child-2:[unknown-version] (F:\jenkins\jenkins-slave\workspace\TEST-UPGRADE-MAVEN-VERIFIER-MSRSEKFUTUGOFVEJX5JT6F73SQREM3WXYQI6H56P3MSWQOA4DOVQ\m\target\test-classes\run-only-at-execution-root\child2\pom.xml) has 1 error
[ERROR]     Non-resolvable parent POM for org.apache.maven.plugin.rresource.it.mrr41:parent:[unknown-version]: Failure to find org.apache.maven.plugin.rresource.it:it-parent:pom:1.6-SNAPSHOT in http://repository.apache.org/snapshots/ was cached in the local repository, resolution will not be reattempted until the update interval of apache-snapshots has elapsed or updates are forced and 'parent.relativePath' points at wrong local POM @ org.apache.maven.plugin.rresource.it.mrr41:parent:[unknown-version], F:\jenkins\jenkins-slave\workspace\TEST-UPGRADE-MAVEN-VERIFIER-MSRSEKFUTUGOFVEJX5JT6F73SQREM3WXYQI6H56P3MSWQOA4DOVQ\m\target\test-classes\run-only-at-execution-root\pom.xml, line 24, column 11 -> [Help 2]
org.apache.maven.model.resolution.UnresolvableModelException: Failure to find org.apache.maven.plugin.rresource.it:it-parent:pom:1.6-SNAPSHOT in http://repository.apache.org/snapshots/ was cached in the local repository, resolution will not be reattempted until the update interval of apache-snapshots has elapsed or updates are forced
    at org.apache.maven.project.ProjectModelResolver.resolveModel (ProjectModelResolver.java:197)
    at org.apache.maven.project.ProjectModelResolver.resolveModel (ProjectModelResolver.java:243)
    at org.apache.maven.model.building.DefaultModelBuilder.readParentExternally (DefaultModelBuilder.java:1051)
    at org.apache.maven.model.building.DefaultModelBuilder.readParent (DefaultModelBuilder.java:851)
    at org.apache.maven.model.building.DefaultModelBuilder.build (DefaultModelBuilder.java:331)
    at org.apache.maven.project.DefaultProjectBuilder.build (DefaultProjectBuilder.java:429)
    at org.apache.maven.project.DefaultProjectBuilder.build (DefaultProjectBuilder.java:398)
    at org.apache.maven.project.DefaultProjectBuilder.build (DefaultProjectBuilder.java:515)
    at org.apache.maven.project.DefaultProjectBuilder.build (DefaultProjectBuilder.java:398)
    at org.apache.maven.project.DefaultProjectBuilder.build (DefaultProjectBuilder.java:362)
    at org.apache.maven.graph.DefaultGraphBuilder.collectProjects (DefaultGraphBuilder.java:400)
    at org.apache.maven.graph.DefaultGraphBuilder.getProjectsForMavenReactor (DefaultGraphBuilder.java:391)
    at org.apache.maven.graph.DefaultGraphBuilder.build (DefaultGraphBuilder.java:78)
    at org.apache.maven.DefaultMaven.buildGraph (DefaultMaven.java:511)
    at org.apache.maven.DefaultMaven.doExecute (DefaultMaven.java:221)
    at org.apache.maven.DefaultMaven.doExecute (DefaultMaven.java:194)
    at org.apache.maven.DefaultMaven.execute (DefaultMaven.java:107)
    at org.apache.maven.cli.MavenCli.execute (MavenCli.java:955)
    at org.apache.maven.cli.MavenCli.doMain (MavenCli.java:290)
    at org.apache.maven.cli.MavenCli.main (MavenCli.java:194)
    at sun.reflect.NativeMethodAccessorImpl.invoke0 (Native Method)
    at sun.reflect.NativeMethodAccessorImpl.invoke (NativeMethodAccessorImpl.java:62)
    at sun.reflect.DelegatingMethodAccessorImpl.invoke (DelegatingMethodAccessorImpl.java:43)
    at java.lang.reflect.Method.invoke (Method.java:498)
    at org.codehaus.plexus.classworlds.launcher.Launcher.launchEnhanced (Launcher.java:289)
    at org.codehaus.plexus.classworlds.launcher.Launcher.launch (Launcher.java:229)
    at org.codehaus.plexus.classworlds.launcher.Launcher.mainWithExitCode (Launcher.java:415)
    at org.codehaus.plexus.classworlds.launcher.Launcher.main (Launcher.java:356)
Caused by: org.eclipse.aether.resolution.ArtifactResolutionException: Failure to find org.apache.maven.plugin.rresource.it:it-parent:pom:1.6-SNAPSHOT in http://repository.apache.org/snapshots/ was cached in the local repository, resolution will not be reattempted until the update interval of apache-snapshots has elapsed or updates are forced
    at org.eclipse.aether.internal.impl.DefaultArtifactResolver.resolve (DefaultArtifactResolver.java:422)
    at org.eclipse.aether.internal.impl.DefaultArtifactResolver.resolveArtifacts (DefaultArtifactResolver.java:224)
    at org.eclipse.aether.internal.impl.DefaultArtifactResolver.resolveArtifact (DefaultArtifactResolver.java:201)
    at org.eclipse.aether.internal.impl.DefaultRepositorySystem.resolveArtifact (DefaultRepositorySystem.java:260)
    at org.apache.maven.project.ProjectModelResolver.resolveModel (ProjectModelResolver.java:193)
    at org.apache.maven.project.ProjectModelResolver.resolveModel (ProjectModelResolver.java:243)
    at org.apache.maven.model.building.DefaultModelBuilder.readParentExternally (DefaultModelBuilder.java:1051)
    at org.apache.maven.model.building.DefaultModelBuilder.readParent (DefaultModelBuilder.java:851)
    at org.apache.maven.model.building.DefaultModelBuilder.build (DefaultModelBuilder.java:331)
    at org.apache.maven.project.DefaultProjectBuilder.build (DefaultProjectBuilder.java:429)
    at org.apache.maven.project.DefaultProjectBuilder.build (DefaultProjectBuilder.java:398)
    at org.apache.maven.project.DefaultProjectBuilder.build (DefaultProjectBuilder.java:515)
    at org.apache.maven.project.DefaultProjectBuilder.build (DefaultProjectBuilder.java:398)
    at org.apache.maven.project.DefaultProjectBuilder.build (DefaultProjectBuilder.java:362)
    at org.apache.maven.graph.DefaultGraphBuilder.collectProjects (DefaultGraphBuilder.java:400)
    at org.apache.maven.graph.DefaultGraphBuilder.getProjectsForMavenReactor (DefaultGraphBuilder.java:391)
    at org.apache.maven.graph.DefaultGraphBuilder.build (DefaultGraphBuilder.java:78)
    at org.apache.maven.DefaultMaven.buildGraph (DefaultMaven.java:511)
    at org.apache.maven.DefaultMaven.doExecute (DefaultMaven.java:221)
    at org.apache.maven.DefaultMaven.doExecute (DefaultMaven.java:194)
    at org.apache.maven.DefaultMaven.execute (DefaultMaven.java:107)
    at org.apache.maven.cli.MavenCli.execute (MavenCli.java:955)
    at org.apache.maven.cli.MavenCli.doMain (MavenCli.java:290)
    at org.apache.maven.cli.MavenCli.main (MavenCli.java:194)
    at sun.reflect.NativeMethodAccessorImpl.invoke0 (Native Method)
    at sun.reflect.NativeMethodAccessorImpl.invoke (NativeMethodAccessorImpl.java:62)
    at sun.reflect.DelegatingMethodAccessorImpl.invoke (DelegatingMethodAccessorImpl.java:43)
    at java.lang.reflect.Method.invoke (Method.java:498)
    at org.codehaus.plexus.classworlds.launcher.Launcher.launchEnhanced (Launcher.java:289)
    at org.codehaus.plexus.classworlds.launcher.Launcher.launch (Launcher.java:229)
    at org.codehaus.plexus.classworlds.launcher.Launcher.mainWithExitCode (Launcher.java:415)
    at org.codehaus.plexus.classworlds.launcher.Launcher.main (Launcher.java:356)
Caused by: org.eclipse.aether.transfer.ArtifactNotFoundException: Failure to find org.apache.maven.plugin.rresource.it:it-parent:pom:1.6-SNAPSHOT in http://repository.apache.org/snapshots/ was cached in the local repository, resolution will not be reattempted until the update interval of apache-snapshots has elapsed or updates are forced
    at org.eclipse.aether.internal.impl.DefaultUpdateCheckManager.newException (DefaultUpdateCheckManager.java:233)
    at org.eclipse.aether.internal.impl.DefaultUpdateCheckManager.checkArtifact (DefaultUpdateCheckManager.java:185)
    at org.eclipse.aether.internal.impl.DefaultArtifactResolver.gatherDownloads (DefaultArtifactResolver.java:563)
    at org.eclipse.aether.internal.impl.DefaultArtifactResolver.performDownloads (DefaultArtifactResolver.java:481)
    at org.eclipse.aether.internal.impl.DefaultArtifactResolver.resolve (DefaultArtifactResolver.java:399)
    at org.eclipse.aether.internal.impl.DefaultArtifactResolver.resolveArtifacts (DefaultArtifactResolver.java:224)
    at org.eclipse.aether.internal.impl.DefaultArtifactResolver.resolveArtifact (DefaultArtifactResolver.java:201)
    at org.eclipse.aether.internal.impl.DefaultRepositorySystem.resolveArtifact (DefaultRepositorySystem.java:260)
    at org.apache.maven.project.ProjectModelResolver.resolveModel (ProjectModelResolver.java:193)
    at org.apache.maven.project.ProjectModelResolver.resolveModel (ProjectModelResolver.java:243)
    at org.apache.maven.model.building.DefaultModelBuilder.readParentExternally (DefaultModelBuilder.java:1051)
    at org.apache.maven.model.building.DefaultModelBuilder.readParent (DefaultModelBuilder.java:851)
    at org.apache.maven.model.building.DefaultModelBuilder.build (DefaultModelBuilder.java:331)
    at org.apache.maven.project.DefaultProjectBuilder.build (DefaultProjectBuilder.java:429)
    at org.apache.maven.project.DefaultProjectBuilder.build (DefaultProjectBuilder.java:398)
    at org.apache.maven.project.DefaultProjectBuilder.build (DefaultProjectBuilder.java:515)
    at org.apache.maven.project.DefaultProjectBuilder.build (DefaultProjectBuilder.java:398)
    at org.apache.maven.project.DefaultProjectBuilder.build (DefaultProjectBuilder.java:362)
    at org.apache.maven.graph.DefaultGraphBuilder.collectProjects (DefaultGraphBuilder.java:400)
    at org.apache.maven.graph.DefaultGraphBuilder.getProjectsForMavenReactor (DefaultGraphBuilder.java:391)
    at org.apache.maven.graph.DefaultGraphBuilder.build (DefaultGraphBuilder.java:78)
    at org.apache.maven.DefaultMaven.buildGraph (DefaultMaven.java:511)
    at org.apache.maven.DefaultMaven.doExecute (DefaultMaven.java:221)
    at org.apache.maven.DefaultMaven.doExecute (DefaultMaven.java:194)
    at org.apache.maven.DefaultMaven.execute (DefaultMaven.java:107)
    at org.apache.maven.cli.MavenCli.execute (MavenCli.java:955)
    at org.apache.maven.cli.MavenCli.doMain (MavenCli.java:290)
    at org.apache.maven.cli.MavenCli.main (MavenCli.java:194)
    at sun.reflect.NativeMethodAccessorImpl.invoke0 (Native Method)
    at sun.reflect.NativeMethodAccessorImpl.invoke (NativeMethodAccessorImpl.java:62)
    at sun.reflect.DelegatingMethodAccessorImpl.invoke (DelegatingMethodAccessorImpl.java:43)
    at java.lang.reflect.Method.invoke (Method.java:498)
    at org.codehaus.plexus.classworlds.launcher.Launcher.launchEnhanced (Launcher.java:289)
    at org.codehaus.plexus.classworlds.launcher.Launcher.launch (Launcher.java:229)
    at org.codehaus.plexus.classworlds.launcher.Launcher.mainWithExitCode (Launcher.java:415)
    at org.codehaus.plexus.classworlds.launcher.Launcher.main (Launcher.java:356)
[ERROR] 
[ERROR] Re-run Maven using the -X switch to enable full debug logging.
[ERROR] 
[ERROR] For more information about the errors and possible solutions, please read the following articles:
[ERROR] [Help 1] http://cwiki.apache.org/confluence/display/MAVEN/ProjectBuildingException
[ERROR] [Help 2] http://cwiki.apache.org/confluence/display/MAVEN/UnresolvableModelException
Picked up JAVA_TOOL_OPTIONS: -Dmaven.ext.class.path="f:\jenkins\jenkins-slave\workspace\TEST-UPGRADE-MAVEN-VERIFIER-MSRSEKFUTUGOFVEJX5JT6F73SQREM3WXYQI6H56P3MSWQOA4DOVQ@tmp\withMaven10348613\pipeline-maven-spy.jar" -Dorg.jenkinsci.plugins.pipeline.maven.reportsFolder="f:\jenkins\jenkins-slave\workspace\TEST-UPGRADE-MAVEN-VERIFIER-MSRSEKFUTUGOFVEJX5JT6F73SQREM3WXYQI6H56P3MSWQOA4DOVQ@tmp\withMaven10348613" 

	at org.apache.maven.plugin.resources.remote.it.IT_RunOnlyAtExecutionRoot.test(IT_RunOnlyAtExecutionRoot.java:60)




Build log:
[...truncated 343.97 KB...]
[windows-jdk8]     at sun.reflect.NativeMethodAccessorImpl.invoke0 (Native Method)
[windows-jdk8]     at sun.reflect.NativeMethodAccessorImpl.invoke (NativeMethodAccessorImpl.java:62)
[windows-jdk8]     at sun.reflect.DelegatingMethodAccessorImpl.invoke (DelegatingMethodAccessorImpl.java:43)
[windows-jdk8]     at java.lang.reflect.Method.invoke (Method.java:498)
[windows-jdk8]     at org.codehaus.plexus.classworlds.launcher.Launcher.launchEnhanced (Launcher.java:289)
[windows-jdk8]     at org.codehaus.plexus.classworlds.launcher.Launcher.launch (Launcher.java:229)
[windows-jdk8]     at org.codehaus.plexus.classworlds.launcher.Launcher.mainWithExitCode (Launcher.java:415)
[windows-jdk8]     at org.codehaus.plexus.classworlds.launcher.Launcher.main (Launcher.java:356)
[windows-jdk8] [ERROR] 
[windows-jdk8] [ERROR] Re-run Maven using the -X switch to enable full debug logging.
[windows-jdk8] [ERROR] 
[windows-jdk8] [ERROR] For more information about the errors and possible solutions, please read the following articles:
[windows-jdk8] [ERROR] [Help 1] http://cwiki.apache.org/confluence/display/MAVEN/ProjectBuildingException
[windows-jdk8] [ERROR] [Help 2] http://cwiki.apache.org/confluence/display/MAVEN/UnresolvableModelException
[windows-jdk8] Picked up JAVA_TOOL_OPTIONS: -Dmaven.ext.class.path="f:\jenkins\jenkins-slave\workspace\TEST-UPGRADE-MAVEN-VERIFIER-MSRSEKFUTUGOFVEJX5JT6F73SQREM3WXYQI6H56P3MSWQOA4DOVQ@tmp\withMaven10348613\pipeline-maven-spy.jar" -Dorg.jenkinsci.plugins.pipeline.maven.reportsFolder="f:\jenkins\jenkins-slave\workspace\TEST-UPGRADE-MAVEN-VERIFIER-MSRSEKFUTUGOFVEJX5JT6F73SQREM3WXYQI6H56P3MSWQOA4DOVQ@tmp\withMaven10348613" 
[windows-jdk8] 
[windows-jdk8] 	at org.apache.maven.plugin.resources.remote.it.IT_RunOnlyAtExecutionRoot.test(IT_RunOnlyAtExecutionRoot.java:60)
[windows-jdk8] 
[windows-jdk8] Running org.apache.maven.plugin.resources.remote.it.IT_SupplementalArtifact
[windows-jdk8] Tests run: 1, Failures: 0, Errors: 0, Skipped: 0, Time elapsed: 10.234 sec - in org.apache.maven.plugin.resources.remote.it.IT_SupplementalArtifact
[windows-jdk8] Picked up JAVA_TOOL_OPTIONS: -Dmaven.ext.class.path="f:\jenkins\jenkins-slave\workspace\TEST-UPGRADE-MAVEN-VERIFIER-MSRSEKFUTUGOFVEJX5JT6F73SQREM3WXYQI6H56P3MSWQOA4DOVQ@tmp\withMaven10348613\pipeline-maven-spy.jar" -Dorg.jenkinsci.plugins.pipeline.maven.reportsFolder="f:\jenkins\jenkins-slave\workspace\TEST-UPGRADE-MAVEN-VERIFIER-MSRSEKFUTUGOFVEJX5JT6F73SQREM3WXYQI6H56P3MSWQOA4DOVQ@tmp\withMaven10348613" 
[windows-jdk8] 
[windows-jdk8] Results :
[windows-jdk8] 
[windows-jdk8] Tests in error: 
[windows-jdk8]   IT_RunOnlyAtExecutionRoot.test:60 � Verification Exit code was non-zero: 1; co...
[windows-jdk8] 
[windows-jdk8] Tests run: 9, Failures: 0, Errors: 1, Skipped: 0
[windows-jdk8] 
[windows-jdk8] [INFO] 
[windows-jdk8] [INFO] --- maven-invoker-plugin:3.0.1:integration-test (integration-test) @ maven-remote-resources-plugin ---
[windows-jdk8] [INFO] Running Setup Jobs
[windows-jdk8] [INFO] Building: maven-remote-resources-test\pom.xml
[windows-jdk8] [INFO]           maven-remote-resources-test\pom.xml .............. SUCCESS (9.6 s)
[windows-jdk8] [INFO] 
[windows-jdk8] [INFO] --- maven-checkstyle-plugin:2.15:check (checkstyle-check) @ maven-remote-resources-plugin ---
[windows-jdk8] [INFO] Downloading from central: https://repo.maven.apache.org/maven2/org/apache/maven/shared/maven-shared-resources/2/maven-shared-resources-2.pom
[windows-jdk8] [INFO] Downloaded from central: https://repo.maven.apache.org/maven2/org/apache/maven/shared/maven-shared-resources/2/maven-shared-resources-2.pom (3.0 kB at 296 kB/s)
[windows-jdk8] [INFO] Downloading from central: https://repo.maven.apache.org/maven2/org/codehaus/plexus/plexus-utils/3.0.10/plexus-utils-3.0.10.pom
[windows-jdk8] [INFO] Downloaded from central: https://repo.maven.apache.org/maven2/org/codehaus/plexus/plexus-utils/3.0.10/plexus-utils-3.0.10.pom (3.1 kB at 449 kB/s)
[windows-jdk8] [INFO] Downloading from central: https://repo.maven.apache.org/maven2/org/apache/maven/doxia/doxia-integration-tools/1.6/doxia-integration-tools-1.6.pom
[windows-jdk8] [INFO] Downloaded from central: https://repo.maven.apache.org/maven2/org/apache/maven/doxia/doxia-integration-tools/1.6/doxia-integration-tools-1.6.pom (7.0 kB at 870 kB/s)
[windows-jdk8] [INFO] Downloading from central: https://repo.maven.apache.org/maven2/org/apache/maven/doxia/doxia-tools/3/doxia-tools-3.pom
[windows-jdk8] [INFO] Downloaded from central: https://repo.maven.apache.org/maven2/org/apache/maven/doxia/doxia-tools/3/doxia-tools-3.pom (9.9 kB at 1.2 MB/s)
[windows-jdk8] [INFO] Downloading from central: https://repo.maven.apache.org/maven2/com/puppycrawl/tools/checkstyle/6.1.1/checkstyle-6.1.1.pom
[windows-jdk8] [INFO] Downloaded from central: https://repo.maven.apache.org/maven2/com/puppycrawl/tools/checkstyle/6.1.1/checkstyle-6.1.1.pom (30 kB at 3.0 MB/s)
[windows-jdk8] [INFO] Downloading from central: https://repo.maven.apache.org/maven2/org/sonatype/oss/oss-parent/7/oss-parent-7.pom
[windows-jdk8] [INFO] Downloaded from central: https://repo.maven.apache.org/maven2/org/sonatype/oss/oss-parent/7/oss-parent-7.pom (4.8 kB at 603 kB/s)
[windows-jdk8] [INFO] Downloading from central: https://repo.maven.apache.org/maven2/antlr/antlr/2.7.7/antlr-2.7.7.pom
[windows-jdk8] [INFO] Downloaded from central: https://repo.maven.apache.org/maven2/antlr/antlr/2.7.7/antlr-2.7.7.pom (632 B at 79 kB/s)
[windows-jdk8] [INFO] Downloading from central: https://repo.maven.apache.org/maven2/org/antlr/antlr4-runtime/4.3/antlr4-runtime-4.3.pom
[windows-jdk8] [INFO] Downloaded from central: https://repo.maven.apache.org/maven2/org/antlr/antlr4-runtime/4.3/antlr4-runtime-4.3.pom (4.8 kB at 532 kB/s)
[windows-jdk8] [INFO] Downloading from central: https://repo.maven.apache.org/maven2/org/antlr/antlr4-master/4.3/antlr4-master-4.3.pom
[windows-jdk8] [INFO] Downloaded from central: https://repo.maven.apache.org/maven2/org/antlr/antlr4-master/4.3/antlr4-master-4.3.pom (7.9 kB at 881 kB/s)
[windows-jdk8] [INFO] Downloading from central: https://repo.maven.apache.org/maven2/org/abego/treelayout/org.abego.treelayout.core/1.0.1/org.abego.treelayout.core-1.0.1.pom
[windows-jdk8] [INFO] Downloaded from central: https://repo.maven.apache.org/maven2/org/abego/treelayout/org.abego.treelayout.core/1.0.1/org.abego.treelayout.core-1.0.1.pom (3.1 kB at 345 kB/s)
[windows-jdk8] [INFO] Downloading from central: https://repo.maven.apache.org/maven2/org/antlr/antlr4-annotations/4.3/antlr4-annotations-4.3.pom
[windows-jdk8] [INFO] Downloaded from central: https://repo.maven.apache.org/maven2/org/antlr/antlr4-annotations/4.3/antlr4-annotations-4.3.pom (1.3 kB at 182 kB/s)
[windows-jdk8] [INFO] Downloading from central: https://repo.maven.apache.org/maven2/commons-beanutils/commons-beanutils-core/1.8.3/commons-beanutils-core-1.8.3.pom
[windows-jdk8] [INFO] Downloaded from central: https://repo.maven.apache.org/maven2/commons-beanutils/commons-beanutils-core/1.8.3/commons-beanutils-core-1.8.3.pom (1.6 kB at 205 kB/s)
[windows-jdk8] [INFO] Downloading from central: https://repo.maven.apache.org/maven2/com/google/guava/guava/18.0/guava-18.0.pom
[windows-jdk8] [INFO] Downloaded from central: https://repo.maven.apache.org/maven2/com/google/guava/guava/18.0/guava-18.0.pom (5.7 kB at 708 kB/s)
[windows-jdk8] [INFO] Downloading from central: https://repo.maven.apache.org/maven2/com/google/guava/guava-parent/18.0/guava-parent-18.0.pom
[windows-jdk8] [INFO] Downloaded from central: https://repo.maven.apache.org/maven2/com/google/guava/guava-parent/18.0/guava-parent-18.0.pom (7.7 kB at 854 kB/s)
[windows-jdk8] [INFO] Downloading from central: https://repo.maven.apache.org/maven2/commons-digester/commons-digester/1.6/commons-digester-1.6.jar
[windows-jdk8] [INFO] Downloading from central: https://repo.maven.apache.org/maven2/org/apache/maven/shared/maven-shared-resources/2/maven-shared-resources-2.jar
[windows-jdk8] [INFO] Downloading from central: https://repo.maven.apache.org/maven2/org/apache/maven/doxia/doxia-integration-tools/1.6/doxia-integration-tools-1.6.jar
[windows-jdk8] [INFO] Downloading from central: https://repo.maven.apache.org/maven2/org/codehaus/plexus/plexus-interpolation/1.21/plexus-interpolation-1.21.jar
[windows-jdk8] [INFO] Downloading from central: https://repo.maven.apache.org/maven2/commons-logging/commons-logging/1.0.4/commons-logging-1.0.4.jar
[windows-jdk8] [INFO] Downloaded from central: https://repo.maven.apache.org/maven2/org/apache/maven/doxia/doxia-integration-tools/1.6/doxia-integration-tools-1.6.jar (45 kB at 2.8 MB/s)
[windows-jdk8] [INFO] Downloading from central: https://repo.maven.apache.org/maven2/com/puppycrawl/tools/checkstyle/6.1.1/checkstyle-6.1.1.jar
[windows-jdk8] [INFO] Downloaded from central: https://repo.maven.apache.org/maven2/org/codehaus/plexus/plexus-interpolation/1.21/plexus-interpolation-1.21.jar (62 kB at 3.5 MB/s)
[windows-jdk8] [INFO] Downloading from central: https://repo.maven.apache.org/maven2/antlr/antlr/2.7.7/antlr-2.7.7.jar
[windows-jdk8] [INFO] Downloaded from central: https://repo.maven.apache.org/maven2/commons-logging/commons-logging/1.0.4/commons-logging-1.0.4.jar (38 kB at 2.0 MB/s)
[windows-jdk8] [INFO] Downloading from central: https://repo.maven.apache.org/maven2/org/antlr/antlr4-runtime/4.3/antlr4-runtime-4.3.jar
[windows-jdk8] [INFO] Downloaded from central: https://repo.maven.apache.org/maven2/org/apache/maven/shared/maven-shared-resources/2/maven-shared-resources-2.jar (13 kB at 653 kB/s)
[windows-jdk8] [INFO] Downloading from central: https://repo.maven.apache.org/maven2/org/abego/treelayout/org.abego.treelayout.core/1.0.1/org.abego.treelayout.core-1.0.1.jar
[windows-jdk8] [INFO] Downloaded from central: https://repo.maven.apache.org/maven2/commons-digester/commons-digester/1.6/commons-digester-1.6.jar (168 kB at 7.3 MB/s)
[windows-jdk8] [INFO] Downloading from central: https://repo.maven.apache.org/maven2/org/antlr/antlr4-annotations/4.3/antlr4-annotations-4.3.jar
[windows-jdk8] [INFO] Downloaded from central: https://repo.maven.apache.org/maven2/org/abego/treelayout/org.abego.treelayout.core/1.0.1/org.abego.treelayout.core-1.0.1.jar (26 kB at 481 kB/s)
[windows-jdk8] [INFO] Downloading from central: https://repo.maven.apache.org/maven2/commons-beanutils/commons-beanutils-core/1.8.3/commons-beanutils-core-1.8.3.jar
[windows-jdk8] [INFO] Downloaded from central: https://repo.maven.apache.org/maven2/org/antlr/antlr4-annotations/4.3/antlr4-annotations-4.3.jar (10 kB at 184 kB/s)
[windows-jdk8] [INFO] Downloading from central: https://repo.maven.apache.org/maven2/com/google/guava/guava/18.0/guava-18.0.jar
[windows-jdk8] [INFO] Downloaded from central: https://repo.maven.apache.org/maven2/com/puppycrawl/tools/checkstyle/6.1.1/checkstyle-6.1.1.jar (1.0 MB at 14 MB/s)
[windows-jdk8] [INFO] Downloading from central: https://repo.maven.apache.org/maven2/commons-lang/commons-lang/2.1/commons-lang-2.1.jar
[windows-jdk8] [INFO] Downloaded from central: https://repo.maven.apache.org/maven2/antlr/antlr/2.7.7/antlr-2.7.7.jar (445 kB at 6.0 MB/s)
[windows-jdk8] [INFO] Downloaded from central: https://repo.maven.apache.org/maven2/commons-beanutils/commons-beanutils-core/1.8.3/commons-beanutils-core-1.8.3.jar (207 kB at 2.8 MB/s)
[windows-jdk8] [INFO] Downloaded from central: https://repo.maven.apache.org/maven2/org/antlr/antlr4-runtime/4.3/antlr4-runtime-4.3.jar (345 kB at 3.9 MB/s)
[windows-jdk8] [INFO] Downloaded from central: https://repo.maven.apache.org/maven2/commons-lang/commons-lang/2.1/commons-lang-2.1.jar (208 kB at 2.3 MB/s)
[windows-jdk8] [INFO] Downloaded from central: https://repo.maven.apache.org/maven2/com/google/guava/guava/18.0/guava-18.0.jar (2.3 MB at 15 MB/s)
[windows-jdk8] [INFO] 
[windows-jdk8] [INFO] --- maven-failsafe-plugin:2.19.1:verify (integration-tests) @ maven-remote-resources-plugin ---
[windows-jdk8] [ERROR] There are test failures.
[windows-jdk8] 
[windows-jdk8] Please refer to f:\jenkins\jenkins-slave\workspace\TEST-UPGRADE-MAVEN-VERIFIER-MSRSEKFUTUGOFVEJX5JT6F73SQREM3WXYQI6H56P3MSWQOA4DOVQ\m\target\failsafe-reports for the individual test results.
[windows-jdk8] [INFO] 
[windows-jdk8] [INFO] --- maven-invoker-plugin:3.0.1:verify (integration-test) @ maven-remote-resources-plugin ---
[windows-jdk8] [INFO] -------------------------------------------------
[windows-jdk8] [INFO] Build Summary:
[windows-jdk8] [INFO]   Passed: 1, Failed: 0, Errors: 0, Skipped: 0
[windows-jdk8] [INFO] -------------------------------------------------
[windows-jdk8] [INFO] ------------------------------------------------------------------------
[windows-jdk8] [INFO] BUILD SUCCESS
[windows-jdk8] [INFO] ------------------------------------------------------------------------
[windows-jdk8] [INFO] Total time: 01:47 min
[windows-jdk8] [INFO] Finished at: 2018-11-02T06:55:59Z
[windows-jdk8] [INFO] Final Memory: 54M/652M
[windows-jdk8] [INFO] ------------------------------------------------------------------------
[windows-jdk8] [INFO] [jenkins-event-spy] Generated F:\jenkins\jenkins-slave\workspace\TEST-UPGRADE-MAVEN-VERIFIER-MSRSEKFUTUGOFVEJX5JT6F73SQREM3WXYQI6H56P3MSWQOA4DOVQ@tmp\withMaven10348613\maven-spy-20181102-065411-4906087165330509035527.log
[windows-jdk8] Picked up JAVA_TOOL_OPTIONS: -Dmaven.ext.class.path="f:\jenkins\jenkins-slave\workspace\TEST-UPGRADE-MAVEN-VERIFIER-MSRSEKFUTUGOFVEJX5JT6F73SQREM3WXYQI6H56P3MSWQOA4DOVQ@tmp\withMaven10348613\pipeline-maven-spy.jar" -Dorg.jenkinsci.plugins.pipeline.maven.reportsFolder="f:\jenkins\jenkins-slave\workspace\TEST-UPGRADE-MAVEN-VERIFIER-MSRSEKFUTUGOFVEJX5JT6F73SQREM3WXYQI6H56P3MSWQOA4DOVQ@tmp\withMaven10348613" 
[Pipeline] [windows-jdk8] }
[Pipeline] [windows-jdk8] // dir
[Pipeline] [windows-jdk8] }
[windows-jdk8] [withMaven] artifactsPublisher - Archive artifact m\pom.xml under org\apache\maven\plugins\maven-remote-resources-plugin\1.6-SNAPSHOT\maven-remote-resources-plugin-1.6-SNAPSHOT.pom
[windows-jdk8] [withMaven] artifactsPublisher - Archive artifact m\target\maven-remote-resources-plugin-1.6-SNAPSHOT.jar under org\apache\maven\plugins\maven-remote-resources-plugin\1.6-SNAPSHOT\maven-remote-resources-plugin-1.6-SNAPSHOT.jar
[windows-jdk8] [withMaven] invokerPublisher - Archive invoker results for Maven artifact MavenArtifact{org.apache.maven.plugins:maven-remote-resources-plugin::1.6-SNAPSHOT(version: 1.6-SNAPSHOT, snapshot:false) } generated by PluginInvocation{org.apache.maven.plugins:maven-invoker-plugin:3.0.1@integration-test  integration-test}: m\target\invoker-reports\*.xml
[windows-jdk8] performing MavenInvokerRecorder, reportsFilenamePattern:'**/m\target\invoker-reports/BUILD*.xml', invokerBuildDir:'**/m\target\it'
[windows-jdk8] Found reports:[f:\jenkins\jenkins-slave\workspace\TEST-UPGRADE-MAVEN-VERIFIER-MSRSEKFUTUGOFVEJX5JT6F73SQREM3WXYQI6H56P3MSWQOA4DOVQ\m\target\invoker-reports\BUILD-maven-remote-resources-test.xml]
[windows-jdk8] Found logs:[f:\jenkins\jenkins-slave\workspace\TEST-UPGRADE-MAVEN-VERIFIER-MSRSEKFUTUGOFVEJX5JT6F73SQREM3WXYQI6H56P3MSWQOA4DOVQ\m\target\it\maven-remote-resources-test\build.log]
[windows-jdk8] Finished parsing Maven Invoker results (found 1)
[windows-jdk8] [withMaven] junitPublisher - Archive test results for Maven artifact org.apache.maven.plugins:maven-remote-resources-plugin:1.6-SNAPSHOT generated by maven-surefire-plugin:test (default-test): m\target\surefire-reports\*.xml
[windows-jdk8] Recording test results
[windows-jdk8] [withMaven] junitPublisher - Archive test results for Maven artifact org.apache.maven.plugins:maven-remote-resources-plugin:1.6-SNAPSHOT generated by maven-failsafe-plugin:integration-test (integration-tests): m\target\failsafe-reports\*.xml
[windows-jdk8] Recording test results
[windows-jdk8] [withMaven] openTasksPublisher - Scan Tasks for Maven artifact org.apache.maven.plugins:maven-remote-resources-plugin:1.6-SNAPSHOT in source directory m\src\main\java
[windows-jdk8] [TASKS] Scanning folder 'f:\jenkins\jenkins-slave\workspace\TEST-UPGRADE-MAVEN-VERIFIER-MSRSEKFUTUGOFVEJX5JT6F73SQREM3WXYQI6H56P3MSWQOA4DOVQ' for files matching the pattern 'm\src\main\java\**\*' - excludes: null
[windows-jdk8] [TASKS] Found 3 files to scan for tasks
[windows-jdk8] [TASKS] Found 2 open tasks.
[windows-jdk8] Skipping warnings blame since pipelines do not have an SCM link.%n
[windows-jdk8] [TASKS] Computing warning deltas based on reference build #23
[windows-jdk8] [withMaven] artifactsPublisher - Archive artifact m\target\test-classes\bootstrap\pom.xml under org\apache\maven\plugin\rresource\it\bootstrap\1.6-SNAPSHOT\bootstrap-1.6-SNAPSHOT.pom
[windows-jdk8] [withMaven] artifactsPublisher - Archive artifact m\target\test-classes\bootstrap\resource-bundle-with-template\pom.xml under org\apache\maven\plugin\rresource\it\resource-bundle-with-template\1.6-SNAPSHOT\resource-bundle-with-template-1.6-SNAPSHOT.pom
[windows-jdk8] [withMaven] artifactsPublisher - Archive artifact m\target\test-classes\bootstrap\resource-bundle-with-template\target\resource-bundle-with-template-1.6-SNAPSHOT.jar under org\apache\maven\plugin\rresource\it\resource-bundle-with-template\1.6-SNAPSHOT\resource-bundle-with-template-1.6-SNAPSHOT.jar
[windows-jdk8] [withMaven] artifactsPublisher - Archive artifact m\target\test-classes\bootstrap\resource-bundle-with-org-processing\pom.xml under org\apache\maven\plugin\rresource\it\resource-bundle-with-org-processing\1.6-SNAPSHOT\resource-bundle-with-org-processing-1.6-SNAPSHOT.pom
[windows-jdk8] [withMaven] artifactsPublisher - Archive artifact m\target\test-classes\bootstrap\resource-bundle-with-org-processing\target\resource-bundle-with-org-processing-1.6-SNAPSHOT.jar under org\apache\maven\plugin\rresource\it\resource-bundle-with-org-processing\1.6-SNAPSHOT\resource-bundle-with-org-processing-1.6-SNAPSHOT.jar
[windows-jdk8] [withMaven] artifactsPublisher - Archive artifact m\target\test-classes\bootstrap\resource-bundle-with-type-and-classifier\pom.xml under org\apache\maven\plugin\rresource\it\resource-bundle-with-type-and-classifier\1.6-SNAPSHOT\resource-bundle-with-type-and-classifier-1.6-SNAPSHOT.pom
[windows-jdk8] [withMaven] artifactsPublisher - Archive artifact m\target\test-classes\bootstrap\resource-bundle-with-type-and-classifier\target\resource-bundle-with-type-and-classifier-1.6-SNAPSHOT-test.jar under org\apache\maven\plugin\rresource\it\resource-bundle-with-type-and-classifier\1.6-SNAPSHOT\resource-bundle-with-type-and-classifier-1.6-SNAPSHOT-test.jar
[windows-jdk8] [withMaven] junitPublisher - Archive test results for Maven artifact org.apache.maven.plugin.rresource.it:resource-bundle-with-template:1.6-SNAPSHOT generated by maven-surefire-plugin:test (default-test): m\target\test-classes\bootstrap\resource-bundle-with-template\target\surefire-reports\*.xml
[windows-jdk8] Recording test results
[windows-jdk8] None of the test reports contained any result
[windows-jdk8] [withMaven] junitPublisher - Archive test results for Maven artifact org.apache.maven.plugin.rresource.it:resource-bundle-with-org-processing:1.6-SNAPSHOT generated by maven-surefire-plugin:test (default-test): m\target\test-classes\bootstrap\resource-bundle-with-org-processing\target\surefire-reports\*.xml
[windows-jdk8] Recording test results
[windows-jdk8] None of the test reports contained any result
[windows-jdk8] [withMaven] junitPublisher - Archive test results for Maven artifact org.apache.maven.plugin.rresource.it:resource-bundle-with-type-and-classifier:1.6-SNAPSHOT generated by maven-surefire-plugin:test (default-test): m\target\test-classes\bootstrap\resource-bundle-with-type-and-classifier\target\surefire-reports\*.xml
[windows-jdk8] Recording test results
[windows-jdk8] None of the test reports contained any result
[windows-jdk8] [withMaven] artifactsPublisher - Archive artifact m\target\test-classes\bad-dependency-poms\pom.xml under org\apache\maven\plugin\rresource\it\test\1.0\test-1.0.pom
[windows-jdk8] [withMaven] artifactsPublisher - Archive artifact m\target\test-classes\custom-filter-delim\pom.xml under org\apache\maven\plugin\rresource\it\custom-filter-delim\1.6-SNAPSHOT\custom-filter-delim-1.6-SNAPSHOT.pom
[windows-jdk8] [withMaven] openTasksPublisher - Scan Tasks for Maven artifact org.apache.maven.plugin.rresource.it:custom-filter-delim:1.6-SNAPSHOT in source directory m\target\test-classes\custom-filter-delim\src\main\java
[windows-jdk8] [TASKS] Scanning folder 'f:\jenkins\jenkins-slave\workspace\TEST-UPGRADE-MAVEN-VERIFIER-MSRSEKFUTUGOFVEJX5JT6F73SQREM3WXYQI6H56P3MSWQOA4DOVQ' for files matching the pattern 'm\target\test-classes\custom-filter-delim\src\main\java\**\*' - excludes: null
[windows-jdk8] [TASKS] Found 1 files to scan for tasks
[windows-jdk8] [TASKS] Found 0 open tasks.
[windows-jdk8] Skipping warnings blame since pipelines do not have an SCM link.%n
[windows-jdk8] [TASKS] Computing warning deltas based on reference build #23
[windows-jdk8] [withMaven] artifactsPublisher - Archive artifact m\target\test-classes\filter-local-override\pom.xml under org\apache\maven\plugin\rresource\it\filter-local-override\1.6-SNAPSHOT\filter-local-override-1.6-SNAPSHOT.pom
[windows-jdk8] [withMaven] openTasksPublisher - Scan Tasks for Maven artifact org.apache.maven.plugin.rresource.it:filter-local-override:1.6-SNAPSHOT in source directory m\target\test-classes\filter-local-override\src\main\java
[windows-jdk8] [TASKS] Scanning folder 'f:\jenkins\jenkins-slave\workspace\TEST-UPGRADE-MAVEN-VERIFIER-MSRSEKFUTUGOFVEJX5JT6F73SQREM3WXYQI6H56P3MSWQOA4DOVQ' for files matching the pattern 'm\target\test-classes\filter-local-override\src\main\java\**\*' - excludes: null
[windows-jdk8] [TASKS] Found 1 files to scan for tasks
[windows-jdk8] [TASKS] Found 0 open tasks.
[windows-jdk8] Skipping warnings blame since pipelines do not have an SCM link.%n
[windows-jdk8] [TASKS] Computing warning deltas based on reference build #23
[windows-jdk8] [withMaven] artifactsPublisher - Archive artifact m\target\test-classes\generate-from-bundle\pom.xml under org\apache\maven\plugin\rresource\it\generate-from-bundle\1.6-SNAPSHOT\generate-from-bundle-1.6-SNAPSHOT.pom
[windows-jdk8] [withMaven] openTasksPublisher - Scan Tasks for Maven artifact org.apache.maven.plugin.rresource.it:generate-from-bundle:1.6-SNAPSHOT in source directory m\target\test-classes\generate-from-bundle\src\main\java
[windows-jdk8] [TASKS] Scanning folder 'f:\jenkins\jenkins-slave\workspace\TEST-UPGRADE-MAVEN-VERIFIER-MSRSEKFUTUGOFVEJX5JT6F73SQREM3WXYQI6H56P3MSWQOA4DOVQ' for files matching the pattern 'm\target\test-classes\generate-from-bundle\src\main\java\**\*' - excludes: null
[windows-jdk8] [TASKS] Found 1 files to scan for tasks
[windows-jdk8] [TASKS] Found 0 open tasks.
[windows-jdk8] Skipping warnings blame since pipelines do not have an SCM link.%n
[windows-jdk8] [TASKS] Computing warning deltas based on reference build #23
[windows-jdk8] [withMaven] artifactsPublisher - Archive artifact m\target\test-classes\generate-from-bundle-with-type-and-classifier\pom.xml under org\apache\maven\plugin\rresource\it\generate-from-bundle-with-type-and-classifier\1.6-SNAPSHOT\generate-from-bundle-with-type-and-classifier-1.6-SNAPSHOT.pom
[windows-jdk8] [withMaven] openTasksPublisher - Scan Tasks for Maven artifact org.apache.maven.plugin.rresource.it:generate-from-bundle-with-type-and-classifier:1.6-SNAPSHOT in source directory m\target\test-classes\generate-from-bundle-with-type-and-classifier\src\main\java
[windows-jdk8] [TASKS] Scanning folder 'f:\jenkins\jenkins-slave\workspace\TEST-UPGRADE-MAVEN-VERIFIER-MSRSEKFUTUGOFVEJX5JT6F73SQREM3WXYQI6H56P3MSWQOA4DOVQ' for files matching the pattern 'm\target\test-classes\generate-from-bundle-with-type-and-classifier\src\main\java\**\*' - excludes: null
[windows-jdk8] [TASKS] Found 1 files to scan for tasks
[windows-jdk8] [TASKS] Found 0 open tasks.
[windows-jdk8] Skipping warnings blame since pipelines do not have an SCM link.%n
[windows-jdk8] [TASKS] Computing warning deltas based on reference build #23
[windows-jdk8] [withMaven] artifactsPublisher - Archive artifact m\target\test-classes\generate-from-override\pom.xml under org\apache\maven\plugin\rresource\it\generate-from-override\1.6-SNAPSHOT\generate-from-override-1.6-SNAPSHOT.pom
[windows-jdk8] [withMaven] openTasksPublisher - Scan Tasks for Maven artifact org.apache.maven.plugin.rresource.it:generate-from-override:1.6-SNAPSHOT in source directory m\target\test-classes\generate-from-override\src\main\java
[windows-jdk8] [TASKS] Scanning folder 'f:\jenkins\jenkins-slave\workspace\TEST-UPGRADE-MAVEN-VERIFIER-MSRSEKFUTUGOFVEJX5JT6F73SQREM3WXYQI6H56P3MSWQOA4DOVQ' for files matching the pattern 'm\target\test-classes\generate-from-override\src\main\java\**\*' - excludes: null
[windows-jdk8] [TASKS] Found 1 files to scan for tasks
[windows-jdk8] [TASKS] Found 0 open tasks.
[windows-jdk8] Skipping warnings blame since pipelines do not have an SCM link.%n
[windows-jdk8] [TASKS] Computing warning deltas based on reference build #23
[windows-jdk8] [withMaven] artifactsPublisher - Archive artifact m\target\test-classes\get-dependency-projects\release\pom.xml under org\apache\maven\plugin\rresource\it\gdp\release\1.0\release-1.0.pom
[windows-jdk8] [withMaven] artifactsPublisher - Archive artifact m\target\test-classes\get-dependency-projects\release\target\release-1.0.jar under org\apache\maven\plugin\rresource\it\gdp\release\1.0\release-1.0.jar
[windows-jdk8] [withMaven] artifactsPublisher - Archive artifact m\target\test-classes\get-dependency-projects\snapshot\pom.xml under org\apache\maven\plugin\rresource\it\gdp\snapshot\1.0-SNAPSHOT\snapshot-1.0-SNAPSHOT.pom
[windows-jdk8] [withMaven] artifactsPublisher - Archive artifact m\target\test-classes\get-dependency-projects\snapshot\target\snapshot-1.0-SNAPSHOT.jar under org\apache\maven\plugin\rresource\it\gdp\snapshot\1.0-SNAPSHOT\snapshot-1.0-SNAPSHOT.jar
[windows-jdk8] [withMaven] artifactsPublisher - Archive artifact m\target\test-classes\get-dependency-projects\pom.xml under org\apache\maven\plugin\rresource\it\aggregator\1.0\aggregator-1.0.pom
[windows-jdk8] [withMaven] junitPublisher - Archive test results for Maven artifact org.apache.maven.plugin.rresource.it.gdp:release:1.0 generated by maven-surefire-plugin:test (default-test): m\target\test-classes\get-dependency-projects\release\target\surefire-reports\*.xml
[windows-jdk8] Recording test results
[windows-jdk8] None of the test reports contained any result
[windows-jdk8] [withMaven] junitPublisher - Archive test results for Maven artifact org.apache.maven.plugin.rresource.it.gdp:snapshot:1.0-SNAPSHOT generated by maven-surefire-plugin:test (default-test): m\target\test-classes\get-dependency-projects\snapshot\target\surefire-reports\*.xml
[windows-jdk8] Recording test results
[windows-jdk8] None of the test reports contained any result
[windows-jdk8] [withMaven] artifactsPublisher - Archive artifact m\target\test-classes\get-dependency-projects\project\pom.xml under org\apache\maven\plugin\rresource\it\get-dependency-projects\1.6-SNAPSHOT\get-dependency-projects-1.6-SNAPSHOT.pom
[windows-jdk8] [withMaven] artifactsPublisher - Archive artifact m\target\test-classes\run-only-at-execution-root\resource-projects\release\pom.xml under org\apache\maven\plugin\rresource\it\mrr41\release\1.0\release-1.0.pom
[windows-jdk8] [withMaven] artifactsPublisher - Archive artifact m\target\test-classes\run-only-at-execution-root\resource-projects\release\target\release-1.0.jar under org\apache\maven\plugin\rresource\it\mrr41\release\1.0\release-1.0.jar
[windows-jdk8] [withMaven] artifactsPublisher - Archive artifact m\target\test-classes\run-only-at-execution-root\resource-projects\snapshot\pom.xml under org\apache\maven\plugin\rresource\it\mrr41\snapshot\1.0-SNAPSHOT\snapshot-1.0-SNAPSHOT.pom
[windows-jdk8] [withMaven] artifactsPublisher - Archive artifact m\target\test-classes\run-only-at-execution-root\resource-projects\snapshot\target\snapshot-1.0-SNAPSHOT.jar under org\apache\maven\plugin\rresource\it\mrr41\snapshot\1.0-SNAPSHOT\snapshot-1.0-SNAPSHOT.jar
[windows-jdk8] [withMaven] artifactsPublisher - Archive artifact m\target\test-classes\run-only-at-execution-root\resource-projects\pom.xml under org\apache\maven\plugin\rresource\it\mrr41\aggregator\1.0\aggregator-1.0.pom
[windows-jdk8] [withMaven] junitPublisher - Archive test results for Maven artifact org.apache.maven.plugin.rresource.it.mrr41:release:1.0 generated by maven-surefire-plugin:test (default-test): m\target\test-classes\run-only-at-execution-root\resource-projects\release\target\surefire-reports\*.xml
[windows-jdk8] Recording test results
[windows-jdk8] None of the test reports contained any result
[windows-jdk8] [withMaven] junitPublisher - Archive test results for Maven artifact org.apache.maven.plugin.rresource.it.mrr41:snapshot:1.0-SNAPSHOT generated by maven-surefire-plugin:test (default-test): m\target\test-classes\run-only-at-execution-root\resource-projects\snapshot\target\surefire-reports\*.xml
[windows-jdk8] Recording test results
[windows-jdk8] None of the test reports contained any result
[windows-jdk8] [withMaven] artifactsPublisher - Archive artifact m\target\test-classes\supplemental-artifact\resource-projects\pom.xml under org\apache\maven\plugin\rresource\it\mrr43\resources\1\resources-1.pom
[windows-jdk8] [withMaven] artifactsPublisher - Archive artifact m\target\test-classes\supplemental-artifact\resource-projects\supplemental-models\pom.xml under org\apache\maven\plugin\rresource\it\mrr43\supplemental-models\1\supplemental-models-1.pom
[windows-jdk8] [withMaven] artifactsPublisher - Archive artifact m\target\test-classes\supplemental-artifact\resource-projects\supplemental-models\target\supplemental-models-1.jar under org\apache\maven\plugin\rresource\it\mrr43\supplemental-models\1\supplemental-models-1.jar
[windows-jdk8] [withMaven] artifactsPublisher - Archive artifact m\target\test-classes\supplemental-artifact\resource-projects\deficient-dep\pom.xml under org\apache\maven\plugin\rresource\it\mrr43\deficient-dep\1\deficient-dep-1.pom
[windows-jdk8] [withMaven] artifactsPublisher - Archive artifact m\target\test-classes\supplemental-artifact\resource-projects\deficient-dep\target\deficient-dep-1.jar under org\apache\maven\plugin\rresource\it\mrr43\deficient-dep\1\deficient-dep-1.jar
[windows-jdk8] [withMaven] junitPublisher - Archive test results for Maven artifact org.apache.maven.plugin.rresource.it.mrr43:supplemental-models:1 generated by maven-surefire-plugin:test (default-test): m\target\test-classes\supplemental-artifact\resource-projects\supplemental-models\target\surefire-reports\*.xml
[windows-jdk8] Recording test results
[windows-jdk8] None of the test reports contained any result
[windows-jdk8] [withMaven] junitPublisher - Archive test results for Maven artifact org.apache.maven.plugin.rresource.it.mrr43:deficient-dep:1 generated by maven-surefire-plugin:test (default-test): m\target\test-classes\supplemental-artifact\resource-projects\deficient-dep\target\surefire-reports\*.xml
[windows-jdk8] Recording test results
[windows-jdk8] None of the test reports contained any result
[windows-jdk8] [withMaven] openTasksPublisher - Scan Tasks for Maven artifact org.apache.maven.plugin.rresource.it.mrr43:deficient-dep:1 in source directory m\target\test-classes\supplemental-artifact\resource-projects\deficient-dep\src\main\java
[windows-jdk8] [TASKS] Scanning folder 'f:\jenkins\jenkins-slave\workspace\TEST-UPGRADE-MAVEN-VERIFIER-MSRSEKFUTUGOFVEJX5JT6F73SQREM3WXYQI6H56P3MSWQOA4DOVQ' for files matching the pattern 'm\target\test-classes\supplemental-artifact\resource-projects\deficient-dep\src\main\java\**\*' - excludes: null
[windows-jdk8] [TASKS] Found 1 files to scan for tasks
[windows-jdk8] [TASKS] Found 0 open tasks.
[windows-jdk8] Skipping warnings blame since pipelines do not have an SCM link.%n
[windows-jdk8] [TASKS] Computing warning deltas based on reference build #23
[windows-jdk8] [withMaven] artifactsPublisher - Archive artifact m\target\test-classes\supplemental-artifact\pom.xml under org\apache\maven\plugin\rresource\it\supplemental-artifact\1.6-SNAPSHOT\supplemental-artifact-1.6-SNAPSHOT.pom
[windows-jdk8] [withMaven] artifactsPublisher - Archive artifact m\target\it\maven-remote-resources-test\pom.xml under org\apache\maven\maven-remote-resources-test\1.0-SNAPSHOT\maven-remote-resources-test-1.0-SNAPSHOT.pom
[windows-jdk8] [withMaven] artifactsPublisher - Archive artifact m\target\it\maven-remote-resources-test\target\maven-remote-resources-test-1.0-SNAPSHOT.jar under org\apache\maven\maven-remote-resources-test\1.0-SNAPSHOT\maven-remote-resources-test-1.0-SNAPSHOT.jar
[windows-jdk8] [withMaven] junitPublisher - Archive test results for Maven artifact org.apache.maven:maven-remote-resources-test:1.0-SNAPSHOT generated by maven-surefire-plugin:test (default-test): m\target\it\maven-remote-resources-test\target\surefire-reports\*.xml
[windows-jdk8] Recording test results
[windows-jdk8] None of the test reports contained any result
[windows-jdk8] [withMaven] openTasksPublisher - Scan Tasks for Maven artifact org.apache.maven:maven-remote-resources-test:1.0-SNAPSHOT in source directory m\target\it\maven-remote-resources-test\src\main\java
[windows-jdk8] [TASKS] Scanning folder 'f:\jenkins\jenkins-slave\workspace\TEST-UPGRADE-MAVEN-VERIFIER-MSRSEKFUTUGOFVEJX5JT6F73SQREM3WXYQI6H56P3MSWQOA4DOVQ' for files matching the pattern 'm\target\it\maven-remote-resources-test\src\main\java\**\*' - excludes: null
[windows-jdk8] [TASKS] Found 1 files to scan for tasks
[windows-jdk8] [TASKS] Found 0 open tasks.
[windows-jdk8] Skipping warnings blame since pipelines do not have an SCM link.%n
[windows-jdk8] [TASKS] Computing warning deltas based on reference build #23
[Pipeline] [windows-jdk8] // withMaven
[Pipeline] [windows-jdk8] cleanWs
[windows-jdk8] [WS-CLEANUP] Deleting project workspace...[WS-CLEANUP] done
[Pipeline] [windows-jdk8] }
[Pipeline] [windows-jdk8] // stage
[Pipeline] [windows-jdk8] }
[Pipeline] [windows-jdk8] // node
[Pipeline] [windows-jdk8] }
[Pipeline] // parallel
[Pipeline] stage
[Pipeline] { (Notifications)
[Pipeline] echo
Build result: UNSTABLE
[Pipeline] jiraIssueSelector
[Pipeline] emailext
Mime
  • Unnamed multipart/mixed (inline, None, 0 bytes)
View raw message