maven-notifications mailing list archives

Site index · List index
Message view « Date » · « Thread »
Top « Date » · « Thread »
From Apache Jenkins Server <jenk...@builds.apache.org>
Subject Build unstable in Jenkins: Maven TLP » maven-enforcer » IMPROVE_TESTS #1
Date Fri, 09 Nov 2018 08:32:43 GMT
See https://builds.apache.org/job/maven-box/job/maven-enforcer/job/IMPROVE_TESTS/1/

No changes.

14 tests failed.
FAILED:  org.apache.maven.plugins.enforcer.TestRequireEnvironmentVariable.testRuleWithRegexDifferent

Error Message:
This should not throw an exception Environment variable "PATH" evaluates to "f:\\jenkins\\tools\\java\\latest1.8/bin;f:\jenkins\jenkins-slave\workspace\aven-enforcer_IMPROVE_TESTS-STPPGKMLZMMP35I7IYC3BJFSM5FR665OYVQGY7GQ7REZ2ZJBGHFA@2@2@tmp\withMavene82c6b0b;C:\Program Files (x86)\Common Files\Oracle\Java\javapath;C:\ProgramData\Oracle\Java\javapath;C:\Windows\system32;C:\Windows;C:\Windows\System32\Wbem;
C:\Windows\System32\WindowsPowerShell\v1.0\;C:\Program Files\Amazon\cfn-bootstrap\;C:\Program Files\Puppet Labs\Puppet\bin;c:\Program Files (x86)\Subversion\bin;C:\Pro
gram Files\Git\cmd;C:\Program Files\Microsoft SQL Server\130\Tools\Binn\;C:\Users\Administrator\.dnx\bin;C:\Program Files\Microsoft DNX\Dnvm\;C:\Program Files (x86)\Wi
ndows Kits\8.1\Windows Performance Toolkit\;F:\Program Files\CMake\bin;C:\Users\Administrator\AppData\Local\Microsoft\WindowsApps;".  This does not match the regular expression ".+"

Stack Trace:
junit.framework.AssertionFailedError: 
This should not throw an exception Environment variable "PATH" evaluates to "f:\\jenkins\\tools\\java\\latest1.8/bin;f:\jenkins\jenkins-slave\workspace\aven-enforcer_IMPROVE_TESTS-STPPGKMLZMMP35I7IYC3BJFSM5FR665OYVQGY7GQ7REZ2ZJBGHFA@2@2@tmp\withMavene82c6b0b;C:\Program Files (x86)\Common Files\Oracle\Java\javapath;C:\ProgramData\Oracle\Java\javapath;C:\Windows\system32;C:\Windows;C:\Windows\System32\Wbem;
C:\Windows\System32\WindowsPowerShell\v1.0\;C:\Program Files\Amazon\cfn-bootstrap\;C:\Program Files\Puppet Labs\Puppet\bin;c:\Program Files (x86)\Subversion\bin;C:\Pro
gram Files\Git\cmd;C:\Program Files\Microsoft SQL Server\130\Tools\Binn\;C:\Users\Administrator\.dnx\bin;C:\Program Files\Microsoft DNX\Dnvm\;C:\Program Files (x86)\Wi
ndows Kits\8.1\Windows Performance Toolkit\;F:\Program Files\CMake\bin;C:\Users\Administrator\AppData\Local\Microsoft\WindowsApps;".  This does not match the regular expression ".+"
	at org.apache.maven.plugins.enforcer.TestRequireEnvironmentVariable.testRuleWithRegexDifferent(TestRequireEnvironmentVariable.java:148)


FAILED:  org.apache.maven.plugins.enforcer.TestRequireEnvironmentVariable.testRuleWithRegex

Error Message:
This should not throw an exception Environment variable "PATH" evaluates to "f:\\jenkins\\tools\\java\\latest1.8/bin;f:\jenkins\jenkins-slave\workspace\aven-enforcer_IMPROVE_TESTS-STPPGKMLZMMP35I7IYC3BJFSM5FR665OYVQGY7GQ7REZ2ZJBGHFA@2@2@tmp\withMavene82c6b0b;C:\Program Files (x86)\Common Files\Oracle\Java\javapath;C:\ProgramData\Oracle\Java\javapath;C:\Windows\system32;C:\Windows;C:\Windows\System32\Wbem;
C:\Windows\System32\WindowsPowerShell\v1.0\;C:\Program Files\Amazon\cfn-bootstrap\;C:\Program Files\Puppet Labs\Puppet\bin;c:\Program Files (x86)\Subversion\bin;C:\Pro
gram Files\Git\cmd;C:\Program Files\Microsoft SQL Server\130\Tools\Binn\;C:\Users\Administrator\.dnx\bin;C:\Program Files\Microsoft DNX\Dnvm\;C:\Program Files (x86)\Wi
ndows Kits\8.1\Windows Performance Toolkit\;F:\Program Files\CMake\bin;C:\Users\Administrator\AppData\Local\Microsoft\WindowsApps;".  This does not match the regular expression ".{1,}"

Stack Trace:
junit.framework.AssertionFailedError: 
This should not throw an exception Environment variable "PATH" evaluates to "f:\\jenkins\\tools\\java\\latest1.8/bin;f:\jenkins\jenkins-slave\workspace\aven-enforcer_IMPROVE_TESTS-STPPGKMLZMMP35I7IYC3BJFSM5FR665OYVQGY7GQ7REZ2ZJBGHFA@2@2@tmp\withMavene82c6b0b;C:\Program Files (x86)\Common Files\Oracle\Java\javapath;C:\ProgramData\Oracle\Java\javapath;C:\Windows\system32;C:\Windows;C:\Windows\System32\Wbem;
C:\Windows\System32\WindowsPowerShell\v1.0\;C:\Program Files\Amazon\cfn-bootstrap\;C:\Program Files\Puppet Labs\Puppet\bin;c:\Program Files (x86)\Subversion\bin;C:\Pro
gram Files\Git\cmd;C:\Program Files\Microsoft SQL Server\130\Tools\Binn\;C:\Users\Administrator\.dnx\bin;C:\Program Files\Microsoft DNX\Dnvm\;C:\Program Files (x86)\Wi
ndows Kits\8.1\Windows Performance Toolkit\;F:\Program Files\CMake\bin;C:\Users\Administrator\AppData\Local\Microsoft\WindowsApps;".  This does not match the regular expression ".{1,}"
	at org.apache.maven.plugins.enforcer.TestRequireEnvironmentVariable.testRuleWithRegex(TestRequireEnvironmentVariable.java:123)


FAILED:  org.apache.maven.plugins.enforcer.TestRequireEnvironmentVariable.testRuleWithRegexDifferent

Error Message:
This should not throw an exception Environment variable "PATH" evaluates to "f:\\jenkins\\tools\\java\\latest1.7/bin;f:\jenkins\jenkins-slave\workspace\aven-enforcer_IMPROVE_TESTS-STPPGKMLZMMP35I7IYC3BJFSM5FR665OYVQGY7GQ7REZ2ZJBGHFA@3@tmp\withMaven4b50382e;C:\Program Files (x86)\Common Files\Oracle\Java\javapath;C:\ProgramData\Oracle\Java\javapath;C:\Windows\system32;C:\Windows;C:\Windows\System32\Wbem;
C:\Windows\System32\WindowsPowerShell\v1.0\;C:\Program Files\Amazon\cfn-bootstrap\;C:\Program Files\Puppet Labs\Puppet\bin;c:\Program Files (x86)\Subversion\bin;C:\Pro
gram Files\Git\cmd;C:\Program Files\Microsoft SQL Server\130\Tools\Binn\;C:\Users\Administrator\.dnx\bin;C:\Program Files\Microsoft DNX\Dnvm\;C:\Program Files (x86)\Wi
ndows Kits\8.1\Windows Performance Toolkit\;F:\Program Files\CMake\bin;C:\Users\Administrator\AppData\Local\Microsoft\WindowsApps;".  This does not match the regular expression ".+"

Stack Trace:
junit.framework.AssertionFailedError: 
This should not throw an exception Environment variable "PATH" evaluates to "f:\\jenkins\\tools\\java\\latest1.7/bin;f:\jenkins\jenkins-slave\workspace\aven-enforcer_IMPROVE_TESTS-STPPGKMLZMMP35I7IYC3BJFSM5FR665OYVQGY7GQ7REZ2ZJBGHFA@3@tmp\withMaven4b50382e;C:\Program Files (x86)\Common Files\Oracle\Java\javapath;C:\ProgramData\Oracle\Java\javapath;C:\Windows\system32;C:\Windows;C:\Windows\System32\Wbem;
C:\Windows\System32\WindowsPowerShell\v1.0\;C:\Program Files\Amazon\cfn-bootstrap\;C:\Program Files\Puppet Labs\Puppet\bin;c:\Program Files (x86)\Subversion\bin;C:\Pro
gram Files\Git\cmd;C:\Program Files\Microsoft SQL Server\130\Tools\Binn\;C:\Users\Administrator\.dnx\bin;C:\Program Files\Microsoft DNX\Dnvm\;C:\Program Files (x86)\Wi
ndows Kits\8.1\Windows Performance Toolkit\;F:\Program Files\CMake\bin;C:\Users\Administrator\AppData\Local\Microsoft\WindowsApps;".  This does not match the regular expression ".+"
	at org.apache.maven.plugins.enforcer.TestRequireEnvironmentVariable.testRuleWithRegexDifferent(TestRequireEnvironmentVariable.java:148)


FAILED:  org.apache.maven.plugins.enforcer.TestRequireEnvironmentVariable.testRuleWithRegex

Error Message:
This should not throw an exception Environment variable "PATH" evaluates to "f:\\jenkins\\tools\\java\\latest1.7/bin;f:\jenkins\jenkins-slave\workspace\aven-enforcer_IMPROVE_TESTS-STPPGKMLZMMP35I7IYC3BJFSM5FR665OYVQGY7GQ7REZ2ZJBGHFA@3@tmp\withMaven4b50382e;C:\Program Files (x86)\Common Files\Oracle\Java\javapath;C:\ProgramData\Oracle\Java\javapath;C:\Windows\system32;C:\Windows;C:\Windows\System32\Wbem;
C:\Windows\System32\WindowsPowerShell\v1.0\;C:\Program Files\Amazon\cfn-bootstrap\;C:\Program Files\Puppet Labs\Puppet\bin;c:\Program Files (x86)\Subversion\bin;C:\Pro
gram Files\Git\cmd;C:\Program Files\Microsoft SQL Server\130\Tools\Binn\;C:\Users\Administrator\.dnx\bin;C:\Program Files\Microsoft DNX\Dnvm\;C:\Program Files (x86)\Wi
ndows Kits\8.1\Windows Performance Toolkit\;F:\Program Files\CMake\bin;C:\Users\Administrator\AppData\Local\Microsoft\WindowsApps;".  This does not match the regular expression ".{1,}"

Stack Trace:
junit.framework.AssertionFailedError: 
This should not throw an exception Environment variable "PATH" evaluates to "f:\\jenkins\\tools\\java\\latest1.7/bin;f:\jenkins\jenkins-slave\workspace\aven-enforcer_IMPROVE_TESTS-STPPGKMLZMMP35I7IYC3BJFSM5FR665OYVQGY7GQ7REZ2ZJBGHFA@3@tmp\withMaven4b50382e;C:\Program Files (x86)\Common Files\Oracle\Java\javapath;C:\ProgramData\Oracle\Java\javapath;C:\Windows\system32;C:\Windows;C:\Windows\System32\Wbem;
C:\Windows\System32\WindowsPowerShell\v1.0\;C:\Program Files\Amazon\cfn-bootstrap\;C:\Program Files\Puppet Labs\Puppet\bin;c:\Program Files (x86)\Subversion\bin;C:\Pro
gram Files\Git\cmd;C:\Program Files\Microsoft SQL Server\130\Tools\Binn\;C:\Users\Administrator\.dnx\bin;C:\Program Files\Microsoft DNX\Dnvm\;C:\Program Files (x86)\Wi
ndows Kits\8.1\Windows Performance Toolkit\;F:\Program Files\CMake\bin;C:\Users\Administrator\AppData\Local\Microsoft\WindowsApps;".  This does not match the regular expression ".{1,}"
	at org.apache.maven.plugins.enforcer.TestRequireEnvironmentVariable.testRuleWithRegex(TestRequireEnvironmentVariable.java:123)


FAILED:  org.apache.maven.plugins.enforcer.TestRequireEnvironmentVariable.testRuleWithRegexDifferent

Error Message:
This should not throw an exception Environment variable "PATH" evaluates to "f:\\jenkins\\tools\\java\\latest1.7/bin;f:\jenkins\jenkins-slave\workspace\aven-enforcer_IMPROVE_TESTS-STPPGKMLZMMP35I7IYC3BJFSM5FR665OYVQGY7GQ7REZ2ZJBGHFA@2@tmp\withMavena08d584e;C:\Program Files (x86)\Common Files\Oracle\Java\javapath;C:\ProgramData\Oracle\Java\javapath;C:\Windows\system32;C:\Windows;C:\Windows\System32\Wbem;
C:\Windows\System32\WindowsPowerShell\v1.0\;C:\Program Files\Amazon\cfn-bootstrap\;C:\Program Files\Puppet Labs\Puppet\bin;c:\Program Files (x86)\Subversion\bin;C:\Pro
gram Files\Git\cmd;C:\Program Files\Microsoft SQL Server\130\Tools\Binn\;C:\Users\Administrator\.dnx\bin;C:\Program Files\Microsoft DNX\Dnvm\;C:\Program Files (x86)\Wi
ndows Kits\8.1\Windows Performance Toolkit\;F:\Program Files\CMake\bin;C:\Users\Administrator\AppData\Local\Microsoft\WindowsApps;".  This does not match the regular expression ".+"

Stack Trace:
junit.framework.AssertionFailedError: 
This should not throw an exception Environment variable "PATH" evaluates to "f:\\jenkins\\tools\\java\\latest1.7/bin;f:\jenkins\jenkins-slave\workspace\aven-enforcer_IMPROVE_TESTS-STPPGKMLZMMP35I7IYC3BJFSM5FR665OYVQGY7GQ7REZ2ZJBGHFA@2@tmp\withMavena08d584e;C:\Program Files (x86)\Common Files\Oracle\Java\javapath;C:\ProgramData\Oracle\Java\javapath;C:\Windows\system32;C:\Windows;C:\Windows\System32\Wbem;
C:\Windows\System32\WindowsPowerShell\v1.0\;C:\Program Files\Amazon\cfn-bootstrap\;C:\Program Files\Puppet Labs\Puppet\bin;c:\Program Files (x86)\Subversion\bin;C:\Pro
gram Files\Git\cmd;C:\Program Files\Microsoft SQL Server\130\Tools\Binn\;C:\Users\Administrator\.dnx\bin;C:\Program Files\Microsoft DNX\Dnvm\;C:\Program Files (x86)\Wi
ndows Kits\8.1\Windows Performance Toolkit\;F:\Program Files\CMake\bin;C:\Users\Administrator\AppData\Local\Microsoft\WindowsApps;".  This does not match the regular expression ".+"
	at org.apache.maven.plugins.enforcer.TestRequireEnvironmentVariable.testRuleWithRegexDifferent(TestRequireEnvironmentVariable.java:148)


FAILED:  org.apache.maven.plugins.enforcer.TestRequireEnvironmentVariable.testRuleWithRegex

Error Message:
This should not throw an exception Environment variable "PATH" evaluates to "f:\\jenkins\\tools\\java\\latest1.7/bin;f:\jenkins\jenkins-slave\workspace\aven-enforcer_IMPROVE_TESTS-STPPGKMLZMMP35I7IYC3BJFSM5FR665OYVQGY7GQ7REZ2ZJBGHFA@2@tmp\withMavena08d584e;C:\Program Files (x86)\Common Files\Oracle\Java\javapath;C:\ProgramData\Oracle\Java\javapath;C:\Windows\system32;C:\Windows;C:\Windows\System32\Wbem;
C:\Windows\System32\WindowsPowerShell\v1.0\;C:\Program Files\Amazon\cfn-bootstrap\;C:\Program Files\Puppet Labs\Puppet\bin;c:\Program Files (x86)\Subversion\bin;C:\Pro
gram Files\Git\cmd;C:\Program Files\Microsoft SQL Server\130\Tools\Binn\;C:\Users\Administrator\.dnx\bin;C:\Program Files\Microsoft DNX\Dnvm\;C:\Program Files (x86)\Wi
ndows Kits\8.1\Windows Performance Toolkit\;F:\Program Files\CMake\bin;C:\Users\Administrator\AppData\Local\Microsoft\WindowsApps;".  This does not match the regular expression ".{1,}"

Stack Trace:
junit.framework.AssertionFailedError: 
This should not throw an exception Environment variable "PATH" evaluates to "f:\\jenkins\\tools\\java\\latest1.7/bin;f:\jenkins\jenkins-slave\workspace\aven-enforcer_IMPROVE_TESTS-STPPGKMLZMMP35I7IYC3BJFSM5FR665OYVQGY7GQ7REZ2ZJBGHFA@2@tmp\withMavena08d584e;C:\Program Files (x86)\Common Files\Oracle\Java\javapath;C:\ProgramData\Oracle\Java\javapath;C:\Windows\system32;C:\Windows;C:\Windows\System32\Wbem;
C:\Windows\System32\WindowsPowerShell\v1.0\;C:\Program Files\Amazon\cfn-bootstrap\;C:\Program Files\Puppet Labs\Puppet\bin;c:\Program Files (x86)\Subversion\bin;C:\Pro
gram Files\Git\cmd;C:\Program Files\Microsoft SQL Server\130\Tools\Binn\;C:\Users\Administrator\.dnx\bin;C:\Program Files\Microsoft DNX\Dnvm\;C:\Program Files (x86)\Wi
ndows Kits\8.1\Windows Performance Toolkit\;F:\Program Files\CMake\bin;C:\Users\Administrator\AppData\Local\Microsoft\WindowsApps;".  This does not match the regular expression ".{1,}"
	at org.apache.maven.plugins.enforcer.TestRequireEnvironmentVariable.testRuleWithRegex(TestRequireEnvironmentVariable.java:123)


FAILED:  org.apache.maven.plugins.enforcer.TestRequireEnvironmentVariable.testRuleWithRegexDifferent

Error Message:
This should not throw an exception Environment variable "PATH" evaluates to "f:\\jenkins\\tools\\java\\latest11/bin;f:\jenkins\jenkins-slave\workspace\aven-enforcer_IMPROVE_TESTS-STPPGKMLZMMP35I7IYC3BJFSM5FR665OYVQGY7GQ7REZ2ZJBGHFA@2@tmp\withMavenebdd7a7e;C:\Program Files (x86)\Common Files\Oracle\Java\javapath;C:\ProgramData\Oracle\Java\javapath;C:\Windows\system32;C:\Windows;C:\Windows\System32\Wbem;
C:\Windows\System32\WindowsPowerShell\v1.0\;C:\Program Files\Amazon\cfn-bootstrap\;C:\Program Files\Puppet Labs\Puppet\bin;c:\Program Files (x86)\Subversion\bin;C:\Pro
gram Files\Git\cmd;C:\Program Files\Microsoft SQL Server\130\Tools\Binn\;C:\Users\Administrator\.dnx\bin;C:\Program Files\Microsoft DNX\Dnvm\;C:\Program Files (x86)\Wi
ndows Kits\8.1\Windows Performance Toolkit\;F:\Program Files\CMake\bin;C:\Users\Administrator\AppData\Local\Microsoft\WindowsApps;".  This does not match the regular expression ".+"

Stack Trace:
junit.framework.AssertionFailedError: 
This should not throw an exception Environment variable "PATH" evaluates to "f:\\jenkins\\tools\\java\\latest11/bin;f:\jenkins\jenkins-slave\workspace\aven-enforcer_IMPROVE_TESTS-STPPGKMLZMMP35I7IYC3BJFSM5FR665OYVQGY7GQ7REZ2ZJBGHFA@2@tmp\withMavenebdd7a7e;C:\Program Files (x86)\Common Files\Oracle\Java\javapath;C:\ProgramData\Oracle\Java\javapath;C:\Windows\system32;C:\Windows;C:\Windows\System32\Wbem;
C:\Windows\System32\WindowsPowerShell\v1.0\;C:\Program Files\Amazon\cfn-bootstrap\;C:\Program Files\Puppet Labs\Puppet\bin;c:\Program Files (x86)\Subversion\bin;C:\Pro
gram Files\Git\cmd;C:\Program Files\Microsoft SQL Server\130\Tools\Binn\;C:\Users\Administrator\.dnx\bin;C:\Program Files\Microsoft DNX\Dnvm\;C:\Program Files (x86)\Wi
ndows Kits\8.1\Windows Performance Toolkit\;F:\Program Files\CMake\bin;C:\Users\Administrator\AppData\Local\Microsoft\WindowsApps;".  This does not match the regular expression ".+"
	at org.apache.maven.plugins.enforcer.TestRequireEnvironmentVariable.testRuleWithRegexDifferent(TestRequireEnvironmentVariable.java:148)


FAILED:  org.apache.maven.plugins.enforcer.TestRequireEnvironmentVariable.testRuleWithRegex

Error Message:
This should not throw an exception Environment variable "PATH" evaluates to "f:\\jenkins\\tools\\java\\latest11/bin;f:\jenkins\jenkins-slave\workspace\aven-enforcer_IMPROVE_TESTS-STPPGKMLZMMP35I7IYC3BJFSM5FR665OYVQGY7GQ7REZ2ZJBGHFA@2@tmp\withMavenebdd7a7e;C:\Program Files (x86)\Common Files\Oracle\Java\javapath;C:\ProgramData\Oracle\Java\javapath;C:\Windows\system32;C:\Windows;C:\Windows\System32\Wbem;
C:\Windows\System32\WindowsPowerShell\v1.0\;C:\Program Files\Amazon\cfn-bootstrap\;C:\Program Files\Puppet Labs\Puppet\bin;c:\Program Files (x86)\Subversion\bin;C:\Pro
gram Files\Git\cmd;C:\Program Files\Microsoft SQL Server\130\Tools\Binn\;C:\Users\Administrator\.dnx\bin;C:\Program Files\Microsoft DNX\Dnvm\;C:\Program Files (x86)\Wi
ndows Kits\8.1\Windows Performance Toolkit\;F:\Program Files\CMake\bin;C:\Users\Administrator\AppData\Local\Microsoft\WindowsApps;".  This does not match the regular expression ".{1,}"

Stack Trace:
junit.framework.AssertionFailedError: 
This should not throw an exception Environment variable "PATH" evaluates to "f:\\jenkins\\tools\\java\\latest11/bin;f:\jenkins\jenkins-slave\workspace\aven-enforcer_IMPROVE_TESTS-STPPGKMLZMMP35I7IYC3BJFSM5FR665OYVQGY7GQ7REZ2ZJBGHFA@2@tmp\withMavenebdd7a7e;C:\Program Files (x86)\Common Files\Oracle\Java\javapath;C:\ProgramData\Oracle\Java\javapath;C:\Windows\system32;C:\Windows;C:\Windows\System32\Wbem;
C:\Windows\System32\WindowsPowerShell\v1.0\;C:\Program Files\Amazon\cfn-bootstrap\;C:\Program Files\Puppet Labs\Puppet\bin;c:\Program Files (x86)\Subversion\bin;C:\Pro
gram Files\Git\cmd;C:\Program Files\Microsoft SQL Server\130\Tools\Binn\;C:\Users\Administrator\.dnx\bin;C:\Program Files\Microsoft DNX\Dnvm\;C:\Program Files (x86)\Wi
ndows Kits\8.1\Windows Performance Toolkit\;F:\Program Files\CMake\bin;C:\Users\Administrator\AppData\Local\Microsoft\WindowsApps;".  This does not match the regular expression ".{1,}"
	at org.apache.maven.plugins.enforcer.TestRequireEnvironmentVariable.testRuleWithRegex(TestRequireEnvironmentVariable.java:123)


FAILED:  org.apache.maven.plugins.enforcer.TestRequireEnvironmentVariable.testRuleWithRegexDifferent

Error Message:
This should not throw an exception Environment variable "PATH" evaluates to "f:\\jenkins\\tools\\java\\latest1.7/bin;f:\jenkins\jenkins-slave\workspace\aven-enforcer_IMPROVE_TESTS-STPPGKMLZMMP35I7IYC3BJFSM5FR665OYVQGY7GQ7REZ2ZJBGHFA@2@tmp\withMavenf14e7287;C:\Program Files (x86)\Common Files\Oracle\Java\javapath;C:\ProgramData\Oracle\Java\javapath;C:\Windows\system32;C:\Windows;C:\Windows\System32\Wbem;
C:\Windows\System32\WindowsPowerShell\v1.0\;C:\Program Files\Amazon\cfn-bootstrap\;C:\Program Files\Puppet Labs\Puppet\bin;c:\Program Files (x86)\Subversion\bin;C:\Pro
gram Files\Git\cmd;C:\Program Files\Microsoft SQL Server\130\Tools\Binn\;C:\Users\Administrator\.dnx\bin;C:\Program Files\Microsoft DNX\Dnvm\;C:\Program Files (x86)\Wi
ndows Kits\8.1\Windows Performance Toolkit\;F:\Program Files\CMake\bin;C:\Users\Administrator\AppData\Local\Microsoft\WindowsApps;".  This does not match the regular expression ".+"

Stack Trace:
junit.framework.AssertionFailedError: 
This should not throw an exception Environment variable "PATH" evaluates to "f:\\jenkins\\tools\\java\\latest1.7/bin;f:\jenkins\jenkins-slave\workspace\aven-enforcer_IMPROVE_TESTS-STPPGKMLZMMP35I7IYC3BJFSM5FR665OYVQGY7GQ7REZ2ZJBGHFA@2@tmp\withMavenf14e7287;C:\Program Files (x86)\Common Files\Oracle\Java\javapath;C:\ProgramData\Oracle\Java\javapath;C:\Windows\system32;C:\Windows;C:\Windows\System32\Wbem;
C:\Windows\System32\WindowsPowerShell\v1.0\;C:\Program Files\Amazon\cfn-bootstrap\;C:\Program Files\Puppet Labs\Puppet\bin;c:\Program Files (x86)\Subversion\bin;C:\Pro
gram Files\Git\cmd;C:\Program Files\Microsoft SQL Server\130\Tools\Binn\;C:\Users\Administrator\.dnx\bin;C:\Program Files\Microsoft DNX\Dnvm\;C:\Program Files (x86)\Wi
ndows Kits\8.1\Windows Performance Toolkit\;F:\Program Files\CMake\bin;C:\Users\Administrator\AppData\Local\Microsoft\WindowsApps;".  This does not match the regular expression ".+"
	at org.apache.maven.plugins.enforcer.TestRequireEnvironmentVariable.testRuleWithRegexDifferent(TestRequireEnvironmentVariable.java:148)


FAILED:  org.apache.maven.plugins.enforcer.TestRequireEnvironmentVariable.testRuleWithRegex

Error Message:
This should not throw an exception Environment variable "PATH" evaluates to "f:\\jenkins\\tools\\java\\latest1.7/bin;f:\jenkins\jenkins-slave\workspace\aven-enforcer_IMPROVE_TESTS-STPPGKMLZMMP35I7IYC3BJFSM5FR665OYVQGY7GQ7REZ2ZJBGHFA@2@tmp\withMavenf14e7287;C:\Program Files (x86)\Common Files\Oracle\Java\javapath;C:\ProgramData\Oracle\Java\javapath;C:\Windows\system32;C:\Windows;C:\Windows\System32\Wbem;
C:\Windows\System32\WindowsPowerShell\v1.0\;C:\Program Files\Amazon\cfn-bootstrap\;C:\Program Files\Puppet Labs\Puppet\bin;c:\Program Files (x86)\Subversion\bin;C:\Pro
gram Files\Git\cmd;C:\Program Files\Microsoft SQL Server\130\Tools\Binn\;C:\Users\Administrator\.dnx\bin;C:\Program Files\Microsoft DNX\Dnvm\;C:\Program Files (x86)\Wi
ndows Kits\8.1\Windows Performance Toolkit\;F:\Program Files\CMake\bin;C:\Users\Administrator\AppData\Local\Microsoft\WindowsApps;".  This does not match the regular expression ".{1,}"

Stack Trace:
junit.framework.AssertionFailedError: 
This should not throw an exception Environment variable "PATH" evaluates to "f:\\jenkins\\tools\\java\\latest1.7/bin;f:\jenkins\jenkins-slave\workspace\aven-enforcer_IMPROVE_TESTS-STPPGKMLZMMP35I7IYC3BJFSM5FR665OYVQGY7GQ7REZ2ZJBGHFA@2@tmp\withMavenf14e7287;C:\Program Files (x86)\Common Files\Oracle\Java\javapath;C:\ProgramData\Oracle\Java\javapath;C:\Windows\system32;C:\Windows;C:\Windows\System32\Wbem;
C:\Windows\System32\WindowsPowerShell\v1.0\;C:\Program Files\Amazon\cfn-bootstrap\;C:\Program Files\Puppet Labs\Puppet\bin;c:\Program Files (x86)\Subversion\bin;C:\Pro
gram Files\Git\cmd;C:\Program Files\Microsoft SQL Server\130\Tools\Binn\;C:\Users\Administrator\.dnx\bin;C:\Program Files\Microsoft DNX\Dnvm\;C:\Program Files (x86)\Wi
ndows Kits\8.1\Windows Performance Toolkit\;F:\Program Files\CMake\bin;C:\Users\Administrator\AppData\Local\Microsoft\WindowsApps;".  This does not match the regular expression ".{1,}"
	at org.apache.maven.plugins.enforcer.TestRequireEnvironmentVariable.testRuleWithRegex(TestRequireEnvironmentVariable.java:123)


FAILED:  org.apache.maven.plugins.enforcer.TestRequireEnvironmentVariable.testRuleWithRegexDifferent

Error Message:
This should not throw an exception Environment variable "PATH" evaluates to "f:\\jenkins\\tools\\java\\latest10/bin;f:\jenkins\jenkins-slave\workspace\aven-enforcer_IMPROVE_TESTS-STPPGKMLZMMP35I7IYC3BJFSM5FR665OYVQGY7GQ7REZ2ZJBGHFA@2@2@tmp\withMaven9a2dd184;C:\Program Files (x86)\Common Files\Oracle\Java\javapath;C:\ProgramData\Oracle\Java\javapath;C:\Windows\system32;C:\Windows;C:\Windows\System32\Wbem;
C:\Windows\System32\WindowsPowerShell\v1.0\;C:\Program Files\Amazon\cfn-bootstrap\;C:\Program Files\Puppet Labs\Puppet\bin;c:\Program Files (x86)\Subversion\bin;C:\Pro
gram Files\Git\cmd;C:\Program Files\Microsoft SQL Server\130\Tools\Binn\;C:\Users\Administrator\.dnx\bin;C:\Program Files\Microsoft DNX\Dnvm\;C:\Program Files (x86)\Wi
ndows Kits\8.1\Windows Performance Toolkit\;F:\Program Files\CMake\bin;C:\Users\Administrator\AppData\Local\Microsoft\WindowsApps;".  This does not match the regular expression ".+"

Stack Trace:
junit.framework.AssertionFailedError: 
This should not throw an exception Environment variable "PATH" evaluates to "f:\\jenkins\\tools\\java\\latest10/bin;f:\jenkins\jenkins-slave\workspace\aven-enforcer_IMPROVE_TESTS-STPPGKMLZMMP35I7IYC3BJFSM5FR665OYVQGY7GQ7REZ2ZJBGHFA@2@2@tmp\withMaven9a2dd184;C:\Program Files (x86)\Common Files\Oracle\Java\javapath;C:\ProgramData\Oracle\Java\javapath;C:\Windows\system32;C:\Windows;C:\Windows\System32\Wbem;
C:\Windows\System32\WindowsPowerShell\v1.0\;C:\Program Files\Amazon\cfn-bootstrap\;C:\Program Files\Puppet Labs\Puppet\bin;c:\Program Files (x86)\Subversion\bin;C:\Pro
gram Files\Git\cmd;C:\Program Files\Microsoft SQL Server\130\Tools\Binn\;C:\Users\Administrator\.dnx\bin;C:\Program Files\Microsoft DNX\Dnvm\;C:\Program Files (x86)\Wi
ndows Kits\8.1\Windows Performance Toolkit\;F:\Program Files\CMake\bin;C:\Users\Administrator\AppData\Local\Microsoft\WindowsApps;".  This does not match the regular expression ".+"
	at org.apache.maven.plugins.enforcer.TestRequireEnvironmentVariable.testRuleWithRegexDifferent(TestRequireEnvironmentVariable.java:148)


FAILED:  org.apache.maven.plugins.enforcer.TestRequireEnvironmentVariable.testRuleWithRegex

Error Message:
This should not throw an exception Environment variable "PATH" evaluates to "f:\\jenkins\\tools\\java\\latest10/bin;f:\jenkins\jenkins-slave\workspace\aven-enforcer_IMPROVE_TESTS-STPPGKMLZMMP35I7IYC3BJFSM5FR665OYVQGY7GQ7REZ2ZJBGHFA@2@2@tmp\withMaven9a2dd184;C:\Program Files (x86)\Common Files\Oracle\Java\javapath;C:\ProgramData\Oracle\Java\javapath;C:\Windows\system32;C:\Windows;C:\Windows\System32\Wbem;
C:\Windows\System32\WindowsPowerShell\v1.0\;C:\Program Files\Amazon\cfn-bootstrap\;C:\Program Files\Puppet Labs\Puppet\bin;c:\Program Files (x86)\Subversion\bin;C:\Pro
gram Files\Git\cmd;C:\Program Files\Microsoft SQL Server\130\Tools\Binn\;C:\Users\Administrator\.dnx\bin;C:\Program Files\Microsoft DNX\Dnvm\;C:\Program Files (x86)\Wi
ndows Kits\8.1\Windows Performance Toolkit\;F:\Program Files\CMake\bin;C:\Users\Administrator\AppData\Local\Microsoft\WindowsApps;".  This does not match the regular expression ".{1,}"

Stack Trace:
junit.framework.AssertionFailedError: 
This should not throw an exception Environment variable "PATH" evaluates to "f:\\jenkins\\tools\\java\\latest10/bin;f:\jenkins\jenkins-slave\workspace\aven-enforcer_IMPROVE_TESTS-STPPGKMLZMMP35I7IYC3BJFSM5FR665OYVQGY7GQ7REZ2ZJBGHFA@2@2@tmp\withMaven9a2dd184;C:\Program Files (x86)\Common Files\Oracle\Java\javapath;C:\ProgramData\Oracle\Java\javapath;C:\Windows\system32;C:\Windows;C:\Windows\System32\Wbem;
C:\Windows\System32\WindowsPowerShell\v1.0\;C:\Program Files\Amazon\cfn-bootstrap\;C:\Program Files\Puppet Labs\Puppet\bin;c:\Program Files (x86)\Subversion\bin;C:\Pro
gram Files\Git\cmd;C:\Program Files\Microsoft SQL Server\130\Tools\Binn\;C:\Users\Administrator\.dnx\bin;C:\Program Files\Microsoft DNX\Dnvm\;C:\Program Files (x86)\Wi
ndows Kits\8.1\Windows Performance Toolkit\;F:\Program Files\CMake\bin;C:\Users\Administrator\AppData\Local\Microsoft\WindowsApps;".  This does not match the regular expression ".{1,}"
	at org.apache.maven.plugins.enforcer.TestRequireEnvironmentVariable.testRuleWithRegex(TestRequireEnvironmentVariable.java:123)


FAILED:  org.apache.maven.plugins.enforcer.TestRequireEnvironmentVariable.testRuleWithRegexDifferent

Error Message:
This should not throw an exception Environment variable "PATH" evaluates to "f:\\jenkins\\tools\\java\\latest9/bin;f:\jenkins\jenkins-slave\workspace\aven-enforcer_IMPROVE_TESTS-STPPGKMLZMMP35I7IYC3BJFSM5FR665OYVQGY7GQ7REZ2ZJBGHFA@3@tmp\withMaven254a526d;C:\Program Files (x86)\Common Files\Oracle\Java\javapath;C:\ProgramData\Oracle\Java\javapath;C:\Windows\system32;C:\Windows;C:\Windows\System32\Wbem;
C:\Windows\System32\WindowsPowerShell\v1.0\;C:\Program Files\Amazon\cfn-bootstrap\;C:\Program Files\Puppet Labs\Puppet\bin;c:\Program Files (x86)\Subversion\bin;C:\Pro
gram Files\Git\cmd;C:\Program Files\Microsoft SQL Server\130\Tools\Binn\;C:\Users\Administrator\.dnx\bin;C:\Program Files\Microsoft DNX\Dnvm\;C:\Program Files (x86)\Wi
ndows Kits\8.1\Windows Performance Toolkit\;F:\Program Files\CMake\bin;C:\Users\Administrator\AppData\Local\Microsoft\WindowsApps;".  This does not match the regular expression ".+"

Stack Trace:
junit.framework.AssertionFailedError: 
This should not throw an exception Environment variable "PATH" evaluates to "f:\\jenkins\\tools\\java\\latest9/bin;f:\jenkins\jenkins-slave\workspace\aven-enforcer_IMPROVE_TESTS-STPPGKMLZMMP35I7IYC3BJFSM5FR665OYVQGY7GQ7REZ2ZJBGHFA@3@tmp\withMaven254a526d;C:\Program Files (x86)\Common Files\Oracle\Java\javapath;C:\ProgramData\Oracle\Java\javapath;C:\Windows\system32;C:\Windows;C:\Windows\System32\Wbem;
C:\Windows\System32\WindowsPowerShell\v1.0\;C:\Program Files\Amazon\cfn-bootstrap\;C:\Program Files\Puppet Labs\Puppet\bin;c:\Program Files (x86)\Subversion\bin;C:\Pro
gram Files\Git\cmd;C:\Program Files\Microsoft SQL Server\130\Tools\Binn\;C:\Users\Administrator\.dnx\bin;C:\Program Files\Microsoft DNX\Dnvm\;C:\Program Files (x86)\Wi
ndows Kits\8.1\Windows Performance Toolkit\;F:\Program Files\CMake\bin;C:\Users\Administrator\AppData\Local\Microsoft\WindowsApps;".  This does not match the regular expression ".+"
	at org.apache.maven.plugins.enforcer.TestRequireEnvironmentVariable.testRuleWithRegexDifferent(TestRequireEnvironmentVariable.java:148)


FAILED:  org.apache.maven.plugins.enforcer.TestRequireEnvironmentVariable.testRuleWithRegex

Error Message:
This should not throw an exception Environment variable "PATH" evaluates to "f:\\jenkins\\tools\\java\\latest9/bin;f:\jenkins\jenkins-slave\workspace\aven-enforcer_IMPROVE_TESTS-STPPGKMLZMMP35I7IYC3BJFSM5FR665OYVQGY7GQ7REZ2ZJBGHFA@3@tmp\withMaven254a526d;C:\Program Files (x86)\Common Files\Oracle\Java\javapath;C:\ProgramData\Oracle\Java\javapath;C:\Windows\system32;C:\Windows;C:\Windows\System32\Wbem;
C:\Windows\System32\WindowsPowerShell\v1.0\;C:\Program Files\Amazon\cfn-bootstrap\;C:\Program Files\Puppet Labs\Puppet\bin;c:\Program Files (x86)\Subversion\bin;C:\Pro
gram Files\Git\cmd;C:\Program Files\Microsoft SQL Server\130\Tools\Binn\;C:\Users\Administrator\.dnx\bin;C:\Program Files\Microsoft DNX\Dnvm\;C:\Program Files (x86)\Wi
ndows Kits\8.1\Windows Performance Toolkit\;F:\Program Files\CMake\bin;C:\Users\Administrator\AppData\Local\Microsoft\WindowsApps;".  This does not match the regular expression ".{1,}"

Stack Trace:
junit.framework.AssertionFailedError: 
This should not throw an exception Environment variable "PATH" evaluates to "f:\\jenkins\\tools\\java\\latest9/bin;f:\jenkins\jenkins-slave\workspace\aven-enforcer_IMPROVE_TESTS-STPPGKMLZMMP35I7IYC3BJFSM5FR665OYVQGY7GQ7REZ2ZJBGHFA@3@tmp\withMaven254a526d;C:\Program Files (x86)\Common Files\Oracle\Java\javapath;C:\ProgramData\Oracle\Java\javapath;C:\Windows\system32;C:\Windows;C:\Windows\System32\Wbem;
C:\Windows\System32\WindowsPowerShell\v1.0\;C:\Program Files\Amazon\cfn-bootstrap\;C:\Program Files\Puppet Labs\Puppet\bin;c:\Program Files (x86)\Subversion\bin;C:\Pro
gram Files\Git\cmd;C:\Program Files\Microsoft SQL Server\130\Tools\Binn\;C:\Users\Administrator\.dnx\bin;C:\Program Files\Microsoft DNX\Dnvm\;C:\Program Files (x86)\Wi
ndows Kits\8.1\Windows Performance Toolkit\;F:\Program Files\CMake\bin;C:\Users\Administrator\AppData\Local\Microsoft\WindowsApps;".  This does not match the regular expression ".{1,}"
	at org.apache.maven.plugins.enforcer.TestRequireEnvironmentVariable.testRuleWithRegex(TestRequireEnvironmentVariable.java:123)




Build log:
[...truncated 6.09 MB...]
[Pipeline] [linux-jdk7-m3.2.x_build] // stage
[Pipeline] [linux-jdk8-m3.5.x_build] // stage
[Pipeline] [linux-jdk7-m3.3.x_build] // stage
[Pipeline] [linux-jdk10-m3.5.x_build] // stage
[Pipeline] [linux-jdk11-m3.5.x_build] }
[Pipeline] [linux-jdk7-m3.2.x_build] }
[Pipeline] [linux-jdk7-m3.3.x_build] }
[Pipeline] [linux-jdk8-m3.5.x_build] }
[Pipeline] [linux-jdk10-m3.5.x_build] }
[Pipeline] [windows-jdk8-m3.5.x_build] }
[Pipeline] [windows-jdk11-m3.5.x_build] }
[Pipeline] [windows-jdk7-m3.5.x_build] }
[Pipeline] [windows-jdk7-m3.2.x_build] }
[Pipeline] [windows-jdk7-m3.3.x_build] }
[Pipeline] [linux-jdk7-m3.2.x_build] // ws
[Pipeline] [linux-jdk7-m3.3.x_build] // ws
[Pipeline] [linux-jdk8-m3.5.x_build] // ws
[Pipeline] [linux-jdk10-m3.5.x_build] // ws
[Pipeline] [windows-jdk8-m3.5.x_build] // stage
[Pipeline] [windows-jdk11-m3.5.x_build] // stage
[Pipeline] [linux-jdk7-m3.2.x_build] }
[Pipeline] [linux-jdk7-m3.3.x_build] }
[Pipeline] [linux-jdk8-m3.5.x_build] }
[Pipeline] [linux-jdk10-m3.5.x_build] }
[Pipeline] [windows-jdk8-m3.5.x_build] }
[Pipeline] [windows-jdk11-m3.5.x_build] }
[Pipeline] [windows-jdk7-m3.5.x_build] // stage
[Pipeline] [windows-jdk7-m3.2.x_build] // stage
[Pipeline] [windows-jdk7-m3.2.x_build] }
[Pipeline] [windows-jdk7-m3.5.x_build] }
[Pipeline] [windows-jdk7-m3.3.x_build] // stage
[Pipeline] [windows-jdk7-m3.3.x_build] }
[Pipeline] [linux-jdk7-m3.2.x_build] // node
[Pipeline] [linux-jdk7-m3.3.x_build] // node
[linux-jdk7-m3.5.x_build] [WS-CLEANUP] Deleting project workspace...[WS-CLEANUP] done
[Pipeline] [linux-jdk8-m3.5.x_build] // node
[Pipeline] [linux-jdk10-m3.5.x_build] // node
[Pipeline] [windows-jdk8-m3.5.x_build] // ws
[Pipeline] [windows-jdk11-m3.5.x_build] // ws
[windows-jdk10-m3.5.x_build] [INFO]           require-upper-bound-deps_success\pom.xml ......... SUCCESS (6.8 s)
[windows-jdk10-m3.5.x_build] [INFO] Building: resolve_collect_dependencies\pom.xml
[Pipeline] [linux-jdk7-m3.2.x_build] }
[Pipeline] [linux-jdk7-m3.3.x_build] }
[Pipeline] [linux-jdk8-m3.5.x_build] }
[Pipeline] [linux-jdk10-m3.5.x_build] }
[Pipeline] [windows-jdk8-m3.5.x_build] }
[Pipeline] [windows-jdk11-m3.5.x_build] }
[Pipeline] [windows-jdk7-m3.2.x_build] // ws
[Pipeline] [windows-jdk7-m3.5.x_build] // ws
[Pipeline] [windows-jdk7-m3.2.x_build] }
[Pipeline] [windows-jdk7-m3.5.x_build] }
[Pipeline] [windows-jdk7-m3.3.x_build] // ws
[Pipeline] [windows-jdk7-m3.3.x_build] }
[Pipeline] [linux-jdk7-m3.5.x_build] }
[Pipeline] [windows-jdk8-m3.5.x_build] // node
[Pipeline] [windows-jdk11-m3.5.x_build] // node
[Pipeline] [windows-jdk8-m3.5.x_build] }
[Pipeline] [windows-jdk11-m3.5.x_build] }
[Pipeline] [windows-jdk7-m3.2.x_build] // node
[Pipeline] [windows-jdk7-m3.5.x_build] // node
[Pipeline] [windows-jdk7-m3.2.x_build] }
[Pipeline] [windows-jdk7-m3.5.x_build] }
[Pipeline] [windows-jdk7-m3.3.x_build] // node
[Pipeline] [windows-jdk7-m3.3.x_build] }
[Pipeline] [linux-jdk7-m3.5.x_build] // stage
[Pipeline] [linux-jdk7-m3.5.x_build] }
[Pipeline] [linux-jdk7-m3.5.x_build] // ws
[Pipeline] [linux-jdk7-m3.5.x_build] }
[Pipeline] [linux-jdk7-m3.5.x_build] // node
[Pipeline] [linux-jdk7-m3.5.x_build] }
[windows-jdk9-m3.5.x_build] [INFO]           require-snapshot-version_failure\pom.xml ......... SUCCESS (8.4 s)
[windows-jdk9-m3.5.x_build] [INFO] Building: require-snapshot-version_success\pom.xml
[windows-jdk9-m3.5.x_build] [INFO]           require-snapshot-version_success\pom.xml ......... SUCCESS (7.4 s)
[windows-jdk9-m3.5.x_build] [INFO] Building: require-upper-bound-dependencies-managed_failure\pom.xml
[windows-jdk10-m3.5.x_build] [INFO] run post-build script verify.groovy
[windows-jdk10-m3.5.x_build] [INFO]           resolve_collect_dependencies\pom.xml ............. SUCCESS (14.1 s)
[windows-jdk10-m3.5.x_build] [INFO] -------------------------------------------------
[windows-jdk10-m3.5.x_build] [INFO] Build Summary:
[windows-jdk10-m3.5.x_build] [INFO]   Passed: 68, Failed: 0, Errors: 0, Skipped: 0
[windows-jdk10-m3.5.x_build] [INFO] -------------------------------------------------
[windows-jdk10-m3.5.x_build] [INFO] 
[windows-jdk10-m3.5.x_build] [INFO] --- mrm-maven-plugin:1.0.0:stop (default) @ maven-enforcer-plugin ---
[windows-jdk10-m3.5.x_build] [INFO] Stopping Mock Repository Manager on http://localhost:55309
[windows-jdk10-m3.5.x_build] [INFO] Mock Repository Manager http://localhost:55309 is stopped.
[windows-jdk10-m3.5.x_build] [INFO] 
[windows-jdk10-m3.5.x_build] [INFO] --- maven-checkstyle-plugin:3.0.0:check (checkstyle-check) @ maven-enforcer-plugin ---
[windows-jdk10-m3.5.x_build] [INFO] ------------------------------------------------------------------------
[windows-jdk10-m3.5.x_build] [INFO] Reactor Summary:
[windows-jdk10-m3.5.x_build] [INFO] 
[windows-jdk10-m3.5.x_build] [INFO] Apache Maven Enforcer .............................. SUCCESS [ 47.144 s]
[windows-jdk10-m3.5.x_build] [INFO] Apache Maven Enforcer API .......................... SUCCESS [ 11.329 s]
[windows-jdk10-m3.5.x_build] [INFO] Apache Maven Enforcer Built-In Rules ............... SUCCESS [ 30.574 s]
[windows-jdk10-m3.5.x_build] [INFO] Apache Maven Enforcer Plugin ....................... SUCCESS [08:56 min]
[windows-jdk10-m3.5.x_build] [INFO] ------------------------------------------------------------------------
[windows-jdk10-m3.5.x_build] [INFO] BUILD SUCCESS
[windows-jdk10-m3.5.x_build] [INFO] ------------------------------------------------------------------------
[windows-jdk10-m3.5.x_build] [INFO] Total time: 10:28 min
[windows-jdk10-m3.5.x_build] [INFO] Finished at: 2018-11-09T00:31:43-08:00
[windows-jdk10-m3.5.x_build] [INFO] Final Memory: 51M/177M
[windows-jdk10-m3.5.x_build] [INFO] ------------------------------------------------------------------------
[windows-jdk10-m3.5.x_build] [INFO] [jenkins-event-spy] Generated F:\jenkins\jenkins-slave\workspace\aven-enforcer_IMPROVE_TESTS-STPPGKMLZMMP35I7IYC3BJFSM5FR665OYVQGY7GQ7REZ2ZJBGHFA@2@2@tmp\withMaven9a2dd184\maven-spy-20181109-002114-9325804548773568983992.log
[Pipeline] [windows-jdk10-m3.5.x_build] }
[Pipeline] [windows-jdk10-m3.5.x_build] // dir
[windows-jdk9-m3.5.x_build] [INFO] run post-build script verify.groovy
[windows-jdk9-m3.5.x_build] [INFO]           require-upper-bound-dependencies-managed_failure\pom.xml SUCCESS (7.8 s)
[windows-jdk9-m3.5.x_build] [INFO] Building: require-upper-bound-dependencies-managed_success\pom.xml
[Pipeline] [windows-jdk10-m3.5.x_build] }
[windows-jdk10-m3.5.x_build] [withMaven] artifactsPublisher - Archive artifact windows-jdk10-m3.5.x_build\pom.xml under org\apache\maven\enforcer\enforcer\3.0.0-SNAPSHOT\enforcer-3.0.0-SNAPSHOT.pom
[windows-jdk10-m3.5.x_build] [withMaven] artifactsPublisher - Archive artifact windows-jdk10-m3.5.x_build\target\enforcer-3.0.0-SNAPSHOT-site.xml under org\apache\maven\enforcer\enforcer\3.0.0-SNAPSHOT\enforcer-3.0.0-SNAPSHOT-site.xml
[windows-jdk10-m3.5.x_build] [withMaven] artifactsPublisher - Archive artifact windows-jdk10-m3.5.x_build\enforcer-api\pom.xml under org\apache\maven\enforcer\enforcer-api\3.0.0-SNAPSHOT\enforcer-api-3.0.0-SNAPSHOT.pom
[windows-jdk10-m3.5.x_build] [withMaven] artifactsPublisher - Archive artifact windows-jdk10-m3.5.x_build\enforcer-api\target\enforcer-api-3.0.0-SNAPSHOT.jar under org\apache\maven\enforcer\enforcer-api\3.0.0-SNAPSHOT\enforcer-api-3.0.0-SNAPSHOT.jar
[windows-jdk10-m3.5.x_build] [withMaven] artifactsPublisher - Archive artifact windows-jdk10-m3.5.x_build\enforcer-rules\pom.xml under org\apache\maven\enforcer\enforcer-rules\3.0.0-SNAPSHOT\enforcer-rules-3.0.0-SNAPSHOT.pom
[windows-jdk10-m3.5.x_build] [withMaven] artifactsPublisher - Archive artifact windows-jdk10-m3.5.x_build\enforcer-rules\target\enforcer-rules-3.0.0-SNAPSHOT.jar under org\apache\maven\enforcer\enforcer-rules\3.0.0-SNAPSHOT\enforcer-rules-3.0.0-SNAPSHOT.jar
[windows-jdk10-m3.5.x_build] [withMaven] artifactsPublisher - Archive artifact windows-jdk10-m3.5.x_build\enforcer-rules\target\enforcer-rules-3.0.0-SNAPSHOT-tests.jar under org\apache\maven\enforcer\enforcer-rules\3.0.0-SNAPSHOT\enforcer-rules-3.0.0-SNAPSHOT-tests.jar
[windows-jdk10-m3.5.x_build] [withMaven] artifactsPublisher - Archive artifact windows-jdk10-m3.5.x_build\maven-enforcer-plugin\pom.xml under org\apache\maven\plugins\maven-enforcer-plugin\3.0.0-SNAPSHOT\maven-enforcer-plugin-3.0.0-SNAPSHOT.pom
[windows-jdk10-m3.5.x_build] [withMaven] artifactsPublisher - Archive artifact windows-jdk10-m3.5.x_build\maven-enforcer-plugin\target\maven-enforcer-plugin-3.0.0-SNAPSHOT.jar under org\apache\maven\plugins\maven-enforcer-plugin\3.0.0-SNAPSHOT\maven-enforcer-plugin-3.0.0-SNAPSHOT.jar
[windows-jdk10-m3.5.x_build] [Fast Archiver] No prior successful build to compare, so performing full copy of artifacts
[windows-jdk10-m3.5.x_build] [withMaven] invokerPublisher - Archive invoker results for Maven artifact MavenArtifact{org.apache.maven.plugins:maven-enforcer-plugin::3.0.0-SNAPSHOT(version: 3.0.0-SNAPSHOT, snapshot:false) } generated by PluginInvocation{org.apache.maven.plugins:maven-invoker-plugin:3.1.0@run  integration-test}: windows-jdk10-m3.5.x_build\maven-enforcer-plugin\target\invoker-reports\*.xml
[windows-jdk10-m3.5.x_build] performing MavenInvokerRecorder, reportsFilenamePattern:'**/windows-jdk10-m3.5.x_build\maven-enforcer-plugin\target\invoker-reports/BUILD*.xml', invokerBuildDir:'**/windows-jdk10-m3.5.x_build\maven-enforcer-plugin\target\it'
[windows-jdk10-m3.5.x_build] Found reports:[f:\jenkins\jenkins-slave\workspace\aven-enforcer_IMPROVE_TESTS-STPPGKMLZMMP35I7IYC3BJFSM5FR665OYVQGY7GQ7REZ2ZJBGHFA@2@2\windows-jdk10-m3.5.x_build\maven-enforcer-plugin\target\invoker-reports\BUILD-always-fail-warn.xml, f:\jenkins\jenkins-slave\workspace\aven-enforcer_IMPROVE_TESTS-STPPGKMLZMMP35I7IYC3BJFSM5FR665OYVQGY7GQ7REZ2ZJBGHFA@2@2\windows-jdk10-m3.5.x_build\maven-enforcer-plugin\target\invoker-reports\BUILD-always-fail.xml, f:\jenkins\jenkins-slave\workspace\aven-enforcer_IMPROVE_TESTS-STPPGKMLZMMP35I7IYC3BJFSM5FR665OYVQGY7GQ7REZ2ZJBGHFA@2@2\windows-jdk10-m3.5.x_build\maven-enforcer-plugin\target\invoker-reports\BUILD-always-pass.xml, f:\jenkins\jenkins-slave\workspace\aven-enforcer_IMPROVE_TESTS-STPPGKMLZMMP35I7IYC3BJFSM5FR665OYVQGY7GQ7REZ2ZJBGHFA@2@2\windows-jdk10-m3.5.x_build\maven-enforcer-plugin\target\invoker-reports\BUILD-ban-distribution-management-multi-module-build.xml, f:\jenkins\jenkins-slave\workspace\aven-enforcer_IMPROVE_TESTS-STPPGKMLZMMP35I7IYC3BJFSM5FR665OYVQGY7GQ7REZ2ZJBGHFA@2@2\windows-jdk10-m3.5.x_build\maven-enforcer-plugin\target\invoker-reports\BUILD-ban-distribution-management-multi-module-except-site.xml, f:\jenkins\jenkins-slave\workspace\aven-enforcer_IMPROVE_TESTS-STPPGKMLZMMP35I7IYC3BJFSM5FR665OYVQGY7GQ7REZ2ZJBGHFA@2@2\windows-jdk10-m3.5.x_build\maven-enforcer-plugin\target\invoker-reports\BUILD-ban-distribution-management.xml, f:\jenkins\jenkins-slave\workspace\aven-enforcer_IMPROVE_TESTS-STPPGKMLZMMP35I7IYC3BJFSM5FR665OYVQGY7GQ7REZ2ZJBGHFA@2@2\windows-jdk10-m3.5.x_build\maven-enforcer-plugin\target\invoker-reports\BUILD-ban-pom-dependency-version.xml, f:\jenkins\jenkins-slave\workspace\aven-enforcer_IMPROVE_TESTS-STPPGKMLZMMP35I7IYC3BJFSM5FR665OYVQGY7GQ7REZ2ZJBGHFA@2@2\windows-jdk10-m3.5.x_build\maven-enforcer-plugin\target\invoker-reports\BUILD-ban-transitive-dependencies-fail.xml, f:\jenkins\jenkins-slave\workspace\aven-enforcer_IMPROVE_TESTS-STPPGKMLZMMP35I7IYC3BJFSM5FR665OYVQGY7GQ7REZ2ZJBGHFA@2@2\windows-jdk10-m3.5.x_build\maven-enforcer-plugin\target\invoker-reports\BUILD-ban-transitive-dependencies.xml, f:\jenkins\jenkins-slave\workspace\aven-enforcer_IMPROVE_TESTS-STPPGKMLZMMP35I7IYC3BJFSM5FR665OYVQGY7GQ7REZ2ZJBGHFA@2@2\windows-jdk10-m3.5.x_build\maven-enforcer-plugin\target\invoker-reports\BUILD-banned-dependencies-versionrange-fail.xml, f:\jenkins\jenkins-slave\workspace\aven-enforcer_IMPROVE_TESTS-STPPGKMLZMMP35I7IYC3BJFSM5FR665OYVQGY7GQ7REZ2ZJBGHFA@2@2\windows-jdk10-m3.5.x_build\maven-enforcer-plugin\target\invoker-reports\BUILD-banned-dependencies-versionrange.xml, f:\jenkins\jenkins-slave\workspace\aven-enforcer_IMPROVE_TESTS-STPPGKMLZMMP35I7IYC3BJFSM5FR665OYVQGY7GQ7REZ2ZJBGHFA@2@2\windows-jdk10-m3.5.x_build\maven-enforcer-plugin\target\invoker-reports\BUILD-banned-dependencies-wildcards.xml, f:\jenkins\jenkins-slave\workspace\aven-enforcer_IMPROVE_TESTS-STPPGKMLZMMP35I7IYC3BJFSM5FR665OYVQGY7GQ7REZ2ZJBGHFA@2@2\windows-jdk10-m3.5.x_build\maven-enforcer-plugin\target\invoker-reports\BUILD-banned-dependencies.xml, f:\jenkins\jenkins-slave\workspace\aven-enforcer_IMPROVE_TESTS-STPPGKMLZMMP35I7IYC3BJFSM5FR665OYVQGY7GQ7REZ2ZJBGHFA@2@2\windows-jdk10-m3.5.x_build\maven-enforcer-plugin\target\invoker-reports\BUILD-banned-plugins.xml, f:\jenkins\jenkins-slave\workspace\aven-enforcer_IMPROVE_TESTS-STPPGKMLZMMP35I7IYC3BJFSM5FR665OYVQGY7GQ7REZ2ZJBGHFA@2@2\windows-jdk10-m3.5.x_build\maven-enforcer-plugin\target\invoker-reports\BUILD-builds_a_pom_noop.xml, f:\jenkins\jenkins-slave\workspace\aven-enforcer_IMPROVE_TESTS-STPPGKMLZMMP35I7IYC3BJFSM5FR665OYVQGY7GQ7REZ2ZJBGHFA@2@2\windows-jdk10-m3.5.x_build\maven-enforcer-plugin\target\invoker-reports\BUILD-cli-always-fail.xml, f:\jenkins\jenkins-slave\workspace\aven-enforcer_IMPROVE_TESTS-STPPGKMLZMMP35I7IYC3BJFSM5FR665OYVQGY7GQ7REZ2ZJBGHFA@2@2\windows-jdk10-m3.5.x_build\maven-enforcer-plugin\target\invoker-reports\BUILD-cli-always-pass.xml, f:\jenkins\jenkins-slave\workspace\aven-enforcer_IMPROVE_TESTS-STPPGKMLZMMP35I7IYC3BJFSM5FR665OYVQGY7GQ7REZ2ZJBGHFA@2@2\windows-jdk10-m3.5.x_build\maven-enforcer-plugin\target\invoker-reports\BUILD-dependencies_converge.xml, f:\jenkins\jenkins-slave\workspace\aven-enforcer_IMPROVE_TESTS-STPPGKMLZMMP35I7IYC3BJFSM5FR665OYVQGY7GQ7REZ2ZJBGHFA@2@2\windows-jdk10-m3.5.x_build\maven-enforcer-plugin\target\invoker-reports\BUILD-dependencies_not_converging.xml, f:\jenkins\jenkins-slave\workspace\aven-enforcer_IMPROVE_TESTS-STPPGKMLZMMP35I7IYC3BJFSM5FR665OYVQGY7GQ7REZ2ZJBGHFA@2@2\windows-jdk10-m3.5.x_build\maven-enforcer-plugin\target\invoker-reports\BUILD-dependencies_not_converging_test_scope.xml, f:\jenkins\jenkins-slave\workspace\aven-enforcer_IMPROVE_TESTS-STPPGKMLZMMP35I7IYC3BJFSM5FR665OYVQGY7GQ7REZ2ZJBGHFA@2@2\windows-jdk10-m3.5.x_build\maven-enforcer-plugin\target\invoker-reports\BUILD-display-info.xml, f:\jenkins\jenkins-slave\workspace\aven-enforcer_IMPROVE_TESTS-STPPGKMLZMMP35I7IYC3BJFSM5FR665OYVQGY7GQ7REZ2ZJBGHFA@2@2\windows-jdk10-m3.5.x_build\maven-enforcer-plugin\target\invoker-reports\BUILD-evaluate-beanshell.xml, f:\jenkins\jenkins-slave\workspace\aven-enforcer_IMPROVE_TESTS-STPPGKMLZMMP35I7IYC3BJFSM5FR665OYVQGY7GQ7REZ2ZJBGHFA@2@2\windows-jdk10-m3.5.x_build\maven-enforcer-plugin\target\invoker-reports\BUILD-multimodule.xml, f:\jenkins\jenkins-slave\workspace\aven-enforcer_IMPROVE_TESTS-STPPGKMLZMMP35I7IYC3BJFSM5FR665OYVQGY7GQ7REZ2ZJBGHFA@2@2\windows-jdk10-m3.5.x_build\maven-enforcer-plugin\target\invoker-reports\BUILD-require-active-profile-all.xml, f:\jenkins\jenkins-slave\workspace\aven-enforcer_IMPROVE_TESTS-STPPGKMLZMMP35I7IYC3BJFSM5FR665OYVQGY7GQ7REZ2ZJBGHFA@2@2\windows-jdk10-m3.5.x_build\maven-enforcer-plugin\target\invoker-reports\BUILD-require-active-profile-from-settings.xml, f:\jenkins\jenkins-slave\workspace\aven-enforcer_IMPROVE_TESTS-STPPGKMLZMMP35I7IYC3BJFSM5FR665OYVQGY7GQ7REZ2ZJBGHFA@2@2\windows-jdk10-m3.5.x_build\maven-enforcer-plugin\target\invoker-reports\BUILD-require-active-profile.xml, f:\jenkins\jenkins-slave\workspace\aven-enforcer_IMPROVE_TESTS-STPPGKMLZMMP35I7IYC3BJFSM5FR665OYVQGY7GQ7REZ2ZJBGHFA@2@2\windows-jdk10-m3.5.x_build\maven-enforcer-plugin\target\invoker-reports\BUILD-require-file-checksum.xml, f:\jenkins\jenkins-slave\workspace\aven-enforcer_IMPROVE_TESTS-STPPGKMLZMMP35I7IYC3BJFSM5FR665OYVQGY7GQ7REZ2ZJBGHFA@2@2\windows-jdk10-m3.5.x_build\maven-enforcer-plugin\target\invoker-reports\BUILD-require-files-dont-exist.xml, f:\jenkins\jenkins-slave\workspace\aven-enforcer_IMPROVE_TESTS-STPPGKMLZMMP35I7IYC3BJFSM5FR665OYVQGY7GQ7REZ2ZJBGHFA@2@2\windows-jdk10-m3.5.x_build\maven-enforcer-plugin\target\invoker-reports\BUILD-require-files-exist.xml, f:\jenkins\jenkins-slave\workspace\aven-enforcer_IMPROVE_TESTS-STPPGKMLZMMP35I7IYC3BJFSM5FR665OYVQGY7GQ7REZ2ZJBGHFA@2@2\windows-jdk10-m3.5.x_build\maven-enforcer-plugin\target\invoker-reports\BUILD-require-files-size.xml, f:\jenkins\jenkins-slave\workspace\aven-enforcer_IMPROVE_TESTS-STPPGKMLZMMP35I7IYC3BJFSM5FR665OYVQGY7GQ7REZ2ZJBGHFA@2@2\windows-jdk10-m3.5.x_build\maven-enforcer-plugin\target\invoker-reports\BUILD-require-java-version.xml, f:\jenkins\jenkins-slave\workspace\aven-enforcer_IMPROVE_TESTS-STPPGKMLZMMP35I7IYC3BJFSM5FR665OYVQGY7GQ7REZ2ZJBGHFA@2@2\windows-jdk10-m3.5.x_build\maven-enforcer-plugin\target\invoker-reports\BUILD-require-maven-version.xml, f:\jenkins\jenkins-slave\workspace\aven-enforcer_IMPROVE_TESTS-STPPGKMLZMMP35I7IYC3BJFSM5FR665OYVQGY7GQ7REZ2ZJBGHFA@2@2\windows-jdk10-m3.5.x_build\maven-enforcer-plugin\target\invoker-reports\BUILD-require-no-repositories-allow-plugin-repo.xml, f:\jenkins\jenkins-slave\workspace\aven-enforcer_IMPROVE_TESTS-STPPGKMLZMMP35I7IYC3BJFSM5FR665OYVQGY7GQ7REZ2ZJBGHFA@2@2\windows-jdk10-m3.5.x_build\maven-enforcer-plugin\target\invoker-reports\BUILD-require-no-repositories-allow-repo.xml, f:\jenkins\jenkins-slave\workspace\aven-enforcer_IMPROVE_TESTS-STPPGKMLZMMP35I7IYC3BJFSM5FR665OYVQGY7GQ7REZ2ZJBGHFA@2@2\windows-jdk10-m3.5.x_build\maven-enforcer-plugin\target\invoker-reports\BUILD-require-no-repositories.xml, f:\jenkins\jenkins-slave\workspace\aven-enforcer_IMPROVE_TESTS-STPPGKMLZMMP35I7IYC3BJFSM5FR665OYVQGY7GQ7REZ2ZJBGHFA@2@2\windows-jdk10-m3.5.x_build\maven-enforcer-plugin\target\invoker-reports\BUILD-require-no-repositories_failure.xml, f:\jenkins\jenkins-slave\workspace\aven-enforcer_IMPROVE_TESTS-STPPGKMLZMMP35I7IYC3BJFSM5FR665OYVQGY7GQ7REZ2ZJBGHFA@2@2\windows-jdk10-m3.5.x_build\maven-enforcer-plugin\target\invoker-reports\BUILD-require-no-repositories_failure_allowed-plugin-repo.xml, f:\jenkins\jenkins-slave\workspace\aven-enforcer_IMPROVE_TESTS-STPPGKMLZMMP35I7IYC3BJFSM5FR665OYVQGY7GQ7REZ2ZJBGHFA@2@2\windows-jdk10-m3.5.x_build\maven-enforcer-plugin\target\invoker-reports\BUILD-require-no-repositories_failure_plugin-repositories.xml, f:\jenkins\jenkins-slave\workspace\aven-enforcer_IMPROVE_TESTS-STPPGKMLZMMP35I7IYC3BJFSM5FR665OYVQGY7GQ7REZ2ZJBGHFA@2@2\windows-jdk10-m3.5.x_build\maven-enforcer-plugin\target\invoker-reports\BUILD-require-no-repositories_failure_repositories.xml, f:\jenkins\jenkins-slave\workspace\aven-enforcer_IMPROVE_TESTS-STPPGKMLZMMP35I7IYC3BJFSM5FR665OYVQGY7GQ7REZ2ZJBGHFA@2@2\windows-jdk10-m3.5.x_build\maven-enforcer-plugin\target\invoker-reports\BUILD-require-no-repositories_mm.xml, f:\jenkins\jenkins-slave\workspace\aven-enforcer_IMPROVE_TESTS-STPPGKMLZMMP35I7IYC3BJFSM5FR665OYVQGY7GQ7REZ2ZJBGHFA@2@2\windows-jdk10-m3.5.x_build\maven-enforcer-plugin\target\invoker-reports\BUILD-require-no-repositories_mm_ci.xml, f:\jenkins\jenkins-slave\workspace\aven-enforcer_IMPROVE_TESTS-STPPGKMLZMMP35I7IYC3BJFSM5FR665OYVQGY7GQ7REZ2ZJBGHFA@2@2\windows-jdk10-m3.5.x_build\maven-enforcer-plugin\target\invoker-reports\BUILD-require-plugin-versions-ci.xml, f:\jenkins\jenkins-slave\workspace\aven-enforcer_IMPROVE_TESTS-STPPGKMLZMMP35I7IYC3BJFSM5FR665OYVQGY7GQ7REZ2ZJBGHFA@2@2\windows-jdk10-m3.5.x_build\maven-enforcer-plugin\target\invoker-reports\BUILD-require-plugin-versions-custom-packaging.xml, f:\jenkins\jenkins-slave\workspace\aven-enforcer_IMPROVE_TESTS-STPPGKMLZMMP35I7IYC3BJFSM5FR665OYVQGY7GQ7REZ2ZJBGHFA@2@2\windows-jdk10-m3.5.x_build\maven-enforcer-plugin\target\invoker-reports\BUILD-require-plugin-versions-expressions.xml, f:\jenkins\jenkins-slave\workspace\aven-enforcer_IMPROVE_TESTS-STPPGKMLZMMP35I7IYC3BJFSM5FR665OYVQGY7GQ7REZ2ZJBGHFA@2@2\windows-jdk10-m3.5.x_build\maven-enforcer-plugin\target\invoker-reports\BUILD-require-plugin-versions-mm-ci-friendly.xml, f:\jenkins\jenkins-slave\workspace\aven-enforcer_IMPROVE_TESTS-STPPGKMLZMMP35I7IYC3BJFSM5FR665OYVQGY7GQ7REZ2ZJBGHFA@2@2\windows-jdk10-m3.5.x_build\maven-enforcer-plugin\target\invoker-reports\BUILD-require-plugin-versions-plugin-with-extensions.xml, f:\jenkins\jenkins-slave\workspace\aven-enforcer_IMPROVE_TESTS-STPPGKMLZMMP35I7IYC3BJFSM5FR665OYVQGY7GQ7REZ2ZJBGHFA@2@2\windows-jdk10-m3.5.x_build\maven-enforcer-plugin\target\invoker-reports\BUILD-require-plugin-versions-plugin-with-integration-test-lifecycle.xml, f:\jenkins\jenkins-slave\workspace\aven-enforcer_IMPROVE_TESTS-STPPGKMLZMMP35I7IYC3BJFSM5FR665OYVQGY7GQ7REZ2ZJBGHFA@2@2\windows-jdk10-m3.5.x_build\maven-enforcer-plugin\target\invoker-reports\BUILD-require-plugin-versions-projectGAVexpressions.xml, f:\jenkins\jenkins-slave\workspace\aven-enforcer_IMPROVE_TESTS-STPPGKMLZMMP35I7IYC3BJFSM5FR665OYVQGY7GQ7REZ2ZJBGHFA@2@2\windows-jdk10-m3.5.x_build\maven-enforcer-plugin\target\invoker-reports\BUILD-require-plugin-versions.xml, f:\jenkins\jenkins-slave\workspace\aven-enforcer_IMPROVE_TESTS-STPPGKMLZMMP35I7IYC3BJFSM5FR665OYVQGY7GQ7REZ2ZJBGHFA@2@2\windows-jdk10-m3.5.x_build\maven-enforcer-plugin\target\invoker-reports\BUILD-require-profile-ids-exist_failure.xml, f:\jenkins\jenkins-slave\workspace\aven-enforcer_IMPROVE_TESTS-STPPGKMLZMMP35I7IYC3BJFSM5FR665OYVQGY7GQ7REZ2ZJBGHFA@2@2\windows-jdk10-m3.5.x_build\maven-enforcer-plugin\target\invoker-reports\BUILD-require-profile-ids-exist_success.xml, f:\jenkins\jenkins-slave\workspace\aven-enforcer_IMPROVE_TESTS-STPPGKMLZMMP35I7IYC3BJFSM5FR665OYVQGY7GQ7REZ2ZJBGHFA@2@2\windows-jdk10-m3.5.x_build\maven-enforcer-plugin\target\invoker-reports\BUILD-require-property.xml, f:\jenkins\jenkins-slave\workspace\aven-enforcer_IMPROVE_TESTS-STPPGKMLZMMP35I7IYC3BJFSM5FR665OYVQGY7GQ7REZ2ZJBGHFA@2@2\windows-jdk10-m3.5.x_build\maven-enforcer-plugin\target\invoker-reports\BUILD-require-release-dependencies-excludes.xml, f:\jenkins\jenkins-slave\workspace\aven-enforcer_IMPROVE_TESTS-STPPGKMLZMMP35I7IYC3BJFSM5FR665OYVQGY7GQ7REZ2ZJBGHFA@2@2\windows-jdk10-m3.5.x_build\maven-enforcer-plugin\target\invoker-reports\BUILD-require-release-dependencies-excludes_failure.xml, f:\jenkins\jenkins-slave\workspace\aven-enforcer_IMPROVE_TESTS-STPPGKMLZMMP35I7IYC3BJFSM5FR665OYVQGY7GQ7REZ2ZJBGHFA@2@2\windows-jdk10-m3.5.x_build\maven-enforcer-plugin\target\invoker-reports\BUILD-require-release-dependencies.xml, f:\jenkins\jenkins-slave\workspace\aven-enforcer_IMPROVE_TESTS-STPPGKMLZMMP35I7IYC3BJFSM5FR665OYVQGY7GQ7REZ2ZJBGHFA@2@2\windows-jdk10-m3.5.x_build\maven-enforcer-plugin\target\invoker-reports\BUILD-require-release-version.xml, f:\jenkins\jenkins-slave\workspace\aven-enforcer_IMPROVE_TESTS-STPPGKMLZMMP35I7IYC3BJFSM5FR665OYVQGY7GQ7REZ2ZJBGHFA@2@2\windows-jdk10-m3.5.x_build\maven-enforcer-plugin\target\invoker-reports\BUILD-require-same-versions_failure.xml, f:\jenkins\jenkins-slave\workspace\aven-enforcer_IMPROVE_TESTS-STPPGKMLZMMP35I7IYC3BJFSM5FR665OYVQGY7GQ7REZ2ZJBGHFA@2@2\windows-jdk10-m3.5.x_build\maven-enforcer-plugin\target\invoker-reports\BUILD-require-same-versions_success.xml, f:\jenkins\jenkins-slave\workspace\aven-enforcer_IMPROVE_TESTS-STPPGKMLZMMP35I7IYC3BJFSM5FR665OYVQGY7GQ7REZ2ZJBGHFA@2@2\windows-jdk10-m3.5.x_build\maven-enforcer-plugin\target\invoker-reports\BUILD-require-snapshot-version_failure.xml, f:\jenkins\jenkins-slave\workspace\aven-enforcer_IMPROVE_TESTS-STPPGKMLZMMP35I7IYC3BJFSM5FR665OYVQGY7GQ7REZ2ZJBGHFA@2@2\windows-jdk10-m3.5.x_build\maven-enforcer-plugin\target\invoker-reports\BUILD-require-snapshot-version_success.xml, f:\jenkins\jenkins-slave\workspace\aven-enforcer_IMPROVE_TESTS-STPPGKMLZMMP35I7IYC3BJFSM5FR665OYVQGY7GQ7REZ2ZJBGHFA@2@2\windows-jdk10-m3.5.x_build\maven-enforcer-plugin\target\invoker-reports\BUILD-require-upper-bound-dependencies-managed_failure.xml, f:\jenkins\jenkins-slave\workspace\aven-enforcer_IMPROVE_TESTS-STPPGKMLZMMP35I7IYC3BJFSM5FR665OYVQGY7GQ7REZ2ZJBGHFA@2@2\windows-jdk10-m3.5.x_build\maven-enforcer-plugin\target\invoker-reports\BUILD-require-upper-bound-dependencies-managed_success.xml, f:\jenkins\jenkins-slave\workspace\aven-enforcer_IMPROVE_TESTS-STPPGKMLZMMP35I7IYC3BJFSM5FR665OYVQGY7GQ7REZ2ZJBGHFA@2@2\windows-jdk10-m3.5.x_build\maven-enforcer-plugin\target\invoker-reports\BUILD-require-upper-bound-dependencies-unique_failure.xml, f:\jenkins\jenkins-slave\workspace\aven-enforcer_IMPROVE_TESTS-STPPGKMLZMMP35I7IYC3BJFSM5FR665OYVQGY7GQ7REZ2ZJBGHFA@2@2\windows-jdk10-m3.5.x_build\maven-enforcer-plugin\target\invoker-reports\BUILD-require-upper-bound-dependencies-unique_success.xml, f:\jenkins\jenkins-slave\workspace\aven-enforcer_IMPROVE_TESTS-STPPGKMLZMMP35I7IYC3BJFSM5FR665OYVQGY7GQ7REZ2ZJBGHFA@2@2\windows-jdk10-m3.5.x_build\maven-enforcer-plugin\target\invoker-reports\BUILD-require-upper-bound-deps_failure.xml, f:\jenkins\jenkins-slave\workspace\aven-enforcer_IMPROVE_TESTS-STPPGKMLZMMP35I7IYC3BJFSM5FR665OYVQGY7GQ7REZ2ZJBGHFA@2@2\windows-jdk10-m3.5.x_build\maven-enforcer-plugin\target\invoker-reports\BUILD-require-upper-bound-deps_ignored.xml, f:\jenkins\jenkins-slave\workspace\aven-enforcer_IMPROVE_TESTS-STPPGKMLZMMP35I7IYC3BJFSM5FR665OYVQGY7GQ7REZ2ZJBGHFA@2@2\windows-jdk10-m3.5.x_build\maven-enforcer-plugin\target\invoker-reports\BUILD-require-upper-bound-deps_success.xml, f:\jenkins\jenkins-slave\workspace\aven-enforcer_IMPROVE_TESTS-STPPGKMLZMMP35I7IYC3BJFSM5FR665OYVQGY7GQ7REZ2ZJBGHFA@2@2\windows-jdk10-m3.5.x_build\maven-enforcer-plugin\target\invoker-reports\BUILD-resolve_collect_dependencies.xml]
[windows-jdk10-m3.5.x_build] Found logs:[f:\jenkins\jenkins-slave\workspace\aven-enforcer_IMPROVE_TESTS-STPPGKMLZMMP35I7IYC3BJFSM5FR665OYVQGY7GQ7REZ2ZJBGHFA@2@2\windows-jdk10-m3.5.x_build\maven-enforcer-plugin\target\it\always-fail-warn\build.log, f:\jenkins\jenkins-slave\workspace\aven-enforcer_IMPROVE_TESTS-STPPGKMLZMMP35I7IYC3BJFSM5FR665OYVQGY7GQ7REZ2ZJBGHFA@2@2\windows-jdk10-m3.5.x_build\maven-enforcer-plugin\target\it\always-fail\build.log, f:\jenkins\jenkins-slave\workspace\aven-enforcer_IMPROVE_TESTS-STPPGKMLZMMP35I7IYC3BJFSM5FR665OYVQGY7GQ7REZ2ZJBGHFA@2@2\windows-jdk10-m3.5.x_build\maven-enforcer-plugin\target\it\always-pass\build.log, f:\jenkins\jenkins-slave\workspace\aven-enforcer_IMPROVE_TESTS-STPPGKMLZMMP35I7IYC3BJFSM5FR665OYVQGY7GQ7REZ2ZJBGHFA@2@2\windows-jdk10-m3.5.x_build\maven-enforcer-plugin\target\it\ban-distribution-management-multi-module-build\build.log, f:\jenkins\jenkins-slave\workspace\aven-enforcer_IMPROVE_TESTS-STPPGKMLZMMP35I7IYC3BJFSM5FR665OYVQGY7GQ7REZ2ZJBGHFA@2@2\windows-jdk10-m3.5.x_build\maven-enforcer-plugin\target\it\ban-distribution-management-multi-module-except-site\build.log, f:\jenkins\jenkins-slave\workspace\aven-enforcer_IMPROVE_TESTS-STPPGKMLZMMP35I7IYC3BJFSM5FR665OYVQGY7GQ7REZ2ZJBGHFA@2@2\windows-jdk10-m3.5.x_build\maven-enforcer-plugin\target\it\ban-distribution-management\build.log, f:\jenkins\jenkins-slave\workspace\aven-enforcer_IMPROVE_TESTS-STPPGKMLZMMP35I7IYC3BJFSM5FR665OYVQGY7GQ7REZ2ZJBGHFA@2@2\windows-jdk10-m3.5.x_build\maven-enforcer-plugin\target\it\ban-pom-dependency-version\build.log, f:\jenkins\jenkins-slave\workspace\aven-enforcer_IMPROVE_TESTS-STPPGKMLZMMP35I7IYC3BJFSM5FR665OYVQGY7GQ7REZ2ZJBGHFA@2@2\windows-jdk10-m3.5.x_build\maven-enforcer-plugin\target\it\ban-transitive-dependencies-fail\build.log, f:\jenkins\jenkins-slave\workspace\aven-enforcer_IMPROVE_TESTS-STPPGKMLZMMP35I7IYC3BJFSM5FR665OYVQGY7GQ7REZ2ZJBGHFA@2@2\windows-jdk10-m3.5.x_build\maven-enforcer-plugin\target\it\ban-transitive-dependencies\build.log, f:\jenkins\jenkins-slave\workspace\aven-enforcer_IMPROVE_TESTS-STPPGKMLZMMP35I7IYC3BJFSM5FR665OYVQGY7GQ7REZ2ZJBGHFA@2@2\windows-jdk10-m3.5.x_build\maven-enforcer-plugin\target\it\banned-dependencies-versionrange-fail\build.log, f:\jenkins\jenkins-slave\workspace\aven-enforcer_IMPROVE_TESTS-STPPGKMLZMMP35I7IYC3BJFSM5FR665OYVQGY7GQ7REZ2ZJBGHFA@2@2\windows-jdk10-m3.5.x_build\maven-enforcer-plugin\target\it\banned-dependencies-versionrange\build.log, f:\jenkins\jenkins-slave\workspace\aven-enforcer_IMPROVE_TESTS-STPPGKMLZMMP35I7IYC3BJFSM5FR665OYVQGY7GQ7REZ2ZJBGHFA@2@2\windows-jdk10-m3.5.x_build\maven-enforcer-plugin\target\it\banned-dependencies-wildcards\build.log, f:\jenkins\jenkins-slave\workspace\aven-enforcer_IMPROVE_TESTS-STPPGKMLZMMP35I7IYC3BJFSM5FR665OYVQGY7GQ7REZ2ZJBGHFA@2@2\windows-jdk10-m3.5.x_build\maven-enforcer-plugin\target\it\banned-dependencies\build.log, f:\jenkins\jenkins-slave\workspace\aven-enforcer_IMPROVE_TESTS-STPPGKMLZMMP35I7IYC3BJFSM5FR665OYVQGY7GQ7REZ2ZJBGHFA@2@2\windows-jdk10-m3.5.x_build\maven-enforcer-plugin\target\it\banned-plugins\build.log, f:\jenkins\jenkins-slave\workspace\aven-enforcer_IMPROVE_TESTS-STPPGKMLZMMP35I7IYC3BJFSM5FR665OYVQGY7GQ7REZ2ZJBGHFA@2@2\windows-jdk10-m3.5.x_build\maven-enforcer-plugin\target\it\builds_a_pom_noop\build.log, f:\jenkins\jenkins-slave\workspace\aven-enforcer_IMPROVE_TESTS-STPPGKMLZMMP35I7IYC3BJFSM5FR665OYVQGY7GQ7REZ2ZJBGHFA@2@2\windows-jdk10-m3.5.x_build\maven-enforcer-plugin\target\it\cli-always-fail\build.log, f:\jenkins\jenkins-slave\workspace\aven-enforcer_IMPROVE_TESTS-STPPGKMLZMMP35I7IYC3BJFSM5FR665OYVQGY7GQ7REZ2ZJBGHFA@2@2\windows-jdk10-m3.5.x_build\maven-enforcer-plugin\target\it\cli-always-pass\build.log, f:\jenkins\jenkins-slave\workspace\aven-enforcer_IMPROVE_TESTS-STPPGKMLZMMP35I7IYC3BJFSM5FR665OYVQGY7GQ7REZ2ZJBGHFA@2@2\windows-jdk10-m3.5.x_build\maven-enforcer-plugin\target\it\dependencies_converge\build.log, f:\jenkins\jenkins-slave\workspace\aven-enforcer_IMPROVE_TESTS-STPPGKMLZMMP35I7IYC3BJFSM5FR665OYVQGY7GQ7REZ2ZJBGHFA@2@2\windows-jdk10-m3.5.x_build\maven-enforcer-plugin\target\it\dependencies_not_converging\build.log, f:\jenkins\jenkins-slave\workspace\aven-enforcer_IMPROVE_TESTS-STPPGKMLZMMP35I7IYC3BJFSM5FR665OYVQGY7GQ7REZ2ZJBGHFA@2@2\windows-jdk10-m3.5.x_build\maven-enforcer-plugin\target\it\dependencies_not_converging_test_scope\build.log, f:\jenkins\jenkins-slave\workspace\aven-enforcer_IMPROVE_TESTS-STPPGKMLZMMP35I7IYC3BJFSM5FR665OYVQGY7GQ7REZ2ZJBGHFA@2@2\windows-jdk10-m3.5.x_build\maven-enforcer-plugin\target\it\display-info\build.log, f:\jenkins\jenkins-slave\workspace\aven-enforcer_IMPROVE_TESTS-STPPGKMLZMMP35I7IYC3BJFSM5FR665OYVQGY7GQ7REZ2ZJBGHFA@2@2\windows-jdk10-m3.5.x_build\maven-enforcer-plugin\target\it\evaluate-beanshell\build.log, f:\jenkins\jenkins-slave\workspace\aven-enforcer_IMPROVE_TESTS-STPPGKMLZMMP35I7IYC3BJFSM5FR665OYVQGY7GQ7REZ2ZJBGHFA@2@2\windows-jdk10-m3.5.x_build\maven-enforcer-plugin\target\it\multimodule\build.log, f:\jenkins\jenkins-slave\workspace\aven-enforcer_IMPROVE_TESTS-STPPGKMLZMMP35I7IYC3BJFSM5FR665OYVQGY7GQ7REZ2ZJBGHFA@2@2\windows-jdk10-m3.5.x_build\maven-enforcer-plugin\target\it\require-active-profile-all\build.log, f:\jenkins\jenkins-slave\workspace\aven-enforcer_IMPROVE_TESTS-STPPGKMLZMMP35I7IYC3BJFSM5FR665OYVQGY7GQ7REZ2ZJBGHFA@2@2\windows-jdk10-m3.5.x_build\maven-enforcer-plugin\target\it\require-active-profile-from-settings\build.log, f:\jenkins\jenkins-slave\workspace\aven-enforcer_IMPROVE_TESTS-STPPGKMLZMMP35I7IYC3BJFSM5FR665OYVQGY7GQ7REZ2ZJBGHFA@2@2\windows-jdk10-m3.5.x_build\maven-enforcer-plugin\target\it\require-active-profile\build.log, f:\jenkins\jenkins-slave\workspace\aven-enforcer_IMPROVE_TESTS-STPPGKMLZMMP35I7IYC3BJFSM5FR665OYVQGY7GQ7REZ2ZJBGHFA@2@2\windows-jdk10-m3.5.x_build\maven-enforcer-plugin\target\it\require-file-checksum\build.log, f:\jenkins\jenkins-slave\workspace\aven-enforcer_IMPROVE_TESTS-STPPGKMLZMMP35I7IYC3BJFSM5FR665OYVQGY7GQ7REZ2ZJBGHFA@2@2\windows-jdk10-m3.5.x_build\maven-enforcer-plugin\target\it\require-files-dont-exist\build.log, f:\jenkins\jenkins-slave\workspace\aven-enforcer_IMPROVE_TESTS-STPPGKMLZMMP35I7IYC3BJFSM5FR665OYVQGY7GQ7REZ2ZJBGHFA@2@2\windows-jdk10-m3.5.x_build\maven-enforcer-plugin\target\it\require-files-exist\build.log, f:\jenkins\jenkins-slave\workspace\aven-enforcer_IMPROVE_TESTS-STPPGKMLZMMP35I7IYC3BJFSM5FR665OYVQGY7GQ7REZ2ZJBGHFA@2@2\windows-jdk10-m3.5.x_build\maven-enforcer-plugin\target\it\require-files-size\build.log, f:\jenkins\jenkins-slave\workspace\aven-enforcer_IMPROVE_TESTS-STPPGKMLZMMP35I7IYC3BJFSM5FR665OYVQGY7GQ7REZ2ZJBGHFA@2@2\windows-jdk10-m3.5.x_build\maven-enforcer-plugin\target\it\require-java-version\build.log, f:\jenkins\jenkins-slave\workspace\aven-enforcer_IMPROVE_TESTS-STPPGKMLZMMP35I7IYC3BJFSM5FR665OYVQGY7GQ7REZ2ZJBGHFA@2@2\windows-jdk10-m3.5.x_build\maven-enforcer-plugin\target\it\require-maven-version\build.log, f:\jenkins\jenkins-slave\workspace\aven-enforcer_IMPROVE_TESTS-STPPGKMLZMMP35I7IYC3BJFSM5FR665OYVQGY7GQ7REZ2ZJBGHFA@2@2\windows-jdk10-m3.5.x_build\maven-enforcer-plugin\target\it\require-no-repositories-allow-plugin-repo\build.log, f:\jenkins\jenkins-slave\workspace\aven-enforcer_IMPROVE_TESTS-STPPGKMLZMMP35I7IYC3BJFSM5FR665OYVQGY7GQ7REZ2ZJBGHFA@2@2\windows-jdk10-m3.5.x_build\maven-enforcer-plugin\target\it\require-no-repositories-allow-repo\build.log, f:\jenkins\jenkins-slave\workspace\aven-enforcer_IMPROVE_TESTS-STPPGKMLZMMP35I7IYC3BJFSM5FR665OYVQGY7GQ7REZ2ZJBGHFA@2@2\windows-jdk10-m3.5.x_build\maven-enforcer-plugin\target\it\require-no-repositories\build.log, f:\jenkins\jenkins-slave\workspace\aven-enforcer_IMPROVE_TESTS-STPPGKMLZMMP35I7IYC3BJFSM5FR665OYVQGY7GQ7REZ2ZJBGHFA@2@2\windows-jdk10-m3.5.x_build\maven-enforcer-plugin\target\it\require-no-repositories_failure\build.log, f:\jenkins\jenkins-slave\workspace\aven-enforcer_IMPROVE_TESTS-STPPGKMLZMMP35I7IYC3BJFSM5FR665OYVQGY7GQ7REZ2ZJBGHFA@2@2\windows-jdk10-m3.5.x_build\maven-enforcer-plugin\target\it\require-no-repositories_failure_allowed-plugin-repo\build.log, f:\jenkins\jenkins-slave\workspace\aven-enforcer_IMPROVE_TESTS-STPPGKMLZMMP35I7IYC3BJFSM5FR665OYVQGY7GQ7REZ2ZJBGHFA@2@2\windows-jdk10-m3.5.x_build\maven-enforcer-plugin\target\it\require-no-repositories_failure_plugin-repositories\build.log, f:\jenkins\jenkins-slave\workspace\aven-enforcer_IMPROVE_TESTS-STPPGKMLZMMP35I7IYC3BJFSM5FR665OYVQGY7GQ7REZ2ZJBGHFA@2@2\windows-jdk10-m3.5.x_build\maven-enforcer-plugin\target\it\require-no-repositories_failure_repositories\build.log, f:\jenkins\jenkins-slave\workspace\aven-enforcer_IMPROVE_TESTS-STPPGKMLZMMP35I7IYC3BJFSM5FR665OYVQGY7GQ7REZ2ZJBGHFA@2@2\windows-jdk10-m3.5.x_build\maven-enforcer-plugin\target\it\require-no-repositories_mm\build.log, f:\jenkins\jenkins-slave\workspace\aven-enforcer_IMPROVE_TESTS-STPPGKMLZMMP35I7IYC3BJFSM5FR665OYVQGY7GQ7REZ2ZJBGHFA@2@2\windows-jdk10-m3.5.x_build\maven-enforcer-plugin\target\it\require-no-repositories_mm_ci\build.log, f:\jenkins\jenkins-slave\workspace\aven-enforcer_IMPROVE_TESTS-STPPGKMLZMMP35I7IYC3BJFSM5FR665OYVQGY7GQ7REZ2ZJBGHFA@2@2\windows-jdk10-m3.5.x_build\maven-enforcer-plugin\target\it\require-plugin-versions-ci\build.log, f:\jenkins\jenkins-slave\workspace\aven-enforcer_IMPROVE_TESTS-STPPGKMLZMMP35I7IYC3BJFSM5FR665OYVQGY7GQ7REZ2ZJBGHFA@2@2\windows-jdk10-m3.5.x_build\maven-enforcer-plugin\target\it\require-plugin-versions-custom-packaging\build.log, f:\jenkins\jenkins-slave\workspace\aven-enforcer_IMPROVE_TESTS-STPPGKMLZMMP35I7IYC3BJFSM5FR665OYVQGY7GQ7REZ2ZJBGHFA@2@2\windows-jdk10-m3.5.x_build\maven-enforcer-plugin\target\it\require-plugin-versions-expressions\build.log, f:\jenkins\jenkins-slave\workspace\aven-enforcer_IMPROVE_TESTS-STPPGKMLZMMP35I7IYC3BJFSM5FR665OYVQGY7GQ7REZ2ZJBGHFA@2@2\windows-jdk10-m3.5.x_build\maven-enforcer-plugin\target\it\require-plugin-versions-mm-ci-friendly\build.log, f:\jenkins\jenkins-slave\workspace\aven-enforcer_IMPROVE_TESTS-STPPGKMLZMMP35I7IYC3BJFSM5FR665OYVQGY7GQ7REZ2ZJBGHFA@2@2\windows-jdk10-m3.5.x_build\maven-enforcer-plugin\target\it\require-plugin-versions-plugin-with-extensions\build.log, f:\jenkins\jenkins-slave\workspace\aven-enforcer_IMPROVE_TESTS-STPPGKMLZMMP35I7IYC3BJFSM5FR665OYVQGY7GQ7REZ2ZJBGHFA@2@2\windows-jdk10-m3.5.x_build\maven-enforcer-plugin\target\it\require-plugin-versions-plugin-with-integration-test-lifecycle\build.log, f:\jenkins\jenkins-slave\workspace\aven-enforcer_IMPROVE_TESTS-STPPGKMLZMMP35I7IYC3BJFSM5FR665OYVQGY7GQ7REZ2ZJBGHFA@2@2\windows-jdk10-m3.5.x_build\maven-enforcer-plugin\target\it\require-plugin-versions-projectGAVexpressions\build.log, f:\jenkins\jenkins-slave\workspace\aven-enforcer_IMPROVE_TESTS-STPPGKMLZMMP35I7IYC3BJFSM5FR665OYVQGY7GQ7REZ2ZJBGHFA@2@2\windows-jdk10-m3.5.x_build\maven-enforcer-plugin\target\it\require-plugin-versions\build.log, f:\jenkins\jenkins-slave\workspace\aven-enforcer_IMPROVE_TESTS-STPPGKMLZMMP35I7IYC3BJFSM5FR665OYVQGY7GQ7REZ2ZJBGHFA@2@2\windows-jdk10-m3.5.x_build\maven-enforcer-plugin\target\it\require-profile-ids-exist_failure\build.log, f:\jenkins\jenkins-slave\workspace\aven-enforcer_IMPROVE_TESTS-STPPGKMLZMMP35I7IYC3BJFSM5FR665OYVQGY7GQ7REZ2ZJBGHFA@2@2\windows-jdk10-m3.5.x_build\maven-enforcer-plugin\target\it\require-profile-ids-exist_success\build.log, f:\jenkins\jenkins-slave\workspace\aven-enforcer_IMPROVE_TESTS-STPPGKMLZMMP35I7IYC3BJFSM5FR665OYVQGY7GQ7REZ2ZJBGHFA@2@2\windows-jdk10-m3.5.x_build\maven-enforcer-plugin\target\it\require-property\build.log, f:\jenkins\jenkins-slave\workspace\aven-enforcer_IMPROVE_TESTS-STPPGKMLZMMP35I7IYC3BJFSM5FR665OYVQGY7GQ7REZ2ZJBGHFA@2@2\windows-jdk10-m3.5.x_build\maven-enforcer-plugin\target\it\require-release-dependencies-excludes\build.log, f:\jenkins\jenkins-slave\workspace\aven-enforcer_IMPROVE_TESTS-STPPGKMLZMMP35I7IYC3BJFSM5FR665OYVQGY7GQ7REZ2ZJBGHFA@2@2\windows-jdk10-m3.5.x_build\maven-enforcer-plugin\target\it\require-release-dependencies-excludes_failure\build.log, f:\jenkins\jenkins-slave\workspace\aven-enforcer_IMPROVE_TESTS-STPPGKMLZMMP35I7IYC3BJFSM5FR665OYVQGY7GQ7REZ2ZJBGHFA@2@2\windows-jdk10-m3.5.x_build\maven-enforcer-plugin\target\it\require-release-dependencies\build.log, f:\jenkins\jenkins-slave\workspace\aven-enforcer_IMPROVE_TESTS-STPPGKMLZMMP35I7IYC3BJFSM5FR665OYVQGY7GQ7REZ2ZJBGHFA@2@2\windows-jdk10-m3.5.x_build\maven-enforcer-plugin\target\it\require-release-version\build.log, f:\jenkins\jenkins-slave\workspace\aven-enforcer_IMPROVE_TESTS-STPPGKMLZMMP35I7IYC3BJFSM5FR665OYVQGY7GQ7REZ2ZJBGHFA@2@2\windows-jdk10-m3.5.x_build\maven-enforcer-plugin\target\it\require-same-versions_failure\build.log, f:\jenkins\jenkins-slave\workspace\aven-enforcer_IMPROVE_TESTS-STPPGKMLZMMP35I7IYC3BJFSM5FR665OYVQGY7GQ7REZ2ZJBGHFA@2@2\windows-jdk10-m3.5.x_build\maven-enforcer-plugin\target\it\require-same-versions_success\build.log, f:\jenkins\jenkins-slave\workspace\aven-enforcer_IMPROVE_TESTS-STPPGKMLZMMP35I7IYC3BJFSM5FR665OYVQGY7GQ7REZ2ZJBGHFA@2@2\windows-jdk10-m3.5.x_build\maven-enforcer-plugin\target\it\require-snapshot-version_failure\build.log, f:\jenkins\jenkins-slave\workspace\aven-enforcer_IMPROVE_TESTS-STPPGKMLZMMP35I7IYC3BJFSM5FR665OYVQGY7GQ7REZ2ZJBGHFA@2@2\windows-jdk10-m3.5.x_build\maven-enforcer-plugin\target\it\require-snapshot-version_success\build.log, f:\jenkins\jenkins-slave\workspace\aven-enforcer_IMPROVE_TESTS-STPPGKMLZMMP35I7IYC3BJFSM5FR665OYVQGY7GQ7REZ2ZJBGHFA@2@2\windows-jdk10-m3.5.x_build\maven-enforcer-plugin\target\it\require-upper-bound-dependencies-managed_failure\build.log, f:\jenkins\jenkins-slave\workspace\aven-enforcer_IMPROVE_TESTS-STPPGKMLZMMP35I7IYC3BJFSM5FR665OYVQGY7GQ7REZ2ZJBGHFA@2@2\windows-jdk10-m3.5.x_build\maven-enforcer-plugin\target\it\require-upper-bound-dependencies-managed_success\build.log, f:\jenkins\jenkins-slave\workspace\aven-enforcer_IMPROVE_TESTS-STPPGKMLZMMP35I7IYC3BJFSM5FR665OYVQGY7GQ7REZ2ZJBGHFA@2@2\windows-jdk10-m3.5.x_build\maven-enforcer-plugin\target\it\require-upper-bound-dependencies-unique_failure\build.log, f:\jenkins\jenkins-slave\workspace\aven-enforcer_IMPROVE_TESTS-STPPGKMLZMMP35I7IYC3BJFSM5FR665OYVQGY7GQ7REZ2ZJBGHFA@2@2\windows-jdk10-m3.5.x_build\maven-enforcer-plugin\target\it\require-upper-bound-dependencies-unique_success\build.log, f:\jenkins\jenkins-slave\workspace\aven-enforcer_IMPROVE_TESTS-STPPGKMLZMMP35I7IYC3BJFSM5FR665OYVQGY7GQ7REZ2ZJBGHFA@2@2\windows-jdk10-m3.5.x_build\maven-enforcer-plugin\target\it\require-upper-bound-deps_failure\build.log, f:\jenkins\jenkins-slave\workspace\aven-enforcer_IMPROVE_TESTS-STPPGKMLZMMP35I7IYC3BJFSM5FR665OYVQGY7GQ7REZ2ZJBGHFA@2@2\windows-jdk10-m3.5.x_build\maven-enforcer-plugin\target\it\require-upper-bound-deps_ignored\build.log, f:\jenkins\jenkins-slave\workspace\aven-enforcer_IMPROVE_TESTS-STPPGKMLZMMP35I7IYC3BJFSM5FR665OYVQGY7GQ7REZ2ZJBGHFA@2@2\windows-jdk10-m3.5.x_build\maven-enforcer-plugin\target\it\require-upper-bound-deps_success\build.log, f:\jenkins\jenkins-slave\workspace\aven-enforcer_IMPROVE_TESTS-STPPGKMLZMMP35I7IYC3BJFSM5FR665OYVQGY7GQ7REZ2ZJBGHFA@2@2\windows-jdk10-m3.5.x_build\maven-enforcer-plugin\target\it\resolve_collect_dependencies\build.log]
[windows-jdk10-m3.5.x_build] Finished parsing Maven Invoker results (found 68)
[windows-jdk10-m3.5.x_build] [withMaven] junitPublisher - Archive test results for Maven artifact org.apache.maven.enforcer:enforcer-api:3.0.0-SNAPSHOT generated by maven-surefire-plugin:test (default-test): windows-jdk10-m3.5.x_build\enforcer-api\target\surefire-reports\*.xml
[windows-jdk10-m3.5.x_build] Recording test results
[windows-jdk10-m3.5.x_build] None of the test reports contained any result
[windows-jdk10-m3.5.x_build] [withMaven] junitPublisher - Archive test results for Maven artifact org.apache.maven.enforcer:enforcer-rules:3.0.0-SNAPSHOT generated by maven-surefire-plugin:test (default-test): windows-jdk10-m3.5.x_build\enforcer-rules\target\surefire-reports\*.xml
[windows-jdk10-m3.5.x_build] Recording test results
[windows-jdk10-m3.5.x_build] [withMaven] junitPublisher - Archive test results for Maven artifact org.apache.maven.plugins:maven-enforcer-plugin:3.0.0-SNAPSHOT generated by maven-surefire-plugin:test (default-test): windows-jdk10-m3.5.x_build\maven-enforcer-plugin\target\surefire-reports\*.xml
[windows-jdk10-m3.5.x_build] Recording test results
[windows-jdk10-m3.5.x_build] [withMaven] openTasksPublisher - Scan Tasks for Maven artifact org.apache.maven.enforcer:enforcer-api:3.0.0-SNAPSHOT in source directory windows-jdk10-m3.5.x_build\enforcer-api\src\main\java
[windows-jdk10-m3.5.x_build] [withMaven] openTasksPublisher - Scan Tasks for Maven artifact org.apache.maven.enforcer:enforcer-rules:3.0.0-SNAPSHOT in source directory windows-jdk10-m3.5.x_build\enforcer-rules\src\main\java
[windows-jdk10-m3.5.x_build] [withMaven] openTasksPublisher - Scan Tasks for Maven artifact org.apache.maven.plugins:maven-enforcer-plugin:3.0.0-SNAPSHOT in source directory windows-jdk10-m3.5.x_build\maven-enforcer-plugin\src\main\java
[windows-jdk10-m3.5.x_build] [TASKS] Scanning folder 'f:\jenkins\jenkins-slave\workspace\aven-enforcer_IMPROVE_TESTS-STPPGKMLZMMP35I7IYC3BJFSM5FR665OYVQGY7GQ7REZ2ZJBGHFA@2@2' for files matching the pattern 'windows-jdk10-m3.5.x_build\enforcer-api\src\main\java\**\*,windows-jdk10-m3.5.x_build\enforcer-rules\src\main\java\**\*,windows-jdk10-m3.5.x_build\maven-enforcer-plugin\src\main\java\**\*' - excludes: null
[windows-jdk10-m3.5.x_build] [TASKS] Found 51 files to scan for tasks
[windows-jdk10-m3.5.x_build] [TASKS] Found 5 open tasks.
[windows-jdk10-m3.5.x_build] Skipping warnings blame since pipelines do not have an SCM link.%n
[Pipeline] [windows-jdk10-m3.5.x_build] // withMaven
[Pipeline] [windows-jdk10-m3.5.x_build] cleanWs
[windows-jdk10-m3.5.x_build] [WS-CLEANUP] Deleting project workspace...[WS-CLEANUP] done
[Pipeline] [windows-jdk10-m3.5.x_build] }
[Pipeline] [windows-jdk10-m3.5.x_build] // stage
[Pipeline] [windows-jdk10-m3.5.x_build] }
[Pipeline] [windows-jdk10-m3.5.x_build] // ws
[Pipeline] [windows-jdk10-m3.5.x_build] }
[Pipeline] [windows-jdk10-m3.5.x_build] // node
[Pipeline] [windows-jdk10-m3.5.x_build] }
[windows-jdk9-m3.5.x_build] [INFO]           require-upper-bound-dependencies-managed_success\pom.xml SUCCESS (6.6 s)
[windows-jdk9-m3.5.x_build] [INFO] Building: require-upper-bound-dependencies-unique_failure\pom.xml
[windows-jdk9-m3.5.x_build] [INFO] snapshot org.apache.maven.plugins.enforcer.its:menforcer134_project:1.0-SNAPSHOT: checking for updates from apache-snapshots
[windows-jdk9-m3.5.x_build] [INFO] snapshot org.apache.maven.plugins.enforcer.its:menforcer134_project:1.0-SNAPSHOT: checking for updates from Nexus
[windows-jdk9-m3.5.x_build] [INFO] artifact org.apache.maven.plugins.enforcer.its.menforcer134_project:1.0-SNAPSHOT: checking for updates from central
[windows-jdk9-m3.5.x_build] [INFO] org.apache.maven.plugins.enforcer.its.menforcer134_project.1.0-SNAPSHOT: checking for updates from central
[windows-jdk9-m3.5.x_build] [INFO] snapshot org.apache.maven.plugins.enforcer.its:menforcer134_modelbuilder:1.0-SNAPSHOT: checking for updates from apache-snapshots
[windows-jdk9-m3.5.x_build] [INFO] snapshot org.apache.maven.plugins.enforcer.its:menforcer134_modelbuilder:1.0-SNAPSHOT: checking for updates from Nexus
[windows-jdk9-m3.5.x_build] [INFO] artifact org.apache.maven.plugins.enforcer.its.menforcer134_modelbuilder:1.0-SNAPSHOT: checking for updates from central
[windows-jdk9-m3.5.x_build] [INFO] org.apache.maven.plugins.enforcer.its.menforcer134_modelbuilder.1.0-SNAPSHOT: checking for updates from central
[windows-jdk9-m3.5.x_build] [INFO] snapshot org.apache.maven.plugins.enforcer.its:menforcer134_model:1.0-SNAPSHOT: checking for updates from apache-snapshots
[windows-jdk9-m3.5.x_build] [INFO] snapshot org.apache.maven.plugins.enforcer.its:menforcer134_model:1.0-SNAPSHOT: checking for updates from Nexus
[windows-jdk9-m3.5.x_build] [INFO] artifact org.apache.maven.plugins.enforcer.its.menforcer134_model:1.0-SNAPSHOT: checking for updates from central
[windows-jdk9-m3.5.x_build] [INFO] org.apache.maven.plugins.enforcer.its.menforcer134_model.1.0-SNAPSHOT: checking for updates from central
[windows-jdk9-m3.5.x_build] [INFO] run post-build script verify.groovy
[windows-jdk9-m3.5.x_build] [INFO]           require-upper-bound-dependencies-unique_failure\pom.xml SUCCESS (7.5 s)
[windows-jdk9-m3.5.x_build] [INFO] Building: require-upper-bound-dependencies-unique_success\pom.xml
[windows-jdk9-m3.5.x_build] [INFO]           require-upper-bound-dependencies-unique_success\pom.xml SUCCESS (6.5 s)
[windows-jdk9-m3.5.x_build] [INFO] Building: require-upper-bound-deps_failure\pom.xml
[windows-jdk9-m3.5.x_build] [INFO] run post-build script verify.groovy
[windows-jdk9-m3.5.x_build] [INFO]           require-upper-bound-deps_failure\pom.xml ......... SUCCESS (6.5 s)
[windows-jdk9-m3.5.x_build] [INFO] Building: require-upper-bound-deps_ignored\pom.xml
[windows-jdk9-m3.5.x_build] [INFO] run post-build script verify.groovy
[windows-jdk9-m3.5.x_build] [INFO]           require-upper-bound-deps_ignored\pom.xml ......... SUCCESS (6.0 s)
[windows-jdk9-m3.5.x_build] [INFO] Building: require-upper-bound-deps_success\pom.xml
[windows-jdk9-m3.5.x_build] [INFO]           require-upper-bound-deps_success\pom.xml ......... SUCCESS (5.9 s)
[windows-jdk9-m3.5.x_build] [INFO] Building: resolve_collect_dependencies\pom.xml
[windows-jdk9-m3.5.x_build] [INFO] run post-build script verify.groovy
[windows-jdk9-m3.5.x_build] [INFO]           resolve_collect_dependencies\pom.xml ............. SUCCESS (10.3 s)
[windows-jdk9-m3.5.x_build] [INFO] -------------------------------------------------
[windows-jdk9-m3.5.x_build] [INFO] Build Summary:
[windows-jdk9-m3.5.x_build] [INFO]   Passed: 68, Failed: 0, Errors: 0, Skipped: 0
[windows-jdk9-m3.5.x_build] [INFO] -------------------------------------------------
[windows-jdk9-m3.5.x_build] [INFO] 
[windows-jdk9-m3.5.x_build] [INFO] --- mrm-maven-plugin:1.0.0:stop (default) @ maven-enforcer-plugin ---
[windows-jdk9-m3.5.x_build] [INFO] Stopping Mock Repository Manager on http://localhost:55312
[windows-jdk9-m3.5.x_build] [INFO] Mock Repository Manager http://localhost:55312 is stopped.
[windows-jdk9-m3.5.x_build] [INFO] 
[windows-jdk9-m3.5.x_build] [INFO] --- maven-checkstyle-plugin:3.0.0:check (checkstyle-check) @ maven-enforcer-plugin ---
[windows-jdk9-m3.5.x_build] [INFO] ------------------------------------------------------------------------
[windows-jdk9-m3.5.x_build] [INFO] Reactor Summary:
[windows-jdk9-m3.5.x_build] [INFO] 
[windows-jdk9-m3.5.x_build] [INFO] Apache Maven Enforcer .............................. SUCCESS [ 47.296 s]
[windows-jdk9-m3.5.x_build] [INFO] Apache Maven Enforcer API .......................... SUCCESS [ 11.202 s]
[windows-jdk9-m3.5.x_build] [INFO] Apache Maven Enforcer Built-In Rules ............... SUCCESS [ 32.048 s]
[windows-jdk9-m3.5.x_build] [INFO] Apache Maven Enforcer Plugin ....................... SUCCESS [09:48 min]
[windows-jdk9-m3.5.x_build] [INFO] ------------------------------------------------------------------------
[windows-jdk9-m3.5.x_build] [INFO] BUILD SUCCESS
[windows-jdk9-m3.5.x_build] [INFO] ------------------------------------------------------------------------
[windows-jdk9-m3.5.x_build] [INFO] Total time: 11:21 min
[windows-jdk9-m3.5.x_build] [INFO] Finished at: 2018-11-09T00:32:36-08:00
[windows-jdk9-m3.5.x_build] [INFO] Final Memory: 51M/172M
[windows-jdk9-m3.5.x_build] [INFO] ------------------------------------------------------------------------
[windows-jdk9-m3.5.x_build] [INFO] [jenkins-event-spy] Generated F:\jenkins\jenkins-slave\workspace\aven-enforcer_IMPROVE_TESTS-STPPGKMLZMMP35I7IYC3BJFSM5FR665OYVQGY7GQ7REZ2ZJBGHFA@3@tmp\withMaven254a526d\maven-spy-20181109-002115-1314550000952362244021.log
[Pipeline] [windows-jdk9-m3.5.x_build] }
[Pipeline] [windows-jdk9-m3.5.x_build] // dir
[Pipeline] [windows-jdk9-m3.5.x_build] }
[windows-jdk9-m3.5.x_build] [withMaven] artifactsPublisher - Archive artifact windows-jdk9-m3.5.x_build\pom.xml under org\apache\maven\enforcer\enforcer\3.0.0-SNAPSHOT\enforcer-3.0.0-SNAPSHOT.pom
[windows-jdk9-m3.5.x_build] [withMaven] artifactsPublisher - Archive artifact windows-jdk9-m3.5.x_build\target\enforcer-3.0.0-SNAPSHOT-site.xml under org\apache\maven\enforcer\enforcer\3.0.0-SNAPSHOT\enforcer-3.0.0-SNAPSHOT-site.xml
[windows-jdk9-m3.5.x_build] [withMaven] artifactsPublisher - Archive artifact windows-jdk9-m3.5.x_build\enforcer-api\pom.xml under org\apache\maven\enforcer\enforcer-api\3.0.0-SNAPSHOT\enforcer-api-3.0.0-SNAPSHOT.pom
[windows-jdk9-m3.5.x_build] [withMaven] artifactsPublisher - Archive artifact windows-jdk9-m3.5.x_build\enforcer-api\target\enforcer-api-3.0.0-SNAPSHOT.jar under org\apache\maven\enforcer\enforcer-api\3.0.0-SNAPSHOT\enforcer-api-3.0.0-SNAPSHOT.jar
[windows-jdk9-m3.5.x_build] [withMaven] artifactsPublisher - Archive artifact windows-jdk9-m3.5.x_build\enforcer-rules\pom.xml under org\apache\maven\enforcer\enforcer-rules\3.0.0-SNAPSHOT\enforcer-rules-3.0.0-SNAPSHOT.pom
[windows-jdk9-m3.5.x_build] [withMaven] artifactsPublisher - Archive artifact windows-jdk9-m3.5.x_build\enforcer-rules\target\enforcer-rules-3.0.0-SNAPSHOT.jar under org\apache\maven\enforcer\enforcer-rules\3.0.0-SNAPSHOT\enforcer-rules-3.0.0-SNAPSHOT.jar
[windows-jdk9-m3.5.x_build] [withMaven] artifactsPublisher - Archive artifact windows-jdk9-m3.5.x_build\enforcer-rules\target\enforcer-rules-3.0.0-SNAPSHOT-tests.jar under org\apache\maven\enforcer\enforcer-rules\3.0.0-SNAPSHOT\enforcer-rules-3.0.0-SNAPSHOT-tests.jar
[windows-jdk9-m3.5.x_build] [withMaven] artifactsPublisher - Archive artifact windows-jdk9-m3.5.x_build\maven-enforcer-plugin\pom.xml under org\apache\maven\plugins\maven-enforcer-plugin\3.0.0-SNAPSHOT\maven-enforcer-plugin-3.0.0-SNAPSHOT.pom
[windows-jdk9-m3.5.x_build] [withMaven] artifactsPublisher - Archive artifact windows-jdk9-m3.5.x_build\maven-enforcer-plugin\target\maven-enforcer-plugin-3.0.0-SNAPSHOT.jar under org\apache\maven\plugins\maven-enforcer-plugin\3.0.0-SNAPSHOT\maven-enforcer-plugin-3.0.0-SNAPSHOT.jar
[windows-jdk9-m3.5.x_build] [Fast Archiver] No prior successful build to compare, so performing full copy of artifacts
[windows-jdk9-m3.5.x_build] [withMaven] invokerPublisher - Archive invoker results for Maven artifact MavenArtifact{org.apache.maven.plugins:maven-enforcer-plugin::3.0.0-SNAPSHOT(version: 3.0.0-SNAPSHOT, snapshot:false) } generated by PluginInvocation{org.apache.maven.plugins:maven-invoker-plugin:3.1.0@run  integration-test}: windows-jdk9-m3.5.x_build\maven-enforcer-plugin\target\invoker-reports\*.xml
[windows-jdk9-m3.5.x_build] performing MavenInvokerRecorder, reportsFilenamePattern:'**/windows-jdk9-m3.5.x_build\maven-enforcer-plugin\target\invoker-reports/BUILD*.xml', invokerBuildDir:'**/windows-jdk9-m3.5.x_build\maven-enforcer-plugin\target\it'
[windows-jdk9-m3.5.x_build] Found reports:[f:\jenkins\jenkins-slave\workspace\aven-enforcer_IMPROVE_TESTS-STPPGKMLZMMP35I7IYC3BJFSM5FR665OYVQGY7GQ7REZ2ZJBGHFA@3\windows-jdk9-m3.5.x_build\maven-enforcer-plugin\target\invoker-reports\BUILD-always-fail-warn.xml, f:\jenkins\jenkins-slave\workspace\aven-enforcer_IMPROVE_TESTS-STPPGKMLZMMP35I7IYC3BJFSM5FR665OYVQGY7GQ7REZ2ZJBGHFA@3\windows-jdk9-m3.5.x_build\maven-enforcer-plugin\target\invoker-reports\BUILD-always-fail.xml, f:\jenkins\jenkins-slave\workspace\aven-enforcer_IMPROVE_TESTS-STPPGKMLZMMP35I7IYC3BJFSM5FR665OYVQGY7GQ7REZ2ZJBGHFA@3\windows-jdk9-m3.5.x_build\maven-enforcer-plugin\target\invoker-reports\BUILD-always-pass.xml, f:\jenkins\jenkins-slave\workspace\aven-enforcer_IMPROVE_TESTS-STPPGKMLZMMP35I7IYC3BJFSM5FR665OYVQGY7GQ7REZ2ZJBGHFA@3\windows-jdk9-m3.5.x_build\maven-enforcer-plugin\target\invoker-reports\BUILD-ban-distribution-management-multi-module-build.xml, f:\jenkins\jenkins-slave\workspace\aven-enforcer_IMPROVE_TESTS-STPPGKMLZMMP35I7IYC3BJFSM5FR665OYVQGY7GQ7REZ2ZJBGHFA@3\windows-jdk9-m3.5.x_build\maven-enforcer-plugin\target\invoker-reports\BUILD-ban-distribution-management-multi-module-except-site.xml, f:\jenkins\jenkins-slave\workspace\aven-enforcer_IMPROVE_TESTS-STPPGKMLZMMP35I7IYC3BJFSM5FR665OYVQGY7GQ7REZ2ZJBGHFA@3\windows-jdk9-m3.5.x_build\maven-enforcer-plugin\target\invoker-reports\BUILD-ban-distribution-management.xml, f:\jenkins\jenkins-slave\workspace\aven-enforcer_IMPROVE_TESTS-STPPGKMLZMMP35I7IYC3BJFSM5FR665OYVQGY7GQ7REZ2ZJBGHFA@3\windows-jdk9-m3.5.x_build\maven-enforcer-plugin\target\invoker-reports\BUILD-ban-pom-dependency-version.xml, f:\jenkins\jenkins-slave\workspace\aven-enforcer_IMPROVE_TESTS-STPPGKMLZMMP35I7IYC3BJFSM5FR665OYVQGY7GQ7REZ2ZJBGHFA@3\windows-jdk9-m3.5.x_build\maven-enforcer-plugin\target\invoker-reports\BUILD-ban-transitive-dependencies-fail.xml, f:\jenkins\jenkins-slave\workspace\aven-enforcer_IMPROVE_TESTS-STPPGKMLZMMP35I7IYC3BJFSM5FR665OYVQGY7GQ7REZ2ZJBGHFA@3\windows-jdk9-m3.5.x_build\maven-enforcer-plugin\target\invoker-reports\BUILD-ban-transitive-dependencies.xml, f:\jenkins\jenkins-slave\workspace\aven-enforcer_IMPROVE_TESTS-STPPGKMLZMMP35I7IYC3BJFSM5FR665OYVQGY7GQ7REZ2ZJBGHFA@3\windows-jdk9-m3.5.x_build\maven-enforcer-plugin\target\invoker-reports\BUILD-banned-dependencies-versionrange-fail.xml, f:\jenkins\jenkins-slave\workspace\aven-enforcer_IMPROVE_TESTS-STPPGKMLZMMP35I7IYC3BJFSM5FR665OYVQGY7GQ7REZ2ZJBGHFA@3\windows-jdk9-m3.5.x_build\maven-enforcer-plugin\target\invoker-reports\BUILD-banned-dependencies-versionrange.xml, f:\jenkins\jenkins-slave\workspace\aven-enforcer_IMPROVE_TESTS-STPPGKMLZMMP35I7IYC3BJFSM5FR665OYVQGY7GQ7REZ2ZJBGHFA@3\windows-jdk9-m3.5.x_build\maven-enforcer-plugin\target\invoker-reports\BUILD-banned-dependencies-wildcards.xml, f:\jenkins\jenkins-slave\workspace\aven-enforcer_IMPROVE_TESTS-STPPGKMLZMMP35I7IYC3BJFSM5FR665OYVQGY7GQ7REZ2ZJBGHFA@3\windows-jdk9-m3.5.x_build\maven-enforcer-plugin\target\invoker-reports\BUILD-banned-dependencies.xml, f:\jenkins\jenkins-slave\workspace\aven-enforcer_IMPROVE_TESTS-STPPGKMLZMMP35I7IYC3BJFSM5FR665OYVQGY7GQ7REZ2ZJBGHFA@3\windows-jdk9-m3.5.x_build\maven-enforcer-plugin\target\invoker-reports\BUILD-banned-plugins.xml, f:\jenkins\jenkins-slave\workspace\aven-enforcer_IMPROVE_TESTS-STPPGKMLZMMP35I7IYC3BJFSM5FR665OYVQGY7GQ7REZ2ZJBGHFA@3\windows-jdk9-m3.5.x_build\maven-enforcer-plugin\target\invoker-reports\BUILD-builds_a_pom_noop.xml, f:\jenkins\jenkins-slave\workspace\aven-enforcer_IMPROVE_TESTS-STPPGKMLZMMP35I7IYC3BJFSM5FR665OYVQGY7GQ7REZ2ZJBGHFA@3\windows-jdk9-m3.5.x_build\maven-enforcer-plugin\target\invoker-reports\BUILD-cli-always-fail.xml, f:\jenkins\jenkins-slave\workspace\aven-enforcer_IMPROVE_TESTS-STPPGKMLZMMP35I7IYC3BJFSM5FR665OYVQGY7GQ7REZ2ZJBGHFA@3\windows-jdk9-m3.5.x_build\maven-enforcer-plugin\target\invoker-reports\BUILD-cli-always-pass.xml, f:\jenkins\jenkins-slave\workspace\aven-enforcer_IMPROVE_TESTS-STPPGKMLZMMP35I7IYC3BJFSM5FR665OYVQGY7GQ7REZ2ZJBGHFA@3\windows-jdk9-m3.5.x_build\maven-enforcer-plugin\target\invoker-reports\BUILD-dependencies_converge.xml, f:\jenkins\jenkins-slave\workspace\aven-enforcer_IMPROVE_TESTS-STPPGKMLZMMP35I7IYC3BJFSM5FR665OYVQGY7GQ7REZ2ZJBGHFA@3\windows-jdk9-m3.5.x_build\maven-enforcer-plugin\target\invoker-reports\BUILD-dependencies_not_converging.xml, f:\jenkins\jenkins-slave\workspace\aven-enforcer_IMPROVE_TESTS-STPPGKMLZMMP35I7IYC3BJFSM5FR665OYVQGY7GQ7REZ2ZJBGHFA@3\windows-jdk9-m3.5.x_build\maven-enforcer-plugin\target\invoker-reports\BUILD-dependencies_not_converging_test_scope.xml, f:\jenkins\jenkins-slave\workspace\aven-enforcer_IMPROVE_TESTS-STPPGKMLZMMP35I7IYC3BJFSM5FR665OYVQGY7GQ7REZ2ZJBGHFA@3\windows-jdk9-m3.5.x_build\maven-enforcer-plugin\target\invoker-reports\BUILD-display-info.xml, f:\jenkins\jenkins-slave\workspace\aven-enforcer_IMPROVE_TESTS-STPPGKMLZMMP35I7IYC3BJFSM5FR665OYVQGY7GQ7REZ2ZJBGHFA@3\windows-jdk9-m3.5.x_build\maven-enforcer-plugin\target\invoker-reports\BUILD-evaluate-beanshell.xml, f:\jenkins\jenkins-slave\workspace\aven-enforcer_IMPROVE_TESTS-STPPGKMLZMMP35I7IYC3BJFSM5FR665OYVQGY7GQ7REZ2ZJBGHFA@3\windows-jdk9-m3.5.x_build\maven-enforcer-plugin\target\invoker-reports\BUILD-multimodule.xml, f:\jenkins\jenkins-slave\workspace\aven-enforcer_IMPROVE_TESTS-STPPGKMLZMMP35I7IYC3BJFSM5FR665OYVQGY7GQ7REZ2ZJBGHFA@3\windows-jdk9-m3.5.x_build\maven-enforcer-plugin\target\invoker-reports\BUILD-require-active-profile-all.xml, f:\jenkins\jenkins-slave\workspace\aven-enforcer_IMPROVE_TESTS-STPPGKMLZMMP35I7IYC3BJFSM5FR665OYVQGY7GQ7REZ2ZJBGHFA@3\windows-jdk9-m3.5.x_build\maven-enforcer-plugin\target\invoker-reports\BUILD-require-active-profile-from-settings.xml, f:\jenkins\jenkins-slave\workspace\aven-enforcer_IMPROVE_TESTS-STPPGKMLZMMP35I7IYC3BJFSM5FR665OYVQGY7GQ7REZ2ZJBGHFA@3\windows-jdk9-m3.5.x_build\maven-enforcer-plugin\target\invoker-reports\BUILD-require-active-profile.xml, f:\jenkins\jenkins-slave\workspace\aven-enforcer_IMPROVE_TESTS-STPPGKMLZMMP35I7IYC3BJFSM5FR665OYVQGY7GQ7REZ2ZJBGHFA@3\windows-jdk9-m3.5.x_build\maven-enforcer-plugin\target\invoker-reports\BUILD-require-file-checksum.xml, f:\jenkins\jenkins-slave\workspace\aven-enforcer_IMPROVE_TESTS-STPPGKMLZMMP35I7IYC3BJFSM5FR665OYVQGY7GQ7REZ2ZJBGHFA@3\windows-jdk9-m3.5.x_build\maven-enforcer-plugin\target\invoker-reports\BUILD-require-files-dont-exist.xml, f:\jenkins\jenkins-slave\workspace\aven-enforcer_IMPROVE_TESTS-STPPGKMLZMMP35I7IYC3BJFSM5FR665OYVQGY7GQ7REZ2ZJBGHFA@3\windows-jdk9-m3.5.x_build\maven-enforcer-plugin\target\invoker-reports\BUILD-require-files-exist.xml, f:\jenkins\jenkins-slave\workspace\aven-enforcer_IMPROVE_TESTS-STPPGKMLZMMP35I7IYC3BJFSM5FR665OYVQGY7GQ7REZ2ZJBGHFA@3\windows-jdk9-m3.5.x_build\maven-enforcer-plugin\target\invoker-reports\BUILD-require-files-size.xml, f:\jenkins\jenkins-slave\workspace\aven-enforcer_IMPROVE_TESTS-STPPGKMLZMMP35I7IYC3BJFSM5FR665OYVQGY7GQ7REZ2ZJBGHFA@3\windows-jdk9-m3.5.x_build\maven-enforcer-plugin\target\invoker-reports\BUILD-require-java-version.xml, f:\jenkins\jenkins-slave\workspace\aven-enforcer_IMPROVE_TESTS-STPPGKMLZMMP35I7IYC3BJFSM5FR665OYVQGY7GQ7REZ2ZJBGHFA@3\windows-jdk9-m3.5.x_build\maven-enforcer-plugin\target\invoker-reports\BUILD-require-maven-version.xml, f:\jenkins\jenkins-slave\workspace\aven-enforcer_IMPROVE_TESTS-STPPGKMLZMMP35I7IYC3BJFSM5FR665OYVQGY7GQ7REZ2ZJBGHFA@3\windows-jdk9-m3.5.x_build\maven-enforcer-plugin\target\invoker-reports\BUILD-require-no-repositories-allow-plugin-repo.xml, f:\jenkins\jenkins-slave\workspace\aven-enforcer_IMPROVE_TESTS-STPPGKMLZMMP35I7IYC3BJFSM5FR665OYVQGY7GQ7REZ2ZJBGHFA@3\windows-jdk9-m3.5.x_build\maven-enforcer-plugin\target\invoker-reports\BUILD-require-no-repositories-allow-repo.xml, f:\jenkins\jenkins-slave\workspace\aven-enforcer_IMPROVE_TESTS-STPPGKMLZMMP35I7IYC3BJFSM5FR665OYVQGY7GQ7REZ2ZJBGHFA@3\windows-jdk9-m3.5.x_build\maven-enforcer-plugin\target\invoker-reports\BUILD-require-no-repositories.xml, f:\jenkins\jenkins-slave\workspace\aven-enforcer_IMPROVE_TESTS-STPPGKMLZMMP35I7IYC3BJFSM5FR665OYVQGY7GQ7REZ2ZJBGHFA@3\windows-jdk9-m3.5.x_build\maven-enforcer-plugin\target\invoker-reports\BUILD-require-no-repositories_failure.xml, f:\jenkins\jenkins-slave\workspace\aven-enforcer_IMPROVE_TESTS-STPPGKMLZMMP35I7IYC3BJFSM5FR665OYVQGY7GQ7REZ2ZJBGHFA@3\windows-jdk9-m3.5.x_build\maven-enforcer-plugin\target\invoker-reports\BUILD-require-no-repositories_failure_allowed-plugin-repo.xml, f:\jenkins\jenkins-slave\workspace\aven-enforcer_IMPROVE_TESTS-STPPGKMLZMMP35I7IYC3BJFSM5FR665OYVQGY7GQ7REZ2ZJBGHFA@3\windows-jdk9-m3.5.x_build\maven-enforcer-plugin\target\invoker-reports\BUILD-require-no-repositories_failure_plugin-repositories.xml, f:\jenkins\jenkins-slave\workspace\aven-enforcer_IMPROVE_TESTS-STPPGKMLZMMP35I7IYC3BJFSM5FR665OYVQGY7GQ7REZ2ZJBGHFA@3\windows-jdk9-m3.5.x_build\maven-enforcer-plugin\target\invoker-reports\BUILD-require-no-repositories_failure_repositories.xml, f:\jenkins\jenkins-slave\workspace\aven-enforcer_IMPROVE_TESTS-STPPGKMLZMMP35I7IYC3BJFSM5FR665OYVQGY7GQ7REZ2ZJBGHFA@3\windows-jdk9-m3.5.x_build\maven-enforcer-plugin\target\invoker-reports\BUILD-require-no-repositories_mm.xml, f:\jenkins\jenkins-slave\workspace\aven-enforcer_IMPROVE_TESTS-STPPGKMLZMMP35I7IYC3BJFSM5FR665OYVQGY7GQ7REZ2ZJBGHFA@3\windows-jdk9-m3.5.x_build\maven-enforcer-plugin\target\invoker-reports\BUILD-require-no-repositories_mm_ci.xml, f:\jenkins\jenkins-slave\workspace\aven-enforcer_IMPROVE_TESTS-STPPGKMLZMMP35I7IYC3BJFSM5FR665OYVQGY7GQ7REZ2ZJBGHFA@3\windows-jdk9-m3.5.x_build\maven-enforcer-plugin\target\invoker-reports\BUILD-require-plugin-versions-ci.xml, f:\jenkins\jenkins-slave\workspace\aven-enforcer_IMPROVE_TESTS-STPPGKMLZMMP35I7IYC3BJFSM5FR665OYVQGY7GQ7REZ2ZJBGHFA@3\windows-jdk9-m3.5.x_build\maven-enforcer-plugin\target\invoker-reports\BUILD-require-plugin-versions-custom-packaging.xml, f:\jenkins\jenkins-slave\workspace\aven-enforcer_IMPROVE_TESTS-STPPGKMLZMMP35I7IYC3BJFSM5FR665OYVQGY7GQ7REZ2ZJBGHFA@3\windows-jdk9-m3.5.x_build\maven-enforcer-plugin\target\invoker-reports\BUILD-require-plugin-versions-expressions.xml, f:\jenkins\jenkins-slave\workspace\aven-enforcer_IMPROVE_TESTS-STPPGKMLZMMP35I7IYC3BJFSM5FR665OYVQGY7GQ7REZ2ZJBGHFA@3\windows-jdk9-m3.5.x_build\maven-enforcer-plugin\target\invoker-reports\BUILD-require-plugin-versions-mm-ci-friendly.xml, f:\jenkins\jenkins-slave\workspace\aven-enforcer_IMPROVE_TESTS-STPPGKMLZMMP35I7IYC3BJFSM5FR665OYVQGY7GQ7REZ2ZJBGHFA@3\windows-jdk9-m3.5.x_build\maven-enforcer-plugin\target\invoker-reports\BUILD-require-plugin-versions-plugin-with-extensions.xml, f:\jenkins\jenkins-slave\workspace\aven-enforcer_IMPROVE_TESTS-STPPGKMLZMMP35I7IYC3BJFSM5FR665OYVQGY7GQ7REZ2ZJBGHFA@3\windows-jdk9-m3.5.x_build\maven-enforcer-plugin\target\invoker-reports\BUILD-require-plugin-versions-plugin-with-integration-test-lifecycle.xml, f:\jenkins\jenkins-slave\workspace\aven-enforcer_IMPROVE_TESTS-STPPGKMLZMMP35I7IYC3BJFSM5FR665OYVQGY7GQ7REZ2ZJBGHFA@3\windows-jdk9-m3.5.x_build\maven-enforcer-plugin\target\invoker-reports\BUILD-require-plugin-versions-projectGAVexpressions.xml, f:\jenkins\jenkins-slave\workspace\aven-enforcer_IMPROVE_TESTS-STPPGKMLZMMP35I7IYC3BJFSM5FR665OYVQGY7GQ7REZ2ZJBGHFA@3\windows-jdk9-m3.5.x_build\maven-enforcer-plugin\target\invoker-reports\BUILD-require-plugin-versions.xml, f:\jenkins\jenkins-slave\workspace\aven-enforcer_IMPROVE_TESTS-STPPGKMLZMMP35I7IYC3BJFSM5FR665OYVQGY7GQ7REZ2ZJBGHFA@3\windows-jdk9-m3.5.x_build\maven-enforcer-plugin\target\invoker-reports\BUILD-require-profile-ids-exist_failure.xml, f:\jenkins\jenkins-slave\workspace\aven-enforcer_IMPROVE_TESTS-STPPGKMLZMMP35I7IYC3BJFSM5FR665OYVQGY7GQ7REZ2ZJBGHFA@3\windows-jdk9-m3.5.x_build\maven-enforcer-plugin\target\invoker-reports\BUILD-require-profile-ids-exist_success.xml, f:\jenkins\jenkins-slave\workspace\aven-enforcer_IMPROVE_TESTS-STPPGKMLZMMP35I7IYC3BJFSM5FR665OYVQGY7GQ7REZ2ZJBGHFA@3\windows-jdk9-m3.5.x_build\maven-enforcer-plugin\target\invoker-reports\BUILD-require-property.xml, f:\jenkins\jenkins-slave\workspace\aven-enforcer_IMPROVE_TESTS-STPPGKMLZMMP35I7IYC3BJFSM5FR665OYVQGY7GQ7REZ2ZJBGHFA@3\windows-jdk9-m3.5.x_build\maven-enforcer-plugin\target\invoker-reports\BUILD-require-release-dependencies-excludes.xml, f:\jenkins\jenkins-slave\workspace\aven-enforcer_IMPROVE_TESTS-STPPGKMLZMMP35I7IYC3BJFSM5FR665OYVQGY7GQ7REZ2ZJBGHFA@3\windows-jdk9-m3.5.x_build\maven-enforcer-plugin\target\invoker-reports\BUILD-require-release-dependencies-excludes_failure.xml, f:\jenkins\jenkins-slave\workspace\aven-enforcer_IMPROVE_TESTS-STPPGKMLZMMP35I7IYC3BJFSM5FR665OYVQGY7GQ7REZ2ZJBGHFA@3\windows-jdk9-m3.5.x_build\maven-enforcer-plugin\target\invoker-reports\BUILD-require-release-dependencies.xml, f:\jenkins\jenkins-slave\workspace\aven-enforcer_IMPROVE_TESTS-STPPGKMLZMMP35I7IYC3BJFSM5FR665OYVQGY7GQ7REZ2ZJBGHFA@3\windows-jdk9-m3.5.x_build\maven-enforcer-plugin\target\invoker-reports\BUILD-require-release-version.xml, f:\jenkins\jenkins-slave\workspace\aven-enforcer_IMPROVE_TESTS-STPPGKMLZMMP35I7IYC3BJFSM5FR665OYVQGY7GQ7REZ2ZJBGHFA@3\windows-jdk9-m3.5.x_build\maven-enforcer-plugin\target\invoker-reports\BUILD-require-same-versions_failure.xml, f:\jenkins\jenkins-slave\workspace\aven-enforcer_IMPROVE_TESTS-STPPGKMLZMMP35I7IYC3BJFSM5FR665OYVQGY7GQ7REZ2ZJBGHFA@3\windows-jdk9-m3.5.x_build\maven-enforcer-plugin\target\invoker-reports\BUILD-require-same-versions_success.xml, f:\jenkins\jenkins-slave\workspace\aven-enforcer_IMPROVE_TESTS-STPPGKMLZMMP35I7IYC3BJFSM5FR665OYVQGY7GQ7REZ2ZJBGHFA@3\windows-jdk9-m3.5.x_build\maven-enforcer-plugin\target\invoker-reports\BUILD-require-snapshot-version_failure.xml, f:\jenkins\jenkins-slave\workspace\aven-enforcer_IMPROVE_TESTS-STPPGKMLZMMP35I7IYC3BJFSM5FR665OYVQGY7GQ7REZ2ZJBGHFA@3\windows-jdk9-m3.5.x_build\maven-enforcer-plugin\target\invoker-reports\BUILD-require-snapshot-version_success.xml, f:\jenkins\jenkins-slave\workspace\aven-enforcer_IMPROVE_TESTS-STPPGKMLZMMP35I7IYC3BJFSM5FR665OYVQGY7GQ7REZ2ZJBGHFA@3\windows-jdk9-m3.5.x_build\maven-enforcer-plugin\target\invoker-reports\BUILD-require-upper-bound-dependencies-managed_failure.xml, f:\jenkins\jenkins-slave\workspace\aven-enforcer_IMPROVE_TESTS-STPPGKMLZMMP35I7IYC3BJFSM5FR665OYVQGY7GQ7REZ2ZJBGHFA@3\windows-jdk9-m3.5.x_build\maven-enforcer-plugin\target\invoker-reports\BUILD-require-upper-bound-dependencies-managed_success.xml, f:\jenkins\jenkins-slave\workspace\aven-enforcer_IMPROVE_TESTS-STPPGKMLZMMP35I7IYC3BJFSM5FR665OYVQGY7GQ7REZ2ZJBGHFA@3\windows-jdk9-m3.5.x_build\maven-enforcer-plugin\target\invoker-reports\BUILD-require-upper-bound-dependencies-unique_failure.xml, f:\jenkins\jenkins-slave\workspace\aven-enforcer_IMPROVE_TESTS-STPPGKMLZMMP35I7IYC3BJFSM5FR665OYVQGY7GQ7REZ2ZJBGHFA@3\windows-jdk9-m3.5.x_build\maven-enforcer-plugin\target\invoker-reports\BUILD-require-upper-bound-dependencies-unique_success.xml, f:\jenkins\jenkins-slave\workspace\aven-enforcer_IMPROVE_TESTS-STPPGKMLZMMP35I7IYC3BJFSM5FR665OYVQGY7GQ7REZ2ZJBGHFA@3\windows-jdk9-m3.5.x_build\maven-enforcer-plugin\target\invoker-reports\BUILD-require-upper-bound-deps_failure.xml, f:\jenkins\jenkins-slave\workspace\aven-enforcer_IMPROVE_TESTS-STPPGKMLZMMP35I7IYC3BJFSM5FR665OYVQGY7GQ7REZ2ZJBGHFA@3\windows-jdk9-m3.5.x_build\maven-enforcer-plugin\target\invoker-reports\BUILD-require-upper-bound-deps_ignored.xml, f:\jenkins\jenkins-slave\workspace\aven-enforcer_IMPROVE_TESTS-STPPGKMLZMMP35I7IYC3BJFSM5FR665OYVQGY7GQ7REZ2ZJBGHFA@3\windows-jdk9-m3.5.x_build\maven-enforcer-plugin\target\invoker-reports\BUILD-require-upper-bound-deps_success.xml, f:\jenkins\jenkins-slave\workspace\aven-enforcer_IMPROVE_TESTS-STPPGKMLZMMP35I7IYC3BJFSM5FR665OYVQGY7GQ7REZ2ZJBGHFA@3\windows-jdk9-m3.5.x_build\maven-enforcer-plugin\target\invoker-reports\BUILD-resolve_collect_dependencies.xml]
[windows-jdk9-m3.5.x_build] Found logs:[f:\jenkins\jenkins-slave\workspace\aven-enforcer_IMPROVE_TESTS-STPPGKMLZMMP35I7IYC3BJFSM5FR665OYVQGY7GQ7REZ2ZJBGHFA@3\windows-jdk9-m3.5.x_build\maven-enforcer-plugin\target\it\always-fail-warn\build.log, f:\jenkins\jenkins-slave\workspace\aven-enforcer_IMPROVE_TESTS-STPPGKMLZMMP35I7IYC3BJFSM5FR665OYVQGY7GQ7REZ2ZJBGHFA@3\windows-jdk9-m3.5.x_build\maven-enforcer-plugin\target\it\always-fail\build.log, f:\jenkins\jenkins-slave\workspace\aven-enforcer_IMPROVE_TESTS-STPPGKMLZMMP35I7IYC3BJFSM5FR665OYVQGY7GQ7REZ2ZJBGHFA@3\windows-jdk9-m3.5.x_build\maven-enforcer-plugin\target\it\always-pass\build.log, f:\jenkins\jenkins-slave\workspace\aven-enforcer_IMPROVE_TESTS-STPPGKMLZMMP35I7IYC3BJFSM5FR665OYVQGY7GQ7REZ2ZJBGHFA@3\windows-jdk9-m3.5.x_build\maven-enforcer-plugin\target\it\ban-distribution-management-multi-module-build\build.log, f:\jenkins\jenkins-slave\workspace\aven-enforcer_IMPROVE_TESTS-STPPGKMLZMMP35I7IYC3BJFSM5FR665OYVQGY7GQ7REZ2ZJBGHFA@3\windows-jdk9-m3.5.x_build\maven-enforcer-plugin\target\it\ban-distribution-management-multi-module-except-site\build.log, f:\jenkins\jenkins-slave\workspace\aven-enforcer_IMPROVE_TESTS-STPPGKMLZMMP35I7IYC3BJFSM5FR665OYVQGY7GQ7REZ2ZJBGHFA@3\windows-jdk9-m3.5.x_build\maven-enforcer-plugin\target\it\ban-distribution-management\build.log, f:\jenkins\jenkins-slave\workspace\aven-enforcer_IMPROVE_TESTS-STPPGKMLZMMP35I7IYC3BJFSM5FR665OYVQGY7GQ7REZ2ZJBGHFA@3\windows-jdk9-m3.5.x_build\maven-enforcer-plugin\target\it\ban-pom-dependency-version\build.log, f:\jenkins\jenkins-slave\workspace\aven-enforcer_IMPROVE_TESTS-STPPGKMLZMMP35I7IYC3BJFSM5FR665OYVQGY7GQ7REZ2ZJBGHFA@3\windows-jdk9-m3.5.x_build\maven-enforcer-plugin\target\it\ban-transitive-dependencies-fail\build.log, f:\jenkins\jenkins-slave\workspace\aven-enforcer_IMPROVE_TESTS-STPPGKMLZMMP35I7IYC3BJFSM5FR665OYVQGY7GQ7REZ2ZJBGHFA@3\windows-jdk9-m3.5.x_build\maven-enforcer-plugin\target\it\ban-transitive-dependencies\build.log, f:\jenkins\jenkins-slave\workspace\aven-enforcer_IMPROVE_TESTS-STPPGKMLZMMP35I7IYC3BJFSM5FR665OYVQGY7GQ7REZ2ZJBGHFA@3\windows-jdk9-m3.5.x_build\maven-enforcer-plugin\target\it\banned-dependencies-versionrange-fail\build.log, f:\jenkins\jenkins-slave\workspace\aven-enforcer_IMPROVE_TESTS-STPPGKMLZMMP35I7IYC3BJFSM5FR665OYVQGY7GQ7REZ2ZJBGHFA@3\windows-jdk9-m3.5.x_build\maven-enforcer-plugin\target\it\banned-dependencies-versionrange\build.log, f:\jenkins\jenkins-slave\workspace\aven-enforcer_IMPROVE_TESTS-STPPGKMLZMMP35I7IYC3BJFSM5FR665OYVQGY7GQ7REZ2ZJBGHFA@3\windows-jdk9-m3.5.x_build\maven-enforcer-plugin\target\it\banned-dependencies-wildcards\build.log, f:\jenkins\jenkins-slave\workspace\aven-enforcer_IMPROVE_TESTS-STPPGKMLZMMP35I7IYC3BJFSM5FR665OYVQGY7GQ7REZ2ZJBGHFA@3\windows-jdk9-m3.5.x_build\maven-enforcer-plugin\target\it\banned-dependencies\build.log, f:\jenkins\jenkins-slave\workspace\aven-enforcer_IMPROVE_TESTS-STPPGKMLZMMP35I7IYC3BJFSM5FR665OYVQGY7GQ7REZ2ZJBGHFA@3\windows-jdk9-m3.5.x_build\maven-enforcer-plugin\target\it\banned-plugins\build.log, f:\jenkins\jenkins-slave\workspace\aven-enforcer_IMPROVE_TESTS-STPPGKMLZMMP35I7IYC3BJFSM5FR665OYVQGY7GQ7REZ2ZJBGHFA@3\windows-jdk9-m3.5.x_build\maven-enforcer-plugin\target\it\builds_a_pom_noop\build.log, f:\jenkins\jenkins-slave\workspace\aven-enforcer_IMPROVE_TESTS-STPPGKMLZMMP35I7IYC3BJFSM5FR665OYVQGY7GQ7REZ2ZJBGHFA@3\windows-jdk9-m3.5.x_build\maven-enforcer-plugin\target\it\cli-always-fail\build.log, f:\jenkins\jenkins-slave\workspace\aven-enforcer_IMPROVE_TESTS-STPPGKMLZMMP35I7IYC3BJFSM5FR665OYVQGY7GQ7REZ2ZJBGHFA@3\windows-jdk9-m3.5.x_build\maven-enforcer-plugin\target\it\cli-always-pass\build.log, f:\jenkins\jenkins-slave\workspace\aven-enforcer_IMPROVE_TESTS-STPPGKMLZMMP35I7IYC3BJFSM5FR665OYVQGY7GQ7REZ2ZJBGHFA@3\windows-jdk9-m3.5.x_build\maven-enforcer-plugin\target\it\dependencies_converge\build.log, f:\jenkins\jenkins-slave\workspace\aven-enforcer_IMPROVE_TESTS-STPPGKMLZMMP35I7IYC3BJFSM5FR665OYVQGY7GQ7REZ2ZJBGHFA@3\windows-jdk9-m3.5.x_build\maven-enforcer-plugin\target\it\dependencies_not_converging\build.log, f:\jenkins\jenkins-slave\workspace\aven-enforcer_IMPROVE_TESTS-STPPGKMLZMMP35I7IYC3BJFSM5FR665OYVQGY7GQ7REZ2ZJBGHFA@3\windows-jdk9-m3.5.x_build\maven-enforcer-plugin\target\it\dependencies_not_converging_test_scope\build.log, f:\jenkins\jenkins-slave\workspace\aven-enforcer_IMPROVE_TESTS-STPPGKMLZMMP35I7IYC3BJFSM5FR665OYVQGY7GQ7REZ2ZJBGHFA@3\windows-jdk9-m3.5.x_build\maven-enforcer-plugin\target\it\display-info\build.log, f:\jenkins\jenkins-slave\workspace\aven-enforcer_IMPROVE_TESTS-STPPGKMLZMMP35I7IYC3BJFSM5FR665OYVQGY7GQ7REZ2ZJBGHFA@3\windows-jdk9-m3.5.x_build\maven-enforcer-plugin\target\it\evaluate-beanshell\build.log, f:\jenkins\jenkins-slave\workspace\aven-enforcer_IMPROVE_TESTS-STPPGKMLZMMP35I7IYC3BJFSM5FR665OYVQGY7GQ7REZ2ZJBGHFA@3\windows-jdk9-m3.5.x_build\maven-enforcer-plugin\target\it\multimodule\build.log, f:\jenkins\jenkins-slave\workspace\aven-enforcer_IMPROVE_TESTS-STPPGKMLZMMP35I7IYC3BJFSM5FR665OYVQGY7GQ7REZ2ZJBGHFA@3\windows-jdk9-m3.5.x_build\maven-enforcer-plugin\target\it\require-active-profile-all\build.log, f:\jenkins\jenkins-slave\workspace\aven-enforcer_IMPROVE_TESTS-STPPGKMLZMMP35I7IYC3BJFSM5FR665OYVQGY7GQ7REZ2ZJBGHFA@3\windows-jdk9-m3.5.x_build\maven-enforcer-plugin\target\it\require-active-profile-from-settings\build.log, f:\jenkins\jenkins-slave\workspace\aven-enforcer_IMPROVE_TESTS-STPPGKMLZMMP35I7IYC3BJFSM5FR665OYVQGY7GQ7REZ2ZJBGHFA@3\windows-jdk9-m3.5.x_build\maven-enforcer-plugin\target\it\require-active-profile\build.log, f:\jenkins\jenkins-slave\workspace\aven-enforcer_IMPROVE_TESTS-STPPGKMLZMMP35I7IYC3BJFSM5FR665OYVQGY7GQ7REZ2ZJBGHFA@3\windows-jdk9-m3.5.x_build\maven-enforcer-plugin\target\it\require-file-checksum\build.log, f:\jenkins\jenkins-slave\workspace\aven-enforcer_IMPROVE_TESTS-STPPGKMLZMMP35I7IYC3BJFSM5FR665OYVQGY7GQ7REZ2ZJBGHFA@3\windows-jdk9-m3.5.x_build\maven-enforcer-plugin\target\it\require-files-dont-exist\build.log, f:\jenkins\jenkins-slave\workspace\aven-enforcer_IMPROVE_TESTS-STPPGKMLZMMP35I7IYC3BJFSM5FR665OYVQGY7GQ7REZ2ZJBGHFA@3\windows-jdk9-m3.5.x_build\maven-enforcer-plugin\target\it\require-files-exist\build.log, f:\jenkins\jenkins-slave\workspace\aven-enforcer_IMPROVE_TESTS-STPPGKMLZMMP35I7IYC3BJFSM5FR665OYVQGY7GQ7REZ2ZJBGHFA@3\windows-jdk9-m3.5.x_build\maven-enforcer-plugin\target\it\require-files-size\build.log, f:\jenkins\jenkins-slave\workspace\aven-enforcer_IMPROVE_TESTS-STPPGKMLZMMP35I7IYC3BJFSM5FR665OYVQGY7GQ7REZ2ZJBGHFA@3\windows-jdk9-m3.5.x_build\maven-enforcer-plugin\target\it\require-java-version\build.log, f:\jenkins\jenkins-slave\workspace\aven-enforcer_IMPROVE_TESTS-STPPGKMLZMMP35I7IYC3BJFSM5FR665OYVQGY7GQ7REZ2ZJBGHFA@3\windows-jdk9-m3.5.x_build\maven-enforcer-plugin\target\it\require-maven-version\build.log, f:\jenkins\jenkins-slave\workspace\aven-enforcer_IMPROVE_TESTS-STPPGKMLZMMP35I7IYC3BJFSM5FR665OYVQGY7GQ7REZ2ZJBGHFA@3\windows-jdk9-m3.5.x_build\maven-enforcer-plugin\target\it\require-no-repositories-allow-plugin-repo\build.log, f:\jenkins\jenkins-slave\workspace\aven-enforcer_IMPROVE_TESTS-STPPGKMLZMMP35I7IYC3BJFSM5FR665OYVQGY7GQ7REZ2ZJBGHFA@3\windows-jdk9-m3.5.x_build\maven-enforcer-plugin\target\it\require-no-repositories-allow-repo\build.log, f:\jenkins\jenkins-slave\workspace\aven-enforcer_IMPROVE_TESTS-STPPGKMLZMMP35I7IYC3BJFSM5FR665OYVQGY7GQ7REZ2ZJBGHFA@3\windows-jdk9-m3.5.x_build\maven-enforcer-plugin\target\it\require-no-repositories\build.log, f:\jenkins\jenkins-slave\workspace\aven-enforcer_IMPROVE_TESTS-STPPGKMLZMMP35I7IYC3BJFSM5FR665OYVQGY7GQ7REZ2ZJBGHFA@3\windows-jdk9-m3.5.x_build\maven-enforcer-plugin\target\it\require-no-repositories_failure\build.log, f:\jenkins\jenkins-slave\workspace\aven-enforcer_IMPROVE_TESTS-STPPGKMLZMMP35I7IYC3BJFSM5FR665OYVQGY7GQ7REZ2ZJBGHFA@3\windows-jdk9-m3.5.x_build\maven-enforcer-plugin\target\it\require-no-repositories_failure_allowed-plugin-repo\build.log, f:\jenkins\jenkins-slave\workspace\aven-enforcer_IMPROVE_TESTS-STPPGKMLZMMP35I7IYC3BJFSM5FR665OYVQGY7GQ7REZ2ZJBGHFA@3\windows-jdk9-m3.5.x_build\maven-enforcer-plugin\target\it\require-no-repositories_failure_plugin-repositories\build.log, f:\jenkins\jenkins-slave\workspace\aven-enforcer_IMPROVE_TESTS-STPPGKMLZMMP35I7IYC3BJFSM5FR665OYVQGY7GQ7REZ2ZJBGHFA@3\windows-jdk9-m3.5.x_build\maven-enforcer-plugin\target\it\require-no-repositories_failure_repositories\build.log, f:\jenkins\jenkins-slave\workspace\aven-enforcer_IMPROVE_TESTS-STPPGKMLZMMP35I7IYC3BJFSM5FR665OYVQGY7GQ7REZ2ZJBGHFA@3\windows-jdk9-m3.5.x_build\maven-enforcer-plugin\target\it\require-no-repositories_mm\build.log, f:\jenkins\jenkins-slave\workspace\aven-enforcer_IMPROVE_TESTS-STPPGKMLZMMP35I7IYC3BJFSM5FR665OYVQGY7GQ7REZ2ZJBGHFA@3\windows-jdk9-m3.5.x_build\maven-enforcer-plugin\target\it\require-no-repositories_mm_ci\build.log, f:\jenkins\jenkins-slave\workspace\aven-enforcer_IMPROVE_TESTS-STPPGKMLZMMP35I7IYC3BJFSM5FR665OYVQGY7GQ7REZ2ZJBGHFA@3\windows-jdk9-m3.5.x_build\maven-enforcer-plugin\target\it\require-plugin-versions-ci\build.log, f:\jenkins\jenkins-slave\workspace\aven-enforcer_IMPROVE_TESTS-STPPGKMLZMMP35I7IYC3BJFSM5FR665OYVQGY7GQ7REZ2ZJBGHFA@3\windows-jdk9-m3.5.x_build\maven-enforcer-plugin\target\it\require-plugin-versions-custom-packaging\build.log, f:\jenkins\jenkins-slave\workspace\aven-enforcer_IMPROVE_TESTS-STPPGKMLZMMP35I7IYC3BJFSM5FR665OYVQGY7GQ7REZ2ZJBGHFA@3\windows-jdk9-m3.5.x_build\maven-enforcer-plugin\target\it\require-plugin-versions-expressions\build.log, f:\jenkins\jenkins-slave\workspace\aven-enforcer_IMPROVE_TESTS-STPPGKMLZMMP35I7IYC3BJFSM5FR665OYVQGY7GQ7REZ2ZJBGHFA@3\windows-jdk9-m3.5.x_build\maven-enforcer-plugin\target\it\require-plugin-versions-mm-ci-friendly\build.log, f:\jenkins\jenkins-slave\workspace\aven-enforcer_IMPROVE_TESTS-STPPGKMLZMMP35I7IYC3BJFSM5FR665OYVQGY7GQ7REZ2ZJBGHFA@3\windows-jdk9-m3.5.x_build\maven-enforcer-plugin\target\it\require-plugin-versions-plugin-with-extensions\build.log, f:\jenkins\jenkins-slave\workspace\aven-enforcer_IMPROVE_TESTS-STPPGKMLZMMP35I7IYC3BJFSM5FR665OYVQGY7GQ7REZ2ZJBGHFA@3\windows-jdk9-m3.5.x_build\maven-enforcer-plugin\target\it\require-plugin-versions-plugin-with-integration-test-lifecycle\build.log, f:\jenkins\jenkins-slave\workspace\aven-enforcer_IMPROVE_TESTS-STPPGKMLZMMP35I7IYC3BJFSM5FR665OYVQGY7GQ7REZ2ZJBGHFA@3\windows-jdk9-m3.5.x_build\maven-enforcer-plugin\target\it\require-plugin-versions-projectGAVexpressions\build.log, f:\jenkins\jenkins-slave\workspace\aven-enforcer_IMPROVE_TESTS-STPPGKMLZMMP35I7IYC3BJFSM5FR665OYVQGY7GQ7REZ2ZJBGHFA@3\windows-jdk9-m3.5.x_build\maven-enforcer-plugin\target\it\require-plugin-versions\build.log, f:\jenkins\jenkins-slave\workspace\aven-enforcer_IMPROVE_TESTS-STPPGKMLZMMP35I7IYC3BJFSM5FR665OYVQGY7GQ7REZ2ZJBGHFA@3\windows-jdk9-m3.5.x_build\maven-enforcer-plugin\target\it\require-profile-ids-exist_failure\build.log, f:\jenkins\jenkins-slave\workspace\aven-enforcer_IMPROVE_TESTS-STPPGKMLZMMP35I7IYC3BJFSM5FR665OYVQGY7GQ7REZ2ZJBGHFA@3\windows-jdk9-m3.5.x_build\maven-enforcer-plugin\target\it\require-profile-ids-exist_success\build.log, f:\jenkins\jenkins-slave\workspace\aven-enforcer_IMPROVE_TESTS-STPPGKMLZMMP35I7IYC3BJFSM5FR665OYVQGY7GQ7REZ2ZJBGHFA@3\windows-jdk9-m3.5.x_build\maven-enforcer-plugin\target\it\require-property\build.log, f:\jenkins\jenkins-slave\workspace\aven-enforcer_IMPROVE_TESTS-STPPGKMLZMMP35I7IYC3BJFSM5FR665OYVQGY7GQ7REZ2ZJBGHFA@3\windows-jdk9-m3.5.x_build\maven-enforcer-plugin\target\it\require-release-dependencies-excludes\build.log, f:\jenkins\jenkins-slave\workspace\aven-enforcer_IMPROVE_TESTS-STPPGKMLZMMP35I7IYC3BJFSM5FR665OYVQGY7GQ7REZ2ZJBGHFA@3\windows-jdk9-m3.5.x_build\maven-enforcer-plugin\target\it\require-release-dependencies-excludes_failure\build.log, f:\jenkins\jenkins-slave\workspace\aven-enforcer_IMPROVE_TESTS-STPPGKMLZMMP35I7IYC3BJFSM5FR665OYVQGY7GQ7REZ2ZJBGHFA@3\windows-jdk9-m3.5.x_build\maven-enforcer-plugin\target\it\require-release-dependencies\build.log, f:\jenkins\jenkins-slave\workspace\aven-enforcer_IMPROVE_TESTS-STPPGKMLZMMP35I7IYC3BJFSM5FR665OYVQGY7GQ7REZ2ZJBGHFA@3\windows-jdk9-m3.5.x_build\maven-enforcer-plugin\target\it\require-release-version\build.log, f:\jenkins\jenkins-slave\workspace\aven-enforcer_IMPROVE_TESTS-STPPGKMLZMMP35I7IYC3BJFSM5FR665OYVQGY7GQ7REZ2ZJBGHFA@3\windows-jdk9-m3.5.x_build\maven-enforcer-plugin\target\it\require-same-versions_failure\build.log, f:\jenkins\jenkins-slave\workspace\aven-enforcer_IMPROVE_TESTS-STPPGKMLZMMP35I7IYC3BJFSM5FR665OYVQGY7GQ7REZ2ZJBGHFA@3\windows-jdk9-m3.5.x_build\maven-enforcer-plugin\target\it\require-same-versions_success\build.log, f:\jenkins\jenkins-slave\workspace\aven-enforcer_IMPROVE_TESTS-STPPGKMLZMMP35I7IYC3BJFSM5FR665OYVQGY7GQ7REZ2ZJBGHFA@3\windows-jdk9-m3.5.x_build\maven-enforcer-plugin\target\it\require-snapshot-version_failure\build.log, f:\jenkins\jenkins-slave\workspace\aven-enforcer_IMPROVE_TESTS-STPPGKMLZMMP35I7IYC3BJFSM5FR665OYVQGY7GQ7REZ2ZJBGHFA@3\windows-jdk9-m3.5.x_build\maven-enforcer-plugin\target\it\require-snapshot-version_success\build.log, f:\jenkins\jenkins-slave\workspace\aven-enforcer_IMPROVE_TESTS-STPPGKMLZMMP35I7IYC3BJFSM5FR665OYVQGY7GQ7REZ2ZJBGHFA@3\windows-jdk9-m3.5.x_build\maven-enforcer-plugin\target\it\require-upper-bound-dependencies-managed_failure\build.log, f:\jenkins\jenkins-slave\workspace\aven-enforcer_IMPROVE_TESTS-STPPGKMLZMMP35I7IYC3BJFSM5FR665OYVQGY7GQ7REZ2ZJBGHFA@3\windows-jdk9-m3.5.x_build\maven-enforcer-plugin\target\it\require-upper-bound-dependencies-managed_success\build.log, f:\jenkins\jenkins-slave\workspace\aven-enforcer_IMPROVE_TESTS-STPPGKMLZMMP35I7IYC3BJFSM5FR665OYVQGY7GQ7REZ2ZJBGHFA@3\windows-jdk9-m3.5.x_build\maven-enforcer-plugin\target\it\require-upper-bound-dependencies-unique_failure\build.log, f:\jenkins\jenkins-slave\workspace\aven-enforcer_IMPROVE_TESTS-STPPGKMLZMMP35I7IYC3BJFSM5FR665OYVQGY7GQ7REZ2ZJBGHFA@3\windows-jdk9-m3.5.x_build\maven-enforcer-plugin\target\it\require-upper-bound-dependencies-unique_success\build.log, f:\jenkins\jenkins-slave\workspace\aven-enforcer_IMPROVE_TESTS-STPPGKMLZMMP35I7IYC3BJFSM5FR665OYVQGY7GQ7REZ2ZJBGHFA@3\windows-jdk9-m3.5.x_build\maven-enforcer-plugin\target\it\require-upper-bound-deps_failure\build.log, f:\jenkins\jenkins-slave\workspace\aven-enforcer_IMPROVE_TESTS-STPPGKMLZMMP35I7IYC3BJFSM5FR665OYVQGY7GQ7REZ2ZJBGHFA@3\windows-jdk9-m3.5.x_build\maven-enforcer-plugin\target\it\require-upper-bound-deps_ignored\build.log, f:\jenkins\jenkins-slave\workspace\aven-enforcer_IMPROVE_TESTS-STPPGKMLZMMP35I7IYC3BJFSM5FR665OYVQGY7GQ7REZ2ZJBGHFA@3\windows-jdk9-m3.5.x_build\maven-enforcer-plugin\target\it\require-upper-bound-deps_success\build.log, f:\jenkins\jenkins-slave\workspace\aven-enforcer_IMPROVE_TESTS-STPPGKMLZMMP35I7IYC3BJFSM5FR665OYVQGY7GQ7REZ2ZJBGHFA@3\windows-jdk9-m3.5.x_build\maven-enforcer-plugin\target\it\resolve_collect_dependencies\build.log]
[windows-jdk9-m3.5.x_build] Finished parsing Maven Invoker results (found 68)
[windows-jdk9-m3.5.x_build] [withMaven] junitPublisher - Archive test results for Maven artifact org.apache.maven.enforcer:enforcer-api:3.0.0-SNAPSHOT generated by maven-surefire-plugin:test (default-test): windows-jdk9-m3.5.x_build\enforcer-api\target\surefire-reports\*.xml
[windows-jdk9-m3.5.x_build] Recording test results
[windows-jdk9-m3.5.x_build] None of the test reports contained any result
[windows-jdk9-m3.5.x_build] [withMaven] junitPublisher - Archive test results for Maven artifact org.apache.maven.enforcer:enforcer-rules:3.0.0-SNAPSHOT generated by maven-surefire-plugin:test (default-test): windows-jdk9-m3.5.x_build\enforcer-rules\target\surefire-reports\*.xml
[windows-jdk9-m3.5.x_build] Recording test results
[windows-jdk9-m3.5.x_build] [withMaven] junitPublisher - Archive test results for Maven artifact org.apache.maven.plugins:maven-enforcer-plugin:3.0.0-SNAPSHOT generated by maven-surefire-plugin:test (default-test): windows-jdk9-m3.5.x_build\maven-enforcer-plugin\target\surefire-reports\*.xml
[windows-jdk9-m3.5.x_build] Recording test results
[windows-jdk9-m3.5.x_build] [withMaven] openTasksPublisher - Scan Tasks for Maven artifact org.apache.maven.enforcer:enforcer-api:3.0.0-SNAPSHOT in source directory windows-jdk9-m3.5.x_build\enforcer-api\src\main\java
[windows-jdk9-m3.5.x_build] [withMaven] openTasksPublisher - Scan Tasks for Maven artifact org.apache.maven.enforcer:enforcer-rules:3.0.0-SNAPSHOT in source directory windows-jdk9-m3.5.x_build\enforcer-rules\src\main\java
[windows-jdk9-m3.5.x_build] [withMaven] openTasksPublisher - Scan Tasks for Maven artifact org.apache.maven.plugins:maven-enforcer-plugin:3.0.0-SNAPSHOT in source directory windows-jdk9-m3.5.x_build\maven-enforcer-plugin\src\main\java
[windows-jdk9-m3.5.x_build] [TASKS] Scanning folder 'f:\jenkins\jenkins-slave\workspace\aven-enforcer_IMPROVE_TESTS-STPPGKMLZMMP35I7IYC3BJFSM5FR665OYVQGY7GQ7REZ2ZJBGHFA@3' for files matching the pattern 'windows-jdk9-m3.5.x_build\enforcer-api\src\main\java\**\*,windows-jdk9-m3.5.x_build\enforcer-rules\src\main\java\**\*,windows-jdk9-m3.5.x_build\maven-enforcer-plugin\src\main\java\**\*' - excludes: null
[windows-jdk9-m3.5.x_build] [TASKS] Found 51 files to scan for tasks
[windows-jdk9-m3.5.x_build] [TASKS] Found 5 open tasks.
[windows-jdk9-m3.5.x_build] Skipping warnings blame since pipelines do not have an SCM link.%n
[Pipeline] [windows-jdk9-m3.5.x_build] // withMaven
[Pipeline] [windows-jdk9-m3.5.x_build] cleanWs
[windows-jdk9-m3.5.x_build] [WS-CLEANUP] Deleting project workspace...[WS-CLEANUP] done
[Pipeline] [windows-jdk9-m3.5.x_build] }
[Pipeline] [windows-jdk9-m3.5.x_build] // stage
[Pipeline] [windows-jdk9-m3.5.x_build] }
[Pipeline] [windows-jdk9-m3.5.x_build] // ws
[Pipeline] [windows-jdk9-m3.5.x_build] }
[Pipeline] [windows-jdk9-m3.5.x_build] // node
[Pipeline] [windows-jdk9-m3.5.x_build] }
[Pipeline] // parallel
[Pipeline] stage
[Pipeline] { (Notifications)
[Pipeline] echo
Build result: UNSTABLE
[Pipeline] jiraIssueSelector
[Pipeline] emailext
Mime
  • Unnamed multipart/mixed (inline, None, 0 bytes)
View raw message