maven-notifications mailing list archives

Site index · List index
Message view « Date » · « Thread »
Top « Date » · « Thread »
From Apache Jenkins Server <jenk...@builds.apache.org>
Subject Build unstable in Jenkins: Maven TLP » maven-enforcer » MENFORCER-288 #18
Date Fri, 02 Nov 2018 06:40:22 GMT
See https://builds.apache.org/job/maven-box/job/maven-enforcer/job/MENFORCER-288/18/

No changes.

5 tests failed.
FAILED:  org.apache.maven.plugins.enforcer.TestRequireEnvironmentVariable.testRuleWithRegex

Error Message:
This should not throw an exception

Stack Trace:
junit.framework.AssertionFailedError: This should not throw an exception
	at org.apache.maven.plugins.enforcer.TestRequireEnvironmentVariable.testRuleWithRegex(TestRequireEnvironmentVariable.java:107)


FAILED:  org.apache.maven.plugins.enforcer.TestRequireEnvironmentVariable.testRuleWithRegex

Error Message:
This should not throw an exception

Stack Trace:
junit.framework.AssertionFailedError: This should not throw an exception
	at org.apache.maven.plugins.enforcer.TestRequireEnvironmentVariable.testRuleWithRegex(TestRequireEnvironmentVariable.java:107)


FAILED:  org.apache.maven.plugins.enforcer.TestRequireEnvironmentVariable.testRuleWithRegex

Error Message:
This should not throw an exception

Stack Trace:
junit.framework.AssertionFailedError: This should not throw an exception
	at org.apache.maven.plugins.enforcer.TestRequireEnvironmentVariable.testRuleWithRegex(TestRequireEnvironmentVariable.java:107)


FAILED:  org.apache.maven.plugins.enforcer.TestRequireEnvironmentVariable.testRuleWithRegex

Error Message:
This should not throw an exception

Stack Trace:
junit.framework.AssertionFailedError: This should not throw an exception
	at org.apache.maven.plugins.enforcer.TestRequireEnvironmentVariable.testRuleWithRegex(TestRequireEnvironmentVariable.java:107)


FAILED:  org.apache.maven.plugins.enforcer.TestRequireJavaVersion.settingsTheJavaVersionAsNormalizedVersionShouldNotFail

Error Message:
Detected JDK Version: 9.0.4 is not in the allowed range 10.

Stack Trace:
org.apache.maven.enforcer.rule.api.EnforcerRuleException: Detected JDK Version: 9.0.4 is not in the allowed range 10.
	at org.apache.maven.plugins.enforcer.TestRequireJavaVersion.settingsTheJavaVersionAsNormalizedVersionShouldNotFail(TestRequireJavaVersion.java:84)




Build log:
[...truncated 3.09 MB...]
[windows-jdk8] [INFO] Building: require-release-dependencies\pom.xml
[windows-jdk9] [INFO]           require-same-versions_failure\pom.xml ............ SUCCESS (5.4 s)
[windows-jdk9] [INFO] Building: require-same-versions_success\pom.xml
[windows-jdk10] [INFO]           require-upper-bound-deps_success\pom.xml ......... SUCCESS (5.3 s)
[windows-jdk10] [INFO] Building: resolve_collect_dependencies\pom.xml
[windows-jdk8] [INFO]           require-release-dependencies\pom.xml ............. SUCCESS (5.2 s)
[windows-jdk8] [INFO] Building: require-release-dependencies-excludes\pom.xml
[windows-jdk9] [INFO]           require-same-versions_success\pom.xml ............ SUCCESS (6.1 s)
[windows-jdk9] [INFO] Building: require-snapshot-version_failure\pom.xml
[windows-jdk8] [INFO] snapshot org.apache.maven.plugins.enforcer.its:menforcer85_api:1.0-SNAPSHOT: checking for updates from apache-snapshots
[windows-jdk10] [INFO] run post-build script verify.groovy
[windows-jdk10] [INFO]           resolve_collect_dependencies\pom.xml ............. SUCCESS (6.4 s)
[windows-jdk10] [INFO] -------------------------------------------------
[windows-jdk10] [INFO] Build Summary:
[windows-jdk10] [INFO]   Passed: 68, Failed: 0, Errors: 0, Skipped: 0
[windows-jdk10] [INFO] -------------------------------------------------
[windows-jdk10] [INFO] 
[windows-jdk10] [INFO] --- mrm-maven-plugin:1.0.0:stop (default) @ maven-enforcer-plugin ---
[windows-jdk10] [INFO] Stopping Mock Repository Manager on http://localhost:59715
[windows-jdk10] [INFO] Mock Repository Manager http://localhost:59715 is stopped.
[windows-jdk10] [INFO] 
[windows-jdk10] [INFO] --- maven-checkstyle-plugin:3.0.0:check (checkstyle-check) @ maven-enforcer-plugin ---
[windows-jdk10] [INFO] ------------------------------------------------------------------------
[windows-jdk10] [INFO] Reactor Summary:
[windows-jdk10] [INFO] 
[windows-jdk10] [INFO] Apache Maven Enforcer .............................. SUCCESS [ 14.570 s]
[windows-jdk10] [INFO] Apache Maven Enforcer API .......................... SUCCESS [  4.173 s]
[windows-jdk10] [INFO] Apache Maven Enforcer Built-In Rules ............... SUCCESS [ 13.058 s]
[windows-jdk10] [INFO] Apache Maven Enforcer Plugin ....................... SUCCESS [05:06 min]
[windows-jdk10] [INFO] ------------------------------------------------------------------------
[windows-jdk10] [INFO] BUILD SUCCESS
[windows-jdk10] [INFO] ------------------------------------------------------------------------
[windows-jdk10] [INFO] Total time: 05:39 min
[windows-jdk10] [INFO] Finished at: 2018-11-02T06:38:58Z
[windows-jdk8] [INFO] snapshot org.apache.maven.plugins.enforcer.its:menforcer85_api:1.0-SNAPSHOT: checking for updates from Nexus
[windows-jdk8] [INFO] artifact org.apache.maven.plugins.enforcer.its.menforcer85_api:1.0-SNAPSHOT: checking for updates from central
[windows-jdk8] [INFO] org.apache.maven.plugins.enforcer.its.menforcer85_api.1.0-SNAPSHOT: checking for updates from central
[windows-jdk10] [INFO] Final Memory: 51M/177M
[windows-jdk10] [INFO] ------------------------------------------------------------------------
[windows-jdk10] [INFO] [jenkins-event-spy] Generated F:\jenkins\jenkins-slave\workspace\aven-enforcer_MENFORCER-288-GL5B4ERVFARMDDY5GUJ32NFJSOP7ZR6QLATDJG7AYHOHJMZGS6NA@tmp\withMaven2a56d438\maven-spy-20181102-063318-5815403844216667475817.log
[Pipeline] [windows-jdk10] }
[Pipeline] [windows-jdk10] // dir
[windows-jdk8] [INFO]           require-release-dependencies-excludes\pom.xml .... SUCCESS (5.6 s)
[windows-jdk8] [INFO] Building: require-release-dependencies-excludes_failure\pom.xml
[windows-jdk8] [INFO]           require-release-dependencies-excludes_failure\pom.xml SUCCESS (4.9 s)
[windows-jdk8] [INFO] Building: require-release-version\pom.xml
[windows-jdk9] [INFO]           require-snapshot-version_failure\pom.xml ......... SUCCESS (6.3 s)
[windows-jdk9] [INFO] Building: require-snapshot-version_success\pom.xml
[Pipeline] [windows-jdk10] }
[windows-jdk10] [withMaven] invokerPublisher - Archive invoker results for Maven artifact MavenArtifact{org.apache.maven.plugins:maven-enforcer-plugin::3.0.0-SNAPSHOT(version: 3.0.0-SNAPSHOT, snapshot:false) } generated by PluginInvocation{org.apache.maven.plugins:maven-invoker-plugin:3.0.1@run  integration-test}: m\maven-enforcer-plugin\target\invoker-reports\*.xml
[windows-jdk10] performing MavenInvokerRecorder, reportsFilenamePattern:'**/m\maven-enforcer-plugin\target\invoker-reports/BUILD*.xml', invokerBuildDir:'**/m\maven-enforcer-plugin\target\it'
[windows-jdk10] Found reports:[f:\jenkins\jenkins-slave\workspace\aven-enforcer_MENFORCER-288-GL5B4ERVFARMDDY5GUJ32NFJSOP7ZR6QLATDJG7AYHOHJMZGS6NA\m\maven-enforcer-plugin\target\invoker-reports\BUILD-always-fail-warn.xml, f:\jenkins\jenkins-slave\workspace\aven-enforcer_MENFORCER-288-GL5B4ERVFARMDDY5GUJ32NFJSOP7ZR6QLATDJG7AYHOHJMZGS6NA\m\maven-enforcer-plugin\target\invoker-reports\BUILD-always-fail.xml, f:\jenkins\jenkins-slave\workspace\aven-enforcer_MENFORCER-288-GL5B4ERVFARMDDY5GUJ32NFJSOP7ZR6QLATDJG7AYHOHJMZGS6NA\m\maven-enforcer-plugin\target\invoker-reports\BUILD-always-pass.xml, f:\jenkins\jenkins-slave\workspace\aven-enforcer_MENFORCER-288-GL5B4ERVFARMDDY5GUJ32NFJSOP7ZR6QLATDJG7AYHOHJMZGS6NA\m\maven-enforcer-plugin\target\invoker-reports\BUILD-ban-distribution-management-multi-module-build.xml, f:\jenkins\jenkins-slave\workspace\aven-enforcer_MENFORCER-288-GL5B4ERVFARMDDY5GUJ32NFJSOP7ZR6QLATDJG7AYHOHJMZGS6NA\m\maven-enforcer-plugin\target\invoker-reports\BUILD-ban-distribution-management-multi-module-except-site.xml, f:\jenkins\jenkins-slave\workspace\aven-enforcer_MENFORCER-288-GL5B4ERVFARMDDY5GUJ32NFJSOP7ZR6QLATDJG7AYHOHJMZGS6NA\m\maven-enforcer-plugin\target\invoker-reports\BUILD-ban-distribution-management.xml, f:\jenkins\jenkins-slave\workspace\aven-enforcer_MENFORCER-288-GL5B4ERVFARMDDY5GUJ32NFJSOP7ZR6QLATDJG7AYHOHJMZGS6NA\m\maven-enforcer-plugin\target\invoker-reports\BUILD-ban-pom-dependency-version.xml, f:\jenkins\jenkins-slave\workspace\aven-enforcer_MENFORCER-288-GL5B4ERVFARMDDY5GUJ32NFJSOP7ZR6QLATDJG7AYHOHJMZGS6NA\m\maven-enforcer-plugin\target\invoker-reports\BUILD-ban-transitive-dependencies-fail.xml, f:\jenkins\jenkins-slave\workspace\aven-enforcer_MENFORCER-288-GL5B4ERVFARMDDY5GUJ32NFJSOP7ZR6QLATDJG7AYHOHJMZGS6NA\m\maven-enforcer-plugin\target\invoker-reports\BUILD-ban-transitive-dependencies.xml, f:\jenkins\jenkins-slave\workspace\aven-enforcer_MENFORCER-288-GL5B4ERVFARMDDY5GUJ32NFJSOP7ZR6QLATDJG7AYHOHJMZGS6NA\m\maven-enforcer-plugin\target\invoker-reports\BUILD-banned-dependencies-versionrange-fail.xml, f:\jenkins\jenkins-slave\workspace\aven-enforcer_MENFORCER-288-GL5B4ERVFARMDDY5GUJ32NFJSOP7ZR6QLATDJG7AYHOHJMZGS6NA\m\maven-enforcer-plugin\target\invoker-reports\BUILD-banned-dependencies-versionrange.xml, f:\jenkins\jenkins-slave\workspace\aven-enforcer_MENFORCER-288-GL5B4ERVFARMDDY5GUJ32NFJSOP7ZR6QLATDJG7AYHOHJMZGS6NA\m\maven-enforcer-plugin\target\invoker-reports\BUILD-banned-dependencies-wildcards.xml, f:\jenkins\jenkins-slave\workspace\aven-enforcer_MENFORCER-288-GL5B4ERVFARMDDY5GUJ32NFJSOP7ZR6QLATDJG7AYHOHJMZGS6NA\m\maven-enforcer-plugin\target\invoker-reports\BUILD-banned-dependencies.xml, f:\jenkins\jenkins-slave\workspace\aven-enforcer_MENFORCER-288-GL5B4ERVFARMDDY5GUJ32NFJSOP7ZR6QLATDJG7AYHOHJMZGS6NA\m\maven-enforcer-plugin\target\invoker-reports\BUILD-banned-plugins.xml, f:\jenkins\jenkins-slave\workspace\aven-enforcer_MENFORCER-288-GL5B4ERVFARMDDY5GUJ32NFJSOP7ZR6QLATDJG7AYHOHJMZGS6NA\m\maven-enforcer-plugin\target\invoker-reports\BUILD-builds_a_pom_noop.xml, f:\jenkins\jenkins-slave\workspace\aven-enforcer_MENFORCER-288-GL5B4ERVFARMDDY5GUJ32NFJSOP7ZR6QLATDJG7AYHOHJMZGS6NA\m\maven-enforcer-plugin\target\invoker-reports\BUILD-cli-always-fail.xml, f:\jenkins\jenkins-slave\workspace\aven-enforcer_MENFORCER-288-GL5B4ERVFARMDDY5GUJ32NFJSOP7ZR6QLATDJG7AYHOHJMZGS6NA\m\maven-enforcer-plugin\target\invoker-reports\BUILD-cli-always-pass.xml, f:\jenkins\jenkins-slave\workspace\aven-enforcer_MENFORCER-288-GL5B4ERVFARMDDY5GUJ32NFJSOP7ZR6QLATDJG7AYHOHJMZGS6NA\m\maven-enforcer-plugin\target\invoker-reports\BUILD-dependencies_converge.xml, f:\jenkins\jenkins-slave\workspace\aven-enforcer_MENFORCER-288-GL5B4ERVFARMDDY5GUJ32NFJSOP7ZR6QLATDJG7AYHOHJMZGS6NA\m\maven-enforcer-plugin\target\invoker-reports\BUILD-dependencies_not_converging.xml, f:\jenkins\jenkins-slave\workspace\aven-enforcer_MENFORCER-288-GL5B4ERVFARMDDY5GUJ32NFJSOP7ZR6QLATDJG7AYHOHJMZGS6NA\m\maven-enforcer-plugin\target\invoker-reports\BUILD-dependencies_not_converging_test_scope.xml, f:\jenkins\jenkins-slave\workspace\aven-enforcer_MENFORCER-288-GL5B4ERVFARMDDY5GUJ32NFJSOP7ZR6QLATDJG7AYHOHJMZGS6NA\m\maven-enforcer-plugin\target\invoker-reports\BUILD-display-info.xml, f:\jenkins\jenkins-slave\workspace\aven-enforcer_MENFORCER-288-GL5B4ERVFARMDDY5GUJ32NFJSOP7ZR6QLATDJG7AYHOHJMZGS6NA\m\maven-enforcer-plugin\target\invoker-reports\BUILD-evaluate-beanshell.xml, f:\jenkins\jenkins-slave\workspace\aven-enforcer_MENFORCER-288-GL5B4ERVFARMDDY5GUJ32NFJSOP7ZR6QLATDJG7AYHOHJMZGS6NA\m\maven-enforcer-plugin\target\invoker-reports\BUILD-multimodule.xml, f:\jenkins\jenkins-slave\workspace\aven-enforcer_MENFORCER-288-GL5B4ERVFARMDDY5GUJ32NFJSOP7ZR6QLATDJG7AYHOHJMZGS6NA\m\maven-enforcer-plugin\target\invoker-reports\BUILD-require-active-profile-all.xml, f:\jenkins\jenkins-slave\workspace\aven-enforcer_MENFORCER-288-GL5B4ERVFARMDDY5GUJ32NFJSOP7ZR6QLATDJG7AYHOHJMZGS6NA\m\maven-enforcer-plugin\target\invoker-reports\BUILD-require-active-profile-from-settings.xml, f:\jenkins\jenkins-slave\workspace\aven-enforcer_MENFORCER-288-GL5B4ERVFARMDDY5GUJ32NFJSOP7ZR6QLATDJG7AYHOHJMZGS6NA\m\maven-enforcer-plugin\target\invoker-reports\BUILD-require-active-profile.xml, f:\jenkins\jenkins-slave\workspace\aven-enforcer_MENFORCER-288-GL5B4ERVFARMDDY5GUJ32NFJSOP7ZR6QLATDJG7AYHOHJMZGS6NA\m\maven-enforcer-plugin\target\invoker-reports\BUILD-require-file-checksum.xml, f:\jenkins\jenkins-slave\workspace\aven-enforcer_MENFORCER-288-GL5B4ERVFARMDDY5GUJ32NFJSOP7ZR6QLATDJG7AYHOHJMZGS6NA\m\maven-enforcer-plugin\target\invoker-reports\BUILD-require-files-dont-exist.xml, f:\jenkins\jenkins-slave\workspace\aven-enforcer_MENFORCER-288-GL5B4ERVFARMDDY5GUJ32NFJSOP7ZR6QLATDJG7AYHOHJMZGS6NA\m\maven-enforcer-plugin\target\invoker-reports\BUILD-require-files-exist.xml, f:\jenkins\jenkins-slave\workspace\aven-enforcer_MENFORCER-288-GL5B4ERVFARMDDY5GUJ32NFJSOP7ZR6QLATDJG7AYHOHJMZGS6NA\m\maven-enforcer-plugin\target\invoker-reports\BUILD-require-files-size.xml, f:\jenkins\jenkins-slave\workspace\aven-enforcer_MENFORCER-288-GL5B4ERVFARMDDY5GUJ32NFJSOP7ZR6QLATDJG7AYHOHJMZGS6NA\m\maven-enforcer-plugin\target\invoker-reports\BUILD-require-java-version.xml, f:\jenkins\jenkins-slave\workspace\aven-enforcer_MENFORCER-288-GL5B4ERVFARMDDY5GUJ32NFJSOP7ZR6QLATDJG7AYHOHJMZGS6NA\m\maven-enforcer-plugin\target\invoker-reports\BUILD-require-maven-version.xml, f:\jenkins\jenkins-slave\workspace\aven-enforcer_MENFORCER-288-GL5B4ERVFARMDDY5GUJ32NFJSOP7ZR6QLATDJG7AYHOHJMZGS6NA\m\maven-enforcer-plugin\target\invoker-reports\BUILD-require-no-repositories-allow-plugin-repo.xml, f:\jenkins\jenkins-slave\workspace\aven-enforcer_MENFORCER-288-GL5B4ERVFARMDDY5GUJ32NFJSOP7ZR6QLATDJG7AYHOHJMZGS6NA\m\maven-enforcer-plugin\target\invoker-reports\BUILD-require-no-repositories-allow-repo.xml, f:\jenkins\jenkins-slave\workspace\aven-enforcer_MENFORCER-288-GL5B4ERVFARMDDY5GUJ32NFJSOP7ZR6QLATDJG7AYHOHJMZGS6NA\m\maven-enforcer-plugin\target\invoker-reports\BUILD-require-no-repositories.xml, f:\jenkins\jenkins-slave\workspace\aven-enforcer_MENFORCER-288-GL5B4ERVFARMDDY5GUJ32NFJSOP7ZR6QLATDJG7AYHOHJMZGS6NA\m\maven-enforcer-plugin\target\invoker-reports\BUILD-require-no-repositories_failure.xml, f:\jenkins\jenkins-slave\workspace\aven-enforcer_MENFORCER-288-GL5B4ERVFARMDDY5GUJ32NFJSOP7ZR6QLATDJG7AYHOHJMZGS6NA\m\maven-enforcer-plugin\target\invoker-reports\BUILD-require-no-repositories_failure_allowed-plugin-repo.xml, f:\jenkins\jenkins-slave\workspace\aven-enforcer_MENFORCER-288-GL5B4ERVFARMDDY5GUJ32NFJSOP7ZR6QLATDJG7AYHOHJMZGS6NA\m\maven-enforcer-plugin\target\invoker-reports\BUILD-require-no-repositories_failure_plugin-repositories.xml, f:\jenkins\jenkins-slave\workspace\aven-enforcer_MENFORCER-288-GL5B4ERVFARMDDY5GUJ32NFJSOP7ZR6QLATDJG7AYHOHJMZGS6NA\m\maven-enforcer-plugin\target\invoker-reports\BUILD-require-no-repositories_failure_repositories.xml, f:\jenkins\jenkins-slave\workspace\aven-enforcer_MENFORCER-288-GL5B4ERVFARMDDY5GUJ32NFJSOP7ZR6QLATDJG7AYHOHJMZGS6NA\m\maven-enforcer-plugin\target\invoker-reports\BUILD-require-no-repositories_mm.xml, f:\jenkins\jenkins-slave\workspace\aven-enforcer_MENFORCER-288-GL5B4ERVFARMDDY5GUJ32NFJSOP7ZR6QLATDJG7AYHOHJMZGS6NA\m\maven-enforcer-plugin\target\invoker-reports\BUILD-require-no-repositories_mm_ci.xml, f:\jenkins\jenkins-slave\workspace\aven-enforcer_MENFORCER-288-GL5B4ERVFARMDDY5GUJ32NFJSOP7ZR6QLATDJG7AYHOHJMZGS6NA\m\maven-enforcer-plugin\target\invoker-reports\BUILD-require-plugin-versions-ci.xml, f:\jenkins\jenkins-slave\workspace\aven-enforcer_MENFORCER-288-GL5B4ERVFARMDDY5GUJ32NFJSOP7ZR6QLATDJG7AYHOHJMZGS6NA\m\maven-enforcer-plugin\target\invoker-reports\BUILD-require-plugin-versions-custom-packaging.xml, f:\jenkins\jenkins-slave\workspace\aven-enforcer_MENFORCER-288-GL5B4ERVFARMDDY5GUJ32NFJSOP7ZR6QLATDJG7AYHOHJMZGS6NA\m\maven-enforcer-plugin\target\invoker-reports\BUILD-require-plugin-versions-expressions.xml, f:\jenkins\jenkins-slave\workspace\aven-enforcer_MENFORCER-288-GL5B4ERVFARMDDY5GUJ32NFJSOP7ZR6QLATDJG7AYHOHJMZGS6NA\m\maven-enforcer-plugin\target\invoker-reports\BUILD-require-plugin-versions-mm-ci-friendly.xml, f:\jenkins\jenkins-slave\workspace\aven-enforcer_MENFORCER-288-GL5B4ERVFARMDDY5GUJ32NFJSOP7ZR6QLATDJG7AYHOHJMZGS6NA\m\maven-enforcer-plugin\target\invoker-reports\BUILD-require-plugin-versions-plugin-with-extensions.xml, f:\jenkins\jenkins-slave\workspace\aven-enforcer_MENFORCER-288-GL5B4ERVFARMDDY5GUJ32NFJSOP7ZR6QLATDJG7AYHOHJMZGS6NA\m\maven-enforcer-plugin\target\invoker-reports\BUILD-require-plugin-versions-plugin-with-integration-test-lifecycle.xml, f:\jenkins\jenkins-slave\workspace\aven-enforcer_MENFORCER-288-GL5B4ERVFARMDDY5GUJ32NFJSOP7ZR6QLATDJG7AYHOHJMZGS6NA\m\maven-enforcer-plugin\target\invoker-reports\BUILD-require-plugin-versions-projectGAVexpressions.xml, f:\jenkins\jenkins-slave\workspace\aven-enforcer_MENFORCER-288-GL5B4ERVFARMDDY5GUJ32NFJSOP7ZR6QLATDJG7AYHOHJMZGS6NA\m\maven-enforcer-plugin\target\invoker-reports\BUILD-require-plugin-versions.xml, f:\jenkins\jenkins-slave\workspace\aven-enforcer_MENFORCER-288-GL5B4ERVFARMDDY5GUJ32NFJSOP7ZR6QLATDJG7AYHOHJMZGS6NA\m\maven-enforcer-plugin\target\invoker-reports\BUILD-require-profile-ids-exist_failure.xml, f:\jenkins\jenkins-slave\workspace\aven-enforcer_MENFORCER-288-GL5B4ERVFARMDDY5GUJ32NFJSOP7ZR6QLATDJG7AYHOHJMZGS6NA\m\maven-enforcer-plugin\target\invoker-reports\BUILD-require-profile-ids-exist_success.xml, f:\jenkins\jenkins-slave\workspace\aven-enforcer_MENFORCER-288-GL5B4ERVFARMDDY5GUJ32NFJSOP7ZR6QLATDJG7AYHOHJMZGS6NA\m\maven-enforcer-plugin\target\invoker-reports\BUILD-require-property.xml, f:\jenkins\jenkins-slave\workspace\aven-enforcer_MENFORCER-288-GL5B4ERVFARMDDY5GUJ32NFJSOP7ZR6QLATDJG7AYHOHJMZGS6NA\m\maven-enforcer-plugin\target\invoker-reports\BUILD-require-release-dependencies-excludes.xml, f:\jenkins\jenkins-slave\workspace\aven-enforcer_MENFORCER-288-GL5B4ERVFARMDDY5GUJ32NFJSOP7ZR6QLATDJG7AYHOHJMZGS6NA\m\maven-enforcer-plugin\target\invoker-reports\BUILD-require-release-dependencies-excludes_failure.xml, f:\jenkins\jenkins-slave\workspace\aven-enforcer_MENFORCER-288-GL5B4ERVFARMDDY5GUJ32NFJSOP7ZR6QLATDJG7AYHOHJMZGS6NA\m\maven-enforcer-plugin\target\invoker-reports\BUILD-require-release-dependencies.xml, f:\jenkins\jenkins-slave\workspace\aven-enforcer_MENFORCER-288-GL5B4ERVFARMDDY5GUJ32NFJSOP7ZR6QLATDJG7AYHOHJMZGS6NA\m\maven-enforcer-plugin\target\invoker-reports\BUILD-require-release-version.xml, f:\jenkins\jenkins-slave\workspace\aven-enforcer_MENFORCER-288-GL5B4ERVFARMDDY5GUJ32NFJSOP7ZR6QLATDJG7AYHOHJMZGS6NA\m\maven-enforcer-plugin\target\invoker-reports\BUILD-require-same-versions_failure.xml, f:\jenkins\jenkins-slave\workspace\aven-enforcer_MENFORCER-288-GL5B4ERVFARMDDY5GUJ32NFJSOP7ZR6QLATDJG7AYHOHJMZGS6NA\m\maven-enforcer-plugin\target\invoker-reports\BUILD-require-same-versions_success.xml, f:\jenkins\jenkins-slave\workspace\aven-enforcer_MENFORCER-288-GL5B4ERVFARMDDY5GUJ32NFJSOP7ZR6QLATDJG7AYHOHJMZGS6NA\m\maven-enforcer-plugin\target\invoker-reports\BUILD-require-snapshot-version_failure.xml, f:\jenkins\jenkins-slave\workspace\aven-enforcer_MENFORCER-288-GL5B4ERVFARMDDY5GUJ32NFJSOP7ZR6QLATDJG7AYHOHJMZGS6NA\m\maven-enforcer-plugin\target\invoker-reports\BUILD-require-snapshot-version_success.xml, f:\jenkins\jenkins-slave\workspace\aven-enforcer_MENFORCER-288-GL5B4ERVFARMDDY5GUJ32NFJSOP7ZR6QLATDJG7AYHOHJMZGS6NA\m\maven-enforcer-plugin\target\invoker-reports\BUILD-require-upper-bound-dependencies-managed_failure.xml, f:\jenkins\jenkins-slave\workspace\aven-enforcer_MENFORCER-288-GL5B4ERVFARMDDY5GUJ32NFJSOP7ZR6QLATDJG7AYHOHJMZGS6NA\m\maven-enforcer-plugin\target\invoker-reports\BUILD-require-upper-bound-dependencies-managed_success.xml, f:\jenkins\jenkins-slave\workspace\aven-enforcer_MENFORCER-288-GL5B4ERVFARMDDY5GUJ32NFJSOP7ZR6QLATDJG7AYHOHJMZGS6NA\m\maven-enforcer-plugin\target\invoker-reports\BUILD-require-upper-bound-dependencies-unique_failure.xml, f:\jenkins\jenkins-slave\workspace\aven-enforcer_MENFORCER-288-GL5B4ERVFARMDDY5GUJ32NFJSOP7ZR6QLATDJG7AYHOHJMZGS6NA\m\maven-enforcer-plugin\target\invoker-reports\BUILD-require-upper-bound-dependencies-unique_success.xml, f:\jenkins\jenkins-slave\workspace\aven-enforcer_MENFORCER-288-GL5B4ERVFARMDDY5GUJ32NFJSOP7ZR6QLATDJG7AYHOHJMZGS6NA\m\maven-enforcer-plugin\target\invoker-reports\BUILD-require-upper-bound-deps_failure.xml, f:\jenkins\jenkins-slave\workspace\aven-enforcer_MENFORCER-288-GL5B4ERVFARMDDY5GUJ32NFJSOP7ZR6QLATDJG7AYHOHJMZGS6NA\m\maven-enforcer-plugin\target\invoker-reports\BUILD-require-upper-bound-deps_ignored.xml, f:\jenkins\jenkins-slave\workspace\aven-enforcer_MENFORCER-288-GL5B4ERVFARMDDY5GUJ32NFJSOP7ZR6QLATDJG7AYHOHJMZGS6NA\m\maven-enforcer-plugin\target\invoker-reports\BUILD-require-upper-bound-deps_success.xml, f:\jenkins\jenkins-slave\workspace\aven-enforcer_MENFORCER-288-GL5B4ERVFARMDDY5GUJ32NFJSOP7ZR6QLATDJG7AYHOHJMZGS6NA\m\maven-enforcer-plugin\target\invoker-reports\BUILD-resolve_collect_dependencies.xml]
[windows-jdk10] Found logs:[f:\jenkins\jenkins-slave\workspace\aven-enforcer_MENFORCER-288-GL5B4ERVFARMDDY5GUJ32NFJSOP7ZR6QLATDJG7AYHOHJMZGS6NA\m\maven-enforcer-plugin\target\it\always-fail-warn\build.log, f:\jenkins\jenkins-slave\workspace\aven-enforcer_MENFORCER-288-GL5B4ERVFARMDDY5GUJ32NFJSOP7ZR6QLATDJG7AYHOHJMZGS6NA\m\maven-enforcer-plugin\target\it\always-fail\build.log, f:\jenkins\jenkins-slave\workspace\aven-enforcer_MENFORCER-288-GL5B4ERVFARMDDY5GUJ32NFJSOP7ZR6QLATDJG7AYHOHJMZGS6NA\m\maven-enforcer-plugin\target\it\always-pass\build.log, f:\jenkins\jenkins-slave\workspace\aven-enforcer_MENFORCER-288-GL5B4ERVFARMDDY5GUJ32NFJSOP7ZR6QLATDJG7AYHOHJMZGS6NA\m\maven-enforcer-plugin\target\it\ban-distribution-management-multi-module-build\build.log, f:\jenkins\jenkins-slave\workspace\aven-enforcer_MENFORCER-288-GL5B4ERVFARMDDY5GUJ32NFJSOP7ZR6QLATDJG7AYHOHJMZGS6NA\m\maven-enforcer-plugin\target\it\ban-distribution-management-multi-module-except-site\build.log, f:\jenkins\jenkins-slave\workspace\aven-enforcer_MENFORCER-288-GL5B4ERVFARMDDY5GUJ32NFJSOP7ZR6QLATDJG7AYHOHJMZGS6NA\m\maven-enforcer-plugin\target\it\ban-distribution-management\build.log, f:\jenkins\jenkins-slave\workspace\aven-enforcer_MENFORCER-288-GL5B4ERVFARMDDY5GUJ32NFJSOP7ZR6QLATDJG7AYHOHJMZGS6NA\m\maven-enforcer-plugin\target\it\ban-pom-dependency-version\build.log, f:\jenkins\jenkins-slave\workspace\aven-enforcer_MENFORCER-288-GL5B4ERVFARMDDY5GUJ32NFJSOP7ZR6QLATDJG7AYHOHJMZGS6NA\m\maven-enforcer-plugin\target\it\ban-transitive-dependencies-fail\build.log, f:\jenkins\jenkins-slave\workspace\aven-enforcer_MENFORCER-288-GL5B4ERVFARMDDY5GUJ32NFJSOP7ZR6QLATDJG7AYHOHJMZGS6NA\m\maven-enforcer-plugin\target\it\ban-transitive-dependencies\build.log, f:\jenkins\jenkins-slave\workspace\aven-enforcer_MENFORCER-288-GL5B4ERVFARMDDY5GUJ32NFJSOP7ZR6QLATDJG7AYHOHJMZGS6NA\m\maven-enforcer-plugin\target\it\banned-dependencies-versionrange-fail\build.log, f:\jenkins\jenkins-slave\workspace\aven-enforcer_MENFORCER-288-GL5B4ERVFARMDDY5GUJ32NFJSOP7ZR6QLATDJG7AYHOHJMZGS6NA\m\maven-enforcer-plugin\target\it\banned-dependencies-versionrange\build.log, f:\jenkins\jenkins-slave\workspace\aven-enforcer_MENFORCER-288-GL5B4ERVFARMDDY5GUJ32NFJSOP7ZR6QLATDJG7AYHOHJMZGS6NA\m\maven-enforcer-plugin\target\it\banned-dependencies-wildcards\build.log, f:\jenkins\jenkins-slave\workspace\aven-enforcer_MENFORCER-288-GL5B4ERVFARMDDY5GUJ32NFJSOP7ZR6QLATDJG7AYHOHJMZGS6NA\m\maven-enforcer-plugin\target\it\banned-dependencies\build.log, f:\jenkins\jenkins-slave\workspace\aven-enforcer_MENFORCER-288-GL5B4ERVFARMDDY5GUJ32NFJSOP7ZR6QLATDJG7AYHOHJMZGS6NA\m\maven-enforcer-plugin\target\it\banned-plugins\build.log, f:\jenkins\jenkins-slave\workspace\aven-enforcer_MENFORCER-288-GL5B4ERVFARMDDY5GUJ32NFJSOP7ZR6QLATDJG7AYHOHJMZGS6NA\m\maven-enforcer-plugin\target\it\builds_a_pom_noop\build.log, f:\jenkins\jenkins-slave\workspace\aven-enforcer_MENFORCER-288-GL5B4ERVFARMDDY5GUJ32NFJSOP7ZR6QLATDJG7AYHOHJMZGS6NA\m\maven-enforcer-plugin\target\it\cli-always-fail\build.log, f:\jenkins\jenkins-slave\workspace\aven-enforcer_MENFORCER-288-GL5B4ERVFARMDDY5GUJ32NFJSOP7ZR6QLATDJG7AYHOHJMZGS6NA\m\maven-enforcer-plugin\target\it\cli-always-pass\build.log, f:\jenkins\jenkins-slave\workspace\aven-enforcer_MENFORCER-288-GL5B4ERVFARMDDY5GUJ32NFJSOP7ZR6QLATDJG7AYHOHJMZGS6NA\m\maven-enforcer-plugin\target\it\dependencies_converge\build.log, f:\jenkins\jenkins-slave\workspace\aven-enforcer_MENFORCER-288-GL5B4ERVFARMDDY5GUJ32NFJSOP7ZR6QLATDJG7AYHOHJMZGS6NA\m\maven-enforcer-plugin\target\it\dependencies_not_converging\build.log, f:\jenkins\jenkins-slave\workspace\aven-enforcer_MENFORCER-288-GL5B4ERVFARMDDY5GUJ32NFJSOP7ZR6QLATDJG7AYHOHJMZGS6NA\m\maven-enforcer-plugin\target\it\dependencies_not_converging_test_scope\build.log, f:\jenkins\jenkins-slave\workspace\aven-enforcer_MENFORCER-288-GL5B4ERVFARMDDY5GUJ32NFJSOP7ZR6QLATDJG7AYHOHJMZGS6NA\m\maven-enforcer-plugin\target\it\display-info\build.log, f:\jenkins\jenkins-slave\workspace\aven-enforcer_MENFORCER-288-GL5B4ERVFARMDDY5GUJ32NFJSOP7ZR6QLATDJG7AYHOHJMZGS6NA\m\maven-enforcer-plugin\target\it\evaluate-beanshell\build.log, f:\jenkins\jenkins-slave\workspace\aven-enforcer_MENFORCER-288-GL5B4ERVFARMDDY5GUJ32NFJSOP7ZR6QLATDJG7AYHOHJMZGS6NA\m\maven-enforcer-plugin\target\it\multimodule\build.log, f:\jenkins\jenkins-slave\workspace\aven-enforcer_MENFORCER-288-GL5B4ERVFARMDDY5GUJ32NFJSOP7ZR6QLATDJG7AYHOHJMZGS6NA\m\maven-enforcer-plugin\target\it\require-active-profile-all\build.log, f:\jenkins\jenkins-slave\workspace\aven-enforcer_MENFORCER-288-GL5B4ERVFARMDDY5GUJ32NFJSOP7ZR6QLATDJG7AYHOHJMZGS6NA\m\maven-enforcer-plugin\target\it\require-active-profile-from-settings\build.log, f:\jenkins\jenkins-slave\workspace\aven-enforcer_MENFORCER-288-GL5B4ERVFARMDDY5GUJ32NFJSOP7ZR6QLATDJG7AYHOHJMZGS6NA\m\maven-enforcer-plugin\target\it\require-active-profile\build.log, f:\jenkins\jenkins-slave\workspace\aven-enforcer_MENFORCER-288-GL5B4ERVFARMDDY5GUJ32NFJSOP7ZR6QLATDJG7AYHOHJMZGS6NA\m\maven-enforcer-plugin\target\it\require-file-checksum\build.log, f:\jenkins\jenkins-slave\workspace\aven-enforcer_MENFORCER-288-GL5B4ERVFARMDDY5GUJ32NFJSOP7ZR6QLATDJG7AYHOHJMZGS6NA\m\maven-enforcer-plugin\target\it\require-files-dont-exist\build.log, f:\jenkins\jenkins-slave\workspace\aven-enforcer_MENFORCER-288-GL5B4ERVFARMDDY5GUJ32NFJSOP7ZR6QLATDJG7AYHOHJMZGS6NA\m\maven-enforcer-plugin\target\it\require-files-exist\build.log, f:\jenkins\jenkins-slave\workspace\aven-enforcer_MENFORCER-288-GL5B4ERVFARMDDY5GUJ32NFJSOP7ZR6QLATDJG7AYHOHJMZGS6NA\m\maven-enforcer-plugin\target\it\require-files-size\build.log, f:\jenkins\jenkins-slave\workspace\aven-enforcer_MENFORCER-288-GL5B4ERVFARMDDY5GUJ32NFJSOP7ZR6QLATDJG7AYHOHJMZGS6NA\m\maven-enforcer-plugin\target\it\require-java-version\build.log, f:\jenkins\jenkins-slave\workspace\aven-enforcer_MENFORCER-288-GL5B4ERVFARMDDY5GUJ32NFJSOP7ZR6QLATDJG7AYHOHJMZGS6NA\m\maven-enforcer-plugin\target\it\require-maven-version\build.log, f:\jenkins\jenkins-slave\workspace\aven-enforcer_MENFORCER-288-GL5B4ERVFARMDDY5GUJ32NFJSOP7ZR6QLATDJG7AYHOHJMZGS6NA\m\maven-enforcer-plugin\target\it\require-no-repositories-allow-plugin-repo\build.log, f:\jenkins\jenkins-slave\workspace\aven-enforcer_MENFORCER-288-GL5B4ERVFARMDDY5GUJ32NFJSOP7ZR6QLATDJG7AYHOHJMZGS6NA\m\maven-enforcer-plugin\target\it\require-no-repositories-allow-repo\build.log, f:\jenkins\jenkins-slave\workspace\aven-enforcer_MENFORCER-288-GL5B4ERVFARMDDY5GUJ32NFJSOP7ZR6QLATDJG7AYHOHJMZGS6NA\m\maven-enforcer-plugin\target\it\require-no-repositories\build.log, f:\jenkins\jenkins-slave\workspace\aven-enforcer_MENFORCER-288-GL5B4ERVFARMDDY5GUJ32NFJSOP7ZR6QLATDJG7AYHOHJMZGS6NA\m\maven-enforcer-plugin\target\it\require-no-repositories_failure\build.log, f:\jenkins\jenkins-slave\workspace\aven-enforcer_MENFORCER-288-GL5B4ERVFARMDDY5GUJ32NFJSOP7ZR6QLATDJG7AYHOHJMZGS6NA\m\maven-enforcer-plugin\target\it\require-no-repositories_failure_allowed-plugin-repo\build.log, f:\jenkins\jenkins-slave\workspace\aven-enforcer_MENFORCER-288-GL5B4ERVFARMDDY5GUJ32NFJSOP7ZR6QLATDJG7AYHOHJMZGS6NA\m\maven-enforcer-plugin\target\it\require-no-repositories_failure_plugin-repositories\build.log, f:\jenkins\jenkins-slave\workspace\aven-enforcer_MENFORCER-288-GL5B4ERVFARMDDY5GUJ32NFJSOP7ZR6QLATDJG7AYHOHJMZGS6NA\m\maven-enforcer-plugin\target\it\require-no-repositories_failure_repositories\build.log, f:\jenkins\jenkins-slave\workspace\aven-enforcer_MENFORCER-288-GL5B4ERVFARMDDY5GUJ32NFJSOP7ZR6QLATDJG7AYHOHJMZGS6NA\m\maven-enforcer-plugin\target\it\require-no-repositories_mm\build.log, f:\jenkins\jenkins-slave\workspace\aven-enforcer_MENFORCER-288-GL5B4ERVFARMDDY5GUJ32NFJSOP7ZR6QLATDJG7AYHOHJMZGS6NA\m\maven-enforcer-plugin\target\it\require-no-repositories_mm_ci\build.log, f:\jenkins\jenkins-slave\workspace\aven-enforcer_MENFORCER-288-GL5B4ERVFARMDDY5GUJ32NFJSOP7ZR6QLATDJG7AYHOHJMZGS6NA\m\maven-enforcer-plugin\target\it\require-plugin-versions-ci\build.log, f:\jenkins\jenkins-slave\workspace\aven-enforcer_MENFORCER-288-GL5B4ERVFARMDDY5GUJ32NFJSOP7ZR6QLATDJG7AYHOHJMZGS6NA\m\maven-enforcer-plugin\target\it\require-plugin-versions-custom-packaging\build.log, f:\jenkins\jenkins-slave\workspace\aven-enforcer_MENFORCER-288-GL5B4ERVFARMDDY5GUJ32NFJSOP7ZR6QLATDJG7AYHOHJMZGS6NA\m\maven-enforcer-plugin\target\it\require-plugin-versions-expressions\build.log, f:\jenkins\jenkins-slave\workspace\aven-enforcer_MENFORCER-288-GL5B4ERVFARMDDY5GUJ32NFJSOP7ZR6QLATDJG7AYHOHJMZGS6NA\m\maven-enforcer-plugin\target\it\require-plugin-versions-mm-ci-friendly\build.log, f:\jenkins\jenkins-slave\workspace\aven-enforcer_MENFORCER-288-GL5B4ERVFARMDDY5GUJ32NFJSOP7ZR6QLATDJG7AYHOHJMZGS6NA\m\maven-enforcer-plugin\target\it\require-plugin-versions-plugin-with-extensions\build.log, f:\jenkins\jenkins-slave\workspace\aven-enforcer_MENFORCER-288-GL5B4ERVFARMDDY5GUJ32NFJSOP7ZR6QLATDJG7AYHOHJMZGS6NA\m\maven-enforcer-plugin\target\it\require-plugin-versions-plugin-with-integration-test-lifecycle\build.log, f:\jenkins\jenkins-slave\workspace\aven-enforcer_MENFORCER-288-GL5B4ERVFARMDDY5GUJ32NFJSOP7ZR6QLATDJG7AYHOHJMZGS6NA\m\maven-enforcer-plugin\target\it\require-plugin-versions-projectGAVexpressions\build.log, f:\jenkins\jenkins-slave\workspace\aven-enforcer_MENFORCER-288-GL5B4ERVFARMDDY5GUJ32NFJSOP7ZR6QLATDJG7AYHOHJMZGS6NA\m\maven-enforcer-plugin\target\it\require-plugin-versions\build.log, f:\jenkins\jenkins-slave\workspace\aven-enforcer_MENFORCER-288-GL5B4ERVFARMDDY5GUJ32NFJSOP7ZR6QLATDJG7AYHOHJMZGS6NA\m\maven-enforcer-plugin\target\it\require-profile-ids-exist_failure\build.log, f:\jenkins\jenkins-slave\workspace\aven-enforcer_MENFORCER-288-GL5B4ERVFARMDDY5GUJ32NFJSOP7ZR6QLATDJG7AYHOHJMZGS6NA\m\maven-enforcer-plugin\target\it\require-profile-ids-exist_success\build.log, f:\jenkins\jenkins-slave\workspace\aven-enforcer_MENFORCER-288-GL5B4ERVFARMDDY5GUJ32NFJSOP7ZR6QLATDJG7AYHOHJMZGS6NA\m\maven-enforcer-plugin\target\it\require-property\build.log, f:\jenkins\jenkins-slave\workspace\aven-enforcer_MENFORCER-288-GL5B4ERVFARMDDY5GUJ32NFJSOP7ZR6QLATDJG7AYHOHJMZGS6NA\m\maven-enforcer-plugin\target\it\require-release-dependencies-excludes\build.log, f:\jenkins\jenkins-slave\workspace\aven-enforcer_MENFORCER-288-GL5B4ERVFARMDDY5GUJ32NFJSOP7ZR6QLATDJG7AYHOHJMZGS6NA\m\maven-enforcer-plugin\target\it\require-release-dependencies-excludes_failure\build.log, f:\jenkins\jenkins-slave\workspace\aven-enforcer_MENFORCER-288-GL5B4ERVFARMDDY5GUJ32NFJSOP7ZR6QLATDJG7AYHOHJMZGS6NA\m\maven-enforcer-plugin\target\it\require-release-dependencies\build.log, f:\jenkins\jenkins-slave\workspace\aven-enforcer_MENFORCER-288-GL5B4ERVFARMDDY5GUJ32NFJSOP7ZR6QLATDJG7AYHOHJMZGS6NA\m\maven-enforcer-plugin\target\it\require-release-version\build.log, f:\jenkins\jenkins-slave\workspace\aven-enforcer_MENFORCER-288-GL5B4ERVFARMDDY5GUJ32NFJSOP7ZR6QLATDJG7AYHOHJMZGS6NA\m\maven-enforcer-plugin\target\it\require-same-versions_failure\build.log, f:\jenkins\jenkins-slave\workspace\aven-enforcer_MENFORCER-288-GL5B4ERVFARMDDY5GUJ32NFJSOP7ZR6QLATDJG7AYHOHJMZGS6NA\m\maven-enforcer-plugin\target\it\require-same-versions_success\build.log, f:\jenkins\jenkins-slave\workspace\aven-enforcer_MENFORCER-288-GL5B4ERVFARMDDY5GUJ32NFJSOP7ZR6QLATDJG7AYHOHJMZGS6NA\m\maven-enforcer-plugin\target\it\require-snapshot-version_failure\build.log, f:\jenkins\jenkins-slave\workspace\aven-enforcer_MENFORCER-288-GL5B4ERVFARMDDY5GUJ32NFJSOP7ZR6QLATDJG7AYHOHJMZGS6NA\m\maven-enforcer-plugin\target\it\require-snapshot-version_success\build.log, f:\jenkins\jenkins-slave\workspace\aven-enforcer_MENFORCER-288-GL5B4ERVFARMDDY5GUJ32NFJSOP7ZR6QLATDJG7AYHOHJMZGS6NA\m\maven-enforcer-plugin\target\it\require-upper-bound-dependencies-managed_failure\build.log, f:\jenkins\jenkins-slave\workspace\aven-enforcer_MENFORCER-288-GL5B4ERVFARMDDY5GUJ32NFJSOP7ZR6QLATDJG7AYHOHJMZGS6NA\m\maven-enforcer-plugin\target\it\require-upper-bound-dependencies-managed_success\build.log, f:\jenkins\jenkins-slave\workspace\aven-enforcer_MENFORCER-288-GL5B4ERVFARMDDY5GUJ32NFJSOP7ZR6QLATDJG7AYHOHJMZGS6NA\m\maven-enforcer-plugin\target\it\require-upper-bound-dependencies-unique_failure\build.log, f:\jenkins\jenkins-slave\workspace\aven-enforcer_MENFORCER-288-GL5B4ERVFARMDDY5GUJ32NFJSOP7ZR6QLATDJG7AYHOHJMZGS6NA\m\maven-enforcer-plugin\target\it\require-upper-bound-dependencies-unique_success\build.log, f:\jenkins\jenkins-slave\workspace\aven-enforcer_MENFORCER-288-GL5B4ERVFARMDDY5GUJ32NFJSOP7ZR6QLATDJG7AYHOHJMZGS6NA\m\maven-enforcer-plugin\target\it\require-upper-bound-deps_failure\build.log, f:\jenkins\jenkins-slave\workspace\aven-enforcer_MENFORCER-288-GL5B4ERVFARMDDY5GUJ32NFJSOP7ZR6QLATDJG7AYHOHJMZGS6NA\m\maven-enforcer-plugin\target\it\require-upper-bound-deps_ignored\build.log, f:\jenkins\jenkins-slave\workspace\aven-enforcer_MENFORCER-288-GL5B4ERVFARMDDY5GUJ32NFJSOP7ZR6QLATDJG7AYHOHJMZGS6NA\m\maven-enforcer-plugin\target\it\require-upper-bound-deps_success\build.log, f:\jenkins\jenkins-slave\workspace\aven-enforcer_MENFORCER-288-GL5B4ERVFARMDDY5GUJ32NFJSOP7ZR6QLATDJG7AYHOHJMZGS6NA\m\maven-enforcer-plugin\target\it\resolve_collect_dependencies\build.log]
[windows-jdk10] Finished parsing Maven Invoker results (found 68)
[windows-jdk10] [withMaven] junitPublisher - Archive test results for Maven artifact org.apache.maven.enforcer:enforcer-api:3.0.0-SNAPSHOT generated by maven-surefire-plugin:test (default-test): m\enforcer-api\target\surefire-reports\*.xml
[windows-jdk10] Recording test results
[windows-jdk10] None of the test reports contained any result
[windows-jdk10] [withMaven] junitPublisher - Archive test results for Maven artifact org.apache.maven.enforcer:enforcer-rules:3.0.0-SNAPSHOT generated by maven-surefire-plugin:test (default-test): m\enforcer-rules\target\surefire-reports\*.xml
[windows-jdk10] Recording test results
[windows-jdk10] [withMaven] junitPublisher - Archive test results for Maven artifact org.apache.maven.plugins:maven-enforcer-plugin:3.0.0-SNAPSHOT generated by maven-surefire-plugin:test (default-test): m\maven-enforcer-plugin\target\surefire-reports\*.xml
[windows-jdk10] Recording test results
[Pipeline] [windows-jdk10] // withMaven
[Pipeline] [windows-jdk10] cleanWs
[windows-jdk10] [WS-CLEANUP] Deleting project workspace...[WS-CLEANUP] done
[Pipeline] [windows-jdk10] }
[Pipeline] [windows-jdk10] // stage
[Pipeline] [windows-jdk10] }
[Pipeline] [windows-jdk10] // node
[Pipeline] [windows-jdk10] }
[windows-jdk9] [INFO]           require-snapshot-version_success\pom.xml ......... SUCCESS (6.1 s)
[windows-jdk9] [INFO] Building: require-upper-bound-dependencies-managed_failure\pom.xml
[windows-jdk8] [INFO]           require-release-version\pom.xml .................. SUCCESS (5.3 s)
[windows-jdk8] [INFO] Building: require-same-versions_failure\pom.xml
[windows-jdk8] [INFO]           require-same-versions_failure\pom.xml ............ SUCCESS (5.7 s)
[windows-jdk8] [INFO] Building: require-same-versions_success\pom.xml
[windows-jdk9] [INFO] run post-build script verify.groovy
[windows-jdk9] [INFO]           require-upper-bound-dependencies-managed_failure\pom.xml SUCCESS (6.5 s)
[windows-jdk9] [INFO] Building: require-upper-bound-dependencies-managed_success\pom.xml
[windows-jdk8] [INFO]           require-same-versions_success\pom.xml ............ SUCCESS (5.3 s)
[windows-jdk8] [INFO] Building: require-snapshot-version_failure\pom.xml
[windows-jdk9] [INFO]           require-upper-bound-dependencies-managed_success\pom.xml SUCCESS (6.4 s)
[windows-jdk9] [INFO] Building: require-upper-bound-dependencies-unique_failure\pom.xml
[windows-jdk8] [INFO]           require-snapshot-version_failure\pom.xml ......... SUCCESS (4.9 s)
[windows-jdk8] [INFO] Building: require-snapshot-version_success\pom.xml
[windows-jdk9] [INFO] snapshot org.apache.maven.plugins.enforcer.its:menforcer134_project:1.0-SNAPSHOT: checking for updates from apache-snapshots
[windows-jdk9] [INFO] snapshot org.apache.maven.plugins.enforcer.its:menforcer134_project:1.0-SNAPSHOT: checking for updates from Nexus
[windows-jdk9] [INFO] artifact org.apache.maven.plugins.enforcer.its.menforcer134_project:1.0-SNAPSHOT: checking for updates from central
[windows-jdk9] [INFO] org.apache.maven.plugins.enforcer.its.menforcer134_project.1.0-SNAPSHOT: checking for updates from central
[windows-jdk9] [INFO] snapshot org.apache.maven.plugins.enforcer.its:menforcer134_modelbuilder:1.0-SNAPSHOT: checking for updates from apache-snapshots
[windows-jdk9] [INFO] snapshot org.apache.maven.plugins.enforcer.its:menforcer134_modelbuilder:1.0-SNAPSHOT: checking for updates from Nexus
[windows-jdk9] [INFO] artifact org.apache.maven.plugins.enforcer.its.menforcer134_modelbuilder:1.0-SNAPSHOT: checking for updates from central
[windows-jdk9] [INFO] org.apache.maven.plugins.enforcer.its.menforcer134_modelbuilder.1.0-SNAPSHOT: checking for updates from central
[windows-jdk9] [INFO] snapshot org.apache.maven.plugins.enforcer.its:menforcer134_model:1.0-SNAPSHOT: checking for updates from apache-snapshots
[windows-jdk9] [INFO] snapshot org.apache.maven.plugins.enforcer.its:menforcer134_model:1.0-SNAPSHOT: checking for updates from Nexus
[windows-jdk9] [INFO] artifact org.apache.maven.plugins.enforcer.its.menforcer134_model:1.0-SNAPSHOT: checking for updates from central
[windows-jdk9] [INFO] org.apache.maven.plugins.enforcer.its.menforcer134_model.1.0-SNAPSHOT: checking for updates from central
[windows-jdk8] [INFO]           require-snapshot-version_success\pom.xml ......... SUCCESS (4.8 s)
[windows-jdk8] [INFO] Building: require-upper-bound-dependencies-managed_failure\pom.xml
[windows-jdk9] [INFO] run post-build script verify.groovy
[windows-jdk9] [INFO]           require-upper-bound-dependencies-unique_failure\pom.xml SUCCESS (9.1 s)
[windows-jdk9] [INFO] Building: require-upper-bound-dependencies-unique_success\pom.xml
[windows-jdk8] [INFO] run post-build script verify.groovy
[windows-jdk8] [INFO]           require-upper-bound-dependencies-managed_failure\pom.xml SUCCESS (5.0 s)
[windows-jdk8] [INFO] Building: require-upper-bound-dependencies-managed_success\pom.xml
[windows-jdk9] [INFO]           require-upper-bound-dependencies-unique_success\pom.xml SUCCESS (6.6 s)
[windows-jdk9] [INFO] Building: require-upper-bound-deps_failure\pom.xml
[windows-jdk8] [INFO]           require-upper-bound-dependencies-managed_success\pom.xml SUCCESS (5.0 s)
[windows-jdk8] [INFO] Building: require-upper-bound-dependencies-unique_failure\pom.xml
[windows-jdk9] [INFO] run post-build script verify.groovy
[windows-jdk9] [INFO]           require-upper-bound-deps_failure\pom.xml ......... SUCCESS (6.1 s)
[windows-jdk9] [INFO] Building: require-upper-bound-deps_ignored\pom.xml
[windows-jdk8] [INFO] snapshot org.apache.maven.plugins.enforcer.its:menforcer134_project:1.0-SNAPSHOT: checking for updates from apache-snapshots
[windows-jdk8] [INFO] snapshot org.apache.maven.plugins.enforcer.its:menforcer134_project:1.0-SNAPSHOT: checking for updates from Nexus
[windows-jdk8] [INFO] artifact org.apache.maven.plugins.enforcer.its.menforcer134_project:1.0-SNAPSHOT: checking for updates from central
[windows-jdk8] [INFO] org.apache.maven.plugins.enforcer.its.menforcer134_project.1.0-SNAPSHOT: checking for updates from central
[windows-jdk8] [INFO] snapshot org.apache.maven.plugins.enforcer.its:menforcer134_modelbuilder:1.0-SNAPSHOT: checking for updates from apache-snapshots
[windows-jdk8] [INFO] snapshot org.apache.maven.plugins.enforcer.its:menforcer134_modelbuilder:1.0-SNAPSHOT: checking for updates from Nexus
[windows-jdk8] [INFO] artifact org.apache.maven.plugins.enforcer.its.menforcer134_modelbuilder:1.0-SNAPSHOT: checking for updates from central
[windows-jdk8] [INFO] org.apache.maven.plugins.enforcer.its.menforcer134_modelbuilder.1.0-SNAPSHOT: checking for updates from central
[windows-jdk8] [INFO] snapshot org.apache.maven.plugins.enforcer.its:menforcer134_model:1.0-SNAPSHOT: checking for updates from apache-snapshots
[windows-jdk8] [INFO] snapshot org.apache.maven.plugins.enforcer.its:menforcer134_model:1.0-SNAPSHOT: checking for updates from Nexus
[windows-jdk8] [INFO] artifact org.apache.maven.plugins.enforcer.its.menforcer134_model:1.0-SNAPSHOT: checking for updates from central
[windows-jdk8] [INFO] org.apache.maven.plugins.enforcer.its.menforcer134_model.1.0-SNAPSHOT: checking for updates from central
[windows-jdk8] [INFO] run post-build script verify.groovy
[windows-jdk8] [INFO]           require-upper-bound-dependencies-unique_failure\pom.xml SUCCESS (6.5 s)
[windows-jdk8] [INFO] Building: require-upper-bound-dependencies-unique_success\pom.xml
[windows-jdk9] [INFO] run post-build script verify.groovy
[windows-jdk9] [INFO]           require-upper-bound-deps_ignored\pom.xml ......... SUCCESS (6.0 s)
[windows-jdk9] [INFO] Building: require-upper-bound-deps_success\pom.xml
[windows-jdk8] [INFO]           require-upper-bound-dependencies-unique_success\pom.xml SUCCESS (5.0 s)
[windows-jdk8] [INFO] Building: require-upper-bound-deps_failure\pom.xml
[windows-jdk9] [INFO]           require-upper-bound-deps_success\pom.xml ......... SUCCESS (5.0 s)
[windows-jdk9] [INFO] Building: resolve_collect_dependencies\pom.xml
[windows-jdk8] [INFO] run post-build script verify.groovy
[windows-jdk8] [INFO]           require-upper-bound-deps_failure\pom.xml ......... SUCCESS (5.0 s)
[windows-jdk8] [INFO] Building: require-upper-bound-deps_ignored\pom.xml
[windows-jdk8] [INFO] run post-build script verify.groovy
[windows-jdk8] [INFO]           require-upper-bound-deps_ignored\pom.xml ......... SUCCESS (5.2 s)
[windows-jdk8] [INFO] Building: require-upper-bound-deps_success\pom.xml
[windows-jdk9] [INFO] run post-build script verify.groovy
[windows-jdk9] [INFO]           resolve_collect_dependencies\pom.xml ............. SUCCESS (7.1 s)
[windows-jdk9] [INFO] -------------------------------------------------
[windows-jdk9] [INFO] Build Summary:
[windows-jdk9] [INFO]   Passed: 68, Failed: 0, Errors: 0, Skipped: 0
[windows-jdk9] [INFO] -------------------------------------------------
[windows-jdk9] [INFO] 
[windows-jdk9] [INFO] --- mrm-maven-plugin:1.0.0:stop (default) @ maven-enforcer-plugin ---
[windows-jdk9] [INFO] Stopping Mock Repository Manager on http://localhost:63535
[windows-jdk9] [INFO] Mock Repository Manager http://localhost:63535 is stopped.
[windows-jdk9] [INFO] 
[windows-jdk9] [INFO] --- maven-checkstyle-plugin:3.0.0:check (checkstyle-check) @ maven-enforcer-plugin ---
[windows-jdk9] [INFO] ------------------------------------------------------------------------
[windows-jdk9] [INFO] Reactor Summary:
[windows-jdk9] [INFO] 
[windows-jdk9] [INFO] Apache Maven Enforcer .............................. SUCCESS [ 17.669 s]
[windows-jdk9] [INFO] Apache Maven Enforcer API .......................... SUCCESS [  4.522 s]
[windows-jdk9] [INFO] Apache Maven Enforcer Built-In Rules ............... SUCCESS [ 13.964 s]
[windows-jdk9] [INFO] Apache Maven Enforcer Plugin ....................... SUCCESS [06:44 min]
[windows-jdk9] [INFO] ------------------------------------------------------------------------
[windows-jdk9] [INFO] BUILD SUCCESS
[windows-jdk9] [INFO] ------------------------------------------------------------------------
[windows-jdk9] [INFO] Total time: 07:22 min
[windows-jdk9] [INFO] Finished at: 2018-11-02T06:40:01Z
[windows-jdk9] [INFO] Final Memory: 51M/169M
[windows-jdk9] [INFO] ------------------------------------------------------------------------
[windows-jdk9] [INFO] [jenkins-event-spy] Generated F:\jenkins\jenkins-slave\workspace\aven-enforcer_MENFORCER-288-GL5B4ERVFARMDDY5GUJ32NFJSOP7ZR6QLATDJG7AYHOHJMZGS6NA@tmp\withMavenbb41a17b\maven-spy-20181102-063238-95514234452614880870588.log
[Pipeline] [windows-jdk9] }
[Pipeline] [windows-jdk9] // dir
[windows-jdk8] [INFO]           require-upper-bound-deps_success\pom.xml ......... SUCCESS (4.7 s)
[windows-jdk8] [INFO] Building: resolve_collect_dependencies\pom.xml
[Pipeline] [windows-jdk9] }
[windows-jdk9] [withMaven] invokerPublisher - Archive invoker results for Maven artifact MavenArtifact{org.apache.maven.plugins:maven-enforcer-plugin::3.0.0-SNAPSHOT(version: 3.0.0-SNAPSHOT, snapshot:false) } generated by PluginInvocation{org.apache.maven.plugins:maven-invoker-plugin:3.0.1@run  integration-test}: m\maven-enforcer-plugin\target\invoker-reports\*.xml
[windows-jdk9] performing MavenInvokerRecorder, reportsFilenamePattern:'**/m\maven-enforcer-plugin\target\invoker-reports/BUILD*.xml', invokerBuildDir:'**/m\maven-enforcer-plugin\target\it'
[windows-jdk9] Found reports:[f:\jenkins\jenkins-slave\workspace\aven-enforcer_MENFORCER-288-GL5B4ERVFARMDDY5GUJ32NFJSOP7ZR6QLATDJG7AYHOHJMZGS6NA\m\maven-enforcer-plugin\target\invoker-reports\BUILD-always-fail-warn.xml, f:\jenkins\jenkins-slave\workspace\aven-enforcer_MENFORCER-288-GL5B4ERVFARMDDY5GUJ32NFJSOP7ZR6QLATDJG7AYHOHJMZGS6NA\m\maven-enforcer-plugin\target\invoker-reports\BUILD-always-fail.xml, f:\jenkins\jenkins-slave\workspace\aven-enforcer_MENFORCER-288-GL5B4ERVFARMDDY5GUJ32NFJSOP7ZR6QLATDJG7AYHOHJMZGS6NA\m\maven-enforcer-plugin\target\invoker-reports\BUILD-always-pass.xml, f:\jenkins\jenkins-slave\workspace\aven-enforcer_MENFORCER-288-GL5B4ERVFARMDDY5GUJ32NFJSOP7ZR6QLATDJG7AYHOHJMZGS6NA\m\maven-enforcer-plugin\target\invoker-reports\BUILD-ban-distribution-management-multi-module-build.xml, f:\jenkins\jenkins-slave\workspace\aven-enforcer_MENFORCER-288-GL5B4ERVFARMDDY5GUJ32NFJSOP7ZR6QLATDJG7AYHOHJMZGS6NA\m\maven-enforcer-plugin\target\invoker-reports\BUILD-ban-distribution-management-multi-module-except-site.xml, f:\jenkins\jenkins-slave\workspace\aven-enforcer_MENFORCER-288-GL5B4ERVFARMDDY5GUJ32NFJSOP7ZR6QLATDJG7AYHOHJMZGS6NA\m\maven-enforcer-plugin\target\invoker-reports\BUILD-ban-distribution-management.xml, f:\jenkins\jenkins-slave\workspace\aven-enforcer_MENFORCER-288-GL5B4ERVFARMDDY5GUJ32NFJSOP7ZR6QLATDJG7AYHOHJMZGS6NA\m\maven-enforcer-plugin\target\invoker-reports\BUILD-ban-pom-dependency-version.xml, f:\jenkins\jenkins-slave\workspace\aven-enforcer_MENFORCER-288-GL5B4ERVFARMDDY5GUJ32NFJSOP7ZR6QLATDJG7AYHOHJMZGS6NA\m\maven-enforcer-plugin\target\invoker-reports\BUILD-ban-transitive-dependencies-fail.xml, f:\jenkins\jenkins-slave\workspace\aven-enforcer_MENFORCER-288-GL5B4ERVFARMDDY5GUJ32NFJSOP7ZR6QLATDJG7AYHOHJMZGS6NA\m\maven-enforcer-plugin\target\invoker-reports\BUILD-ban-transitive-dependencies.xml, f:\jenkins\jenkins-slave\workspace\aven-enforcer_MENFORCER-288-GL5B4ERVFARMDDY5GUJ32NFJSOP7ZR6QLATDJG7AYHOHJMZGS6NA\m\maven-enforcer-plugin\target\invoker-reports\BUILD-banned-dependencies-versionrange-fail.xml, f:\jenkins\jenkins-slave\workspace\aven-enforcer_MENFORCER-288-GL5B4ERVFARMDDY5GUJ32NFJSOP7ZR6QLATDJG7AYHOHJMZGS6NA\m\maven-enforcer-plugin\target\invoker-reports\BUILD-banned-dependencies-versionrange.xml, f:\jenkins\jenkins-slave\workspace\aven-enforcer_MENFORCER-288-GL5B4ERVFARMDDY5GUJ32NFJSOP7ZR6QLATDJG7AYHOHJMZGS6NA\m\maven-enforcer-plugin\target\invoker-reports\BUILD-banned-dependencies-wildcards.xml, f:\jenkins\jenkins-slave\workspace\aven-enforcer_MENFORCER-288-GL5B4ERVFARMDDY5GUJ32NFJSOP7ZR6QLATDJG7AYHOHJMZGS6NA\m\maven-enforcer-plugin\target\invoker-reports\BUILD-banned-dependencies.xml, f:\jenkins\jenkins-slave\workspace\aven-enforcer_MENFORCER-288-GL5B4ERVFARMDDY5GUJ32NFJSOP7ZR6QLATDJG7AYHOHJMZGS6NA\m\maven-enforcer-plugin\target\invoker-reports\BUILD-banned-plugins.xml, f:\jenkins\jenkins-slave\workspace\aven-enforcer_MENFORCER-288-GL5B4ERVFARMDDY5GUJ32NFJSOP7ZR6QLATDJG7AYHOHJMZGS6NA\m\maven-enforcer-plugin\target\invoker-reports\BUILD-builds_a_pom_noop.xml, f:\jenkins\jenkins-slave\workspace\aven-enforcer_MENFORCER-288-GL5B4ERVFARMDDY5GUJ32NFJSOP7ZR6QLATDJG7AYHOHJMZGS6NA\m\maven-enforcer-plugin\target\invoker-reports\BUILD-cli-always-fail.xml, f:\jenkins\jenkins-slave\workspace\aven-enforcer_MENFORCER-288-GL5B4ERVFARMDDY5GUJ32NFJSOP7ZR6QLATDJG7AYHOHJMZGS6NA\m\maven-enforcer-plugin\target\invoker-reports\BUILD-cli-always-pass.xml, f:\jenkins\jenkins-slave\workspace\aven-enforcer_MENFORCER-288-GL5B4ERVFARMDDY5GUJ32NFJSOP7ZR6QLATDJG7AYHOHJMZGS6NA\m\maven-enforcer-plugin\target\invoker-reports\BUILD-dependencies_converge.xml, f:\jenkins\jenkins-slave\workspace\aven-enforcer_MENFORCER-288-GL5B4ERVFARMDDY5GUJ32NFJSOP7ZR6QLATDJG7AYHOHJMZGS6NA\m\maven-enforcer-plugin\target\invoker-reports\BUILD-dependencies_not_converging.xml, f:\jenkins\jenkins-slave\workspace\aven-enforcer_MENFORCER-288-GL5B4ERVFARMDDY5GUJ32NFJSOP7ZR6QLATDJG7AYHOHJMZGS6NA\m\maven-enforcer-plugin\target\invoker-reports\BUILD-dependencies_not_converging_test_scope.xml, f:\jenkins\jenkins-slave\workspace\aven-enforcer_MENFORCER-288-GL5B4ERVFARMDDY5GUJ32NFJSOP7ZR6QLATDJG7AYHOHJMZGS6NA\m\maven-enforcer-plugin\target\invoker-reports\BUILD-display-info.xml, f:\jenkins\jenkins-slave\workspace\aven-enforcer_MENFORCER-288-GL5B4ERVFARMDDY5GUJ32NFJSOP7ZR6QLATDJG7AYHOHJMZGS6NA\m\maven-enforcer-plugin\target\invoker-reports\BUILD-evaluate-beanshell.xml, f:\jenkins\jenkins-slave\workspace\aven-enforcer_MENFORCER-288-GL5B4ERVFARMDDY5GUJ32NFJSOP7ZR6QLATDJG7AYHOHJMZGS6NA\m\maven-enforcer-plugin\target\invoker-reports\BUILD-multimodule.xml, f:\jenkins\jenkins-slave\workspace\aven-enforcer_MENFORCER-288-GL5B4ERVFARMDDY5GUJ32NFJSOP7ZR6QLATDJG7AYHOHJMZGS6NA\m\maven-enforcer-plugin\target\invoker-reports\BUILD-require-active-profile-all.xml, f:\jenkins\jenkins-slave\workspace\aven-enforcer_MENFORCER-288-GL5B4ERVFARMDDY5GUJ32NFJSOP7ZR6QLATDJG7AYHOHJMZGS6NA\m\maven-enforcer-plugin\target\invoker-reports\BUILD-require-active-profile-from-settings.xml, f:\jenkins\jenkins-slave\workspace\aven-enforcer_MENFORCER-288-GL5B4ERVFARMDDY5GUJ32NFJSOP7ZR6QLATDJG7AYHOHJMZGS6NA\m\maven-enforcer-plugin\target\invoker-reports\BUILD-require-active-profile.xml, f:\jenkins\jenkins-slave\workspace\aven-enforcer_MENFORCER-288-GL5B4ERVFARMDDY5GUJ32NFJSOP7ZR6QLATDJG7AYHOHJMZGS6NA\m\maven-enforcer-plugin\target\invoker-reports\BUILD-require-file-checksum.xml, f:\jenkins\jenkins-slave\workspace\aven-enforcer_MENFORCER-288-GL5B4ERVFARMDDY5GUJ32NFJSOP7ZR6QLATDJG7AYHOHJMZGS6NA\m\maven-enforcer-plugin\target\invoker-reports\BUILD-require-files-dont-exist.xml, f:\jenkins\jenkins-slave\workspace\aven-enforcer_MENFORCER-288-GL5B4ERVFARMDDY5GUJ32NFJSOP7ZR6QLATDJG7AYHOHJMZGS6NA\m\maven-enforcer-plugin\target\invoker-reports\BUILD-require-files-exist.xml, f:\jenkins\jenkins-slave\workspace\aven-enforcer_MENFORCER-288-GL5B4ERVFARMDDY5GUJ32NFJSOP7ZR6QLATDJG7AYHOHJMZGS6NA\m\maven-enforcer-plugin\target\invoker-reports\BUILD-require-files-size.xml, f:\jenkins\jenkins-slave\workspace\aven-enforcer_MENFORCER-288-GL5B4ERVFARMDDY5GUJ32NFJSOP7ZR6QLATDJG7AYHOHJMZGS6NA\m\maven-enforcer-plugin\target\invoker-reports\BUILD-require-java-version.xml, f:\jenkins\jenkins-slave\workspace\aven-enforcer_MENFORCER-288-GL5B4ERVFARMDDY5GUJ32NFJSOP7ZR6QLATDJG7AYHOHJMZGS6NA\m\maven-enforcer-plugin\target\invoker-reports\BUILD-require-maven-version.xml, f:\jenkins\jenkins-slave\workspace\aven-enforcer_MENFORCER-288-GL5B4ERVFARMDDY5GUJ32NFJSOP7ZR6QLATDJG7AYHOHJMZGS6NA\m\maven-enforcer-plugin\target\invoker-reports\BUILD-require-no-repositories-allow-plugin-repo.xml, f:\jenkins\jenkins-slave\workspace\aven-enforcer_MENFORCER-288-GL5B4ERVFARMDDY5GUJ32NFJSOP7ZR6QLATDJG7AYHOHJMZGS6NA\m\maven-enforcer-plugin\target\invoker-reports\BUILD-require-no-repositories-allow-repo.xml, f:\jenkins\jenkins-slave\workspace\aven-enforcer_MENFORCER-288-GL5B4ERVFARMDDY5GUJ32NFJSOP7ZR6QLATDJG7AYHOHJMZGS6NA\m\maven-enforcer-plugin\target\invoker-reports\BUILD-require-no-repositories.xml, f:\jenkins\jenkins-slave\workspace\aven-enforcer_MENFORCER-288-GL5B4ERVFARMDDY5GUJ32NFJSOP7ZR6QLATDJG7AYHOHJMZGS6NA\m\maven-enforcer-plugin\target\invoker-reports\BUILD-require-no-repositories_failure.xml, f:\jenkins\jenkins-slave\workspace\aven-enforcer_MENFORCER-288-GL5B4ERVFARMDDY5GUJ32NFJSOP7ZR6QLATDJG7AYHOHJMZGS6NA\m\maven-enforcer-plugin\target\invoker-reports\BUILD-require-no-repositories_failure_allowed-plugin-repo.xml, f:\jenkins\jenkins-slave\workspace\aven-enforcer_MENFORCER-288-GL5B4ERVFARMDDY5GUJ32NFJSOP7ZR6QLATDJG7AYHOHJMZGS6NA\m\maven-enforcer-plugin\target\invoker-reports\BUILD-require-no-repositories_failure_plugin-repositories.xml, f:\jenkins\jenkins-slave\workspace\aven-enforcer_MENFORCER-288-GL5B4ERVFARMDDY5GUJ32NFJSOP7ZR6QLATDJG7AYHOHJMZGS6NA\m\maven-enforcer-plugin\target\invoker-reports\BUILD-require-no-repositories_failure_repositories.xml, f:\jenkins\jenkins-slave\workspace\aven-enforcer_MENFORCER-288-GL5B4ERVFARMDDY5GUJ32NFJSOP7ZR6QLATDJG7AYHOHJMZGS6NA\m\maven-enforcer-plugin\target\invoker-reports\BUILD-require-no-repositories_mm.xml, f:\jenkins\jenkins-slave\workspace\aven-enforcer_MENFORCER-288-GL5B4ERVFARMDDY5GUJ32NFJSOP7ZR6QLATDJG7AYHOHJMZGS6NA\m\maven-enforcer-plugin\target\invoker-reports\BUILD-require-no-repositories_mm_ci.xml, f:\jenkins\jenkins-slave\workspace\aven-enforcer_MENFORCER-288-GL5B4ERVFARMDDY5GUJ32NFJSOP7ZR6QLATDJG7AYHOHJMZGS6NA\m\maven-enforcer-plugin\target\invoker-reports\BUILD-require-plugin-versions-ci.xml, f:\jenkins\jenkins-slave\workspace\aven-enforcer_MENFORCER-288-GL5B4ERVFARMDDY5GUJ32NFJSOP7ZR6QLATDJG7AYHOHJMZGS6NA\m\maven-enforcer-plugin\target\invoker-reports\BUILD-require-plugin-versions-custom-packaging.xml, f:\jenkins\jenkins-slave\workspace\aven-enforcer_MENFORCER-288-GL5B4ERVFARMDDY5GUJ32NFJSOP7ZR6QLATDJG7AYHOHJMZGS6NA\m\maven-enforcer-plugin\target\invoker-reports\BUILD-require-plugin-versions-expressions.xml, f:\jenkins\jenkins-slave\workspace\aven-enforcer_MENFORCER-288-GL5B4ERVFARMDDY5GUJ32NFJSOP7ZR6QLATDJG7AYHOHJMZGS6NA\m\maven-enforcer-plugin\target\invoker-reports\BUILD-require-plugin-versions-mm-ci-friendly.xml, f:\jenkins\jenkins-slave\workspace\aven-enforcer_MENFORCER-288-GL5B4ERVFARMDDY5GUJ32NFJSOP7ZR6QLATDJG7AYHOHJMZGS6NA\m\maven-enforcer-plugin\target\invoker-reports\BUILD-require-plugin-versions-plugin-with-extensions.xml, f:\jenkins\jenkins-slave\workspace\aven-enforcer_MENFORCER-288-GL5B4ERVFARMDDY5GUJ32NFJSOP7ZR6QLATDJG7AYHOHJMZGS6NA\m\maven-enforcer-plugin\target\invoker-reports\BUILD-require-plugin-versions-plugin-with-integration-test-lifecycle.xml, f:\jenkins\jenkins-slave\workspace\aven-enforcer_MENFORCER-288-GL5B4ERVFARMDDY5GUJ32NFJSOP7ZR6QLATDJG7AYHOHJMZGS6NA\m\maven-enforcer-plugin\target\invoker-reports\BUILD-require-plugin-versions-projectGAVexpressions.xml, f:\jenkins\jenkins-slave\workspace\aven-enforcer_MENFORCER-288-GL5B4ERVFARMDDY5GUJ32NFJSOP7ZR6QLATDJG7AYHOHJMZGS6NA\m\maven-enforcer-plugin\target\invoker-reports\BUILD-require-plugin-versions.xml, f:\jenkins\jenkins-slave\workspace\aven-enforcer_MENFORCER-288-GL5B4ERVFARMDDY5GUJ32NFJSOP7ZR6QLATDJG7AYHOHJMZGS6NA\m\maven-enforcer-plugin\target\invoker-reports\BUILD-require-profile-ids-exist_failure.xml, f:\jenkins\jenkins-slave\workspace\aven-enforcer_MENFORCER-288-GL5B4ERVFARMDDY5GUJ32NFJSOP7ZR6QLATDJG7AYHOHJMZGS6NA\m\maven-enforcer-plugin\target\invoker-reports\BUILD-require-profile-ids-exist_success.xml, f:\jenkins\jenkins-slave\workspace\aven-enforcer_MENFORCER-288-GL5B4ERVFARMDDY5GUJ32NFJSOP7ZR6QLATDJG7AYHOHJMZGS6NA\m\maven-enforcer-plugin\target\invoker-reports\BUILD-require-property.xml, f:\jenkins\jenkins-slave\workspace\aven-enforcer_MENFORCER-288-GL5B4ERVFARMDDY5GUJ32NFJSOP7ZR6QLATDJG7AYHOHJMZGS6NA\m\maven-enforcer-plugin\target\invoker-reports\BUILD-require-release-dependencies-excludes.xml, f:\jenkins\jenkins-slave\workspace\aven-enforcer_MENFORCER-288-GL5B4ERVFARMDDY5GUJ32NFJSOP7ZR6QLATDJG7AYHOHJMZGS6NA\m\maven-enforcer-plugin\target\invoker-reports\BUILD-require-release-dependencies-excludes_failure.xml, f:\jenkins\jenkins-slave\workspace\aven-enforcer_MENFORCER-288-GL5B4ERVFARMDDY5GUJ32NFJSOP7ZR6QLATDJG7AYHOHJMZGS6NA\m\maven-enforcer-plugin\target\invoker-reports\BUILD-require-release-dependencies.xml, f:\jenkins\jenkins-slave\workspace\aven-enforcer_MENFORCER-288-GL5B4ERVFARMDDY5GUJ32NFJSOP7ZR6QLATDJG7AYHOHJMZGS6NA\m\maven-enforcer-plugin\target\invoker-reports\BUILD-require-release-version.xml, f:\jenkins\jenkins-slave\workspace\aven-enforcer_MENFORCER-288-GL5B4ERVFARMDDY5GUJ32NFJSOP7ZR6QLATDJG7AYHOHJMZGS6NA\m\maven-enforcer-plugin\target\invoker-reports\BUILD-require-same-versions_failure.xml, f:\jenkins\jenkins-slave\workspace\aven-enforcer_MENFORCER-288-GL5B4ERVFARMDDY5GUJ32NFJSOP7ZR6QLATDJG7AYHOHJMZGS6NA\m\maven-enforcer-plugin\target\invoker-reports\BUILD-require-same-versions_success.xml, f:\jenkins\jenkins-slave\workspace\aven-enforcer_MENFORCER-288-GL5B4ERVFARMDDY5GUJ32NFJSOP7ZR6QLATDJG7AYHOHJMZGS6NA\m\maven-enforcer-plugin\target\invoker-reports\BUILD-require-snapshot-version_failure.xml, f:\jenkins\jenkins-slave\workspace\aven-enforcer_MENFORCER-288-GL5B4ERVFARMDDY5GUJ32NFJSOP7ZR6QLATDJG7AYHOHJMZGS6NA\m\maven-enforcer-plugin\target\invoker-reports\BUILD-require-snapshot-version_success.xml, f:\jenkins\jenkins-slave\workspace\aven-enforcer_MENFORCER-288-GL5B4ERVFARMDDY5GUJ32NFJSOP7ZR6QLATDJG7AYHOHJMZGS6NA\m\maven-enforcer-plugin\target\invoker-reports\BUILD-require-upper-bound-dependencies-managed_failure.xml, f:\jenkins\jenkins-slave\workspace\aven-enforcer_MENFORCER-288-GL5B4ERVFARMDDY5GUJ32NFJSOP7ZR6QLATDJG7AYHOHJMZGS6NA\m\maven-enforcer-plugin\target\invoker-reports\BUILD-require-upper-bound-dependencies-managed_success.xml, f:\jenkins\jenkins-slave\workspace\aven-enforcer_MENFORCER-288-GL5B4ERVFARMDDY5GUJ32NFJSOP7ZR6QLATDJG7AYHOHJMZGS6NA\m\maven-enforcer-plugin\target\invoker-reports\BUILD-require-upper-bound-dependencies-unique_failure.xml, f:\jenkins\jenkins-slave\workspace\aven-enforcer_MENFORCER-288-GL5B4ERVFARMDDY5GUJ32NFJSOP7ZR6QLATDJG7AYHOHJMZGS6NA\m\maven-enforcer-plugin\target\invoker-reports\BUILD-require-upper-bound-dependencies-unique_success.xml, f:\jenkins\jenkins-slave\workspace\aven-enforcer_MENFORCER-288-GL5B4ERVFARMDDY5GUJ32NFJSOP7ZR6QLATDJG7AYHOHJMZGS6NA\m\maven-enforcer-plugin\target\invoker-reports\BUILD-require-upper-bound-deps_failure.xml, f:\jenkins\jenkins-slave\workspace\aven-enforcer_MENFORCER-288-GL5B4ERVFARMDDY5GUJ32NFJSOP7ZR6QLATDJG7AYHOHJMZGS6NA\m\maven-enforcer-plugin\target\invoker-reports\BUILD-require-upper-bound-deps_ignored.xml, f:\jenkins\jenkins-slave\workspace\aven-enforcer_MENFORCER-288-GL5B4ERVFARMDDY5GUJ32NFJSOP7ZR6QLATDJG7AYHOHJMZGS6NA\m\maven-enforcer-plugin\target\invoker-reports\BUILD-require-upper-bound-deps_success.xml, f:\jenkins\jenkins-slave\workspace\aven-enforcer_MENFORCER-288-GL5B4ERVFARMDDY5GUJ32NFJSOP7ZR6QLATDJG7AYHOHJMZGS6NA\m\maven-enforcer-plugin\target\invoker-reports\BUILD-resolve_collect_dependencies.xml]
[windows-jdk9] Found logs:[f:\jenkins\jenkins-slave\workspace\aven-enforcer_MENFORCER-288-GL5B4ERVFARMDDY5GUJ32NFJSOP7ZR6QLATDJG7AYHOHJMZGS6NA\m\maven-enforcer-plugin\target\it\always-fail-warn\build.log, f:\jenkins\jenkins-slave\workspace\aven-enforcer_MENFORCER-288-GL5B4ERVFARMDDY5GUJ32NFJSOP7ZR6QLATDJG7AYHOHJMZGS6NA\m\maven-enforcer-plugin\target\it\always-fail\build.log, f:\jenkins\jenkins-slave\workspace\aven-enforcer_MENFORCER-288-GL5B4ERVFARMDDY5GUJ32NFJSOP7ZR6QLATDJG7AYHOHJMZGS6NA\m\maven-enforcer-plugin\target\it\always-pass\build.log, f:\jenkins\jenkins-slave\workspace\aven-enforcer_MENFORCER-288-GL5B4ERVFARMDDY5GUJ32NFJSOP7ZR6QLATDJG7AYHOHJMZGS6NA\m\maven-enforcer-plugin\target\it\ban-distribution-management-multi-module-build\build.log, f:\jenkins\jenkins-slave\workspace\aven-enforcer_MENFORCER-288-GL5B4ERVFARMDDY5GUJ32NFJSOP7ZR6QLATDJG7AYHOHJMZGS6NA\m\maven-enforcer-plugin\target\it\ban-distribution-management-multi-module-except-site\build.log, f:\jenkins\jenkins-slave\workspace\aven-enforcer_MENFORCER-288-GL5B4ERVFARMDDY5GUJ32NFJSOP7ZR6QLATDJG7AYHOHJMZGS6NA\m\maven-enforcer-plugin\target\it\ban-distribution-management\build.log, f:\jenkins\jenkins-slave\workspace\aven-enforcer_MENFORCER-288-GL5B4ERVFARMDDY5GUJ32NFJSOP7ZR6QLATDJG7AYHOHJMZGS6NA\m\maven-enforcer-plugin\target\it\ban-pom-dependency-version\build.log, f:\jenkins\jenkins-slave\workspace\aven-enforcer_MENFORCER-288-GL5B4ERVFARMDDY5GUJ32NFJSOP7ZR6QLATDJG7AYHOHJMZGS6NA\m\maven-enforcer-plugin\target\it\ban-transitive-dependencies-fail\build.log, f:\jenkins\jenkins-slave\workspace\aven-enforcer_MENFORCER-288-GL5B4ERVFARMDDY5GUJ32NFJSOP7ZR6QLATDJG7AYHOHJMZGS6NA\m\maven-enforcer-plugin\target\it\ban-transitive-dependencies\build.log, f:\jenkins\jenkins-slave\workspace\aven-enforcer_MENFORCER-288-GL5B4ERVFARMDDY5GUJ32NFJSOP7ZR6QLATDJG7AYHOHJMZGS6NA\m\maven-enforcer-plugin\target\it\banned-dependencies-versionrange-fail\build.log, f:\jenkins\jenkins-slave\workspace\aven-enforcer_MENFORCER-288-GL5B4ERVFARMDDY5GUJ32NFJSOP7ZR6QLATDJG7AYHOHJMZGS6NA\m\maven-enforcer-plugin\target\it\banned-dependencies-versionrange\build.log, f:\jenkins\jenkins-slave\workspace\aven-enforcer_MENFORCER-288-GL5B4ERVFARMDDY5GUJ32NFJSOP7ZR6QLATDJG7AYHOHJMZGS6NA\m\maven-enforcer-plugin\target\it\banned-dependencies-wildcards\build.log, f:\jenkins\jenkins-slave\workspace\aven-enforcer_MENFORCER-288-GL5B4ERVFARMDDY5GUJ32NFJSOP7ZR6QLATDJG7AYHOHJMZGS6NA\m\maven-enforcer-plugin\target\it\banned-dependencies\build.log, f:\jenkins\jenkins-slave\workspace\aven-enforcer_MENFORCER-288-GL5B4ERVFARMDDY5GUJ32NFJSOP7ZR6QLATDJG7AYHOHJMZGS6NA\m\maven-enforcer-plugin\target\it\banned-plugins\build.log, f:\jenkins\jenkins-slave\workspace\aven-enforcer_MENFORCER-288-GL5B4ERVFARMDDY5GUJ32NFJSOP7ZR6QLATDJG7AYHOHJMZGS6NA\m\maven-enforcer-plugin\target\it\builds_a_pom_noop\build.log, f:\jenkins\jenkins-slave\workspace\aven-enforcer_MENFORCER-288-GL5B4ERVFARMDDY5GUJ32NFJSOP7ZR6QLATDJG7AYHOHJMZGS6NA\m\maven-enforcer-plugin\target\it\cli-always-fail\build.log, f:\jenkins\jenkins-slave\workspace\aven-enforcer_MENFORCER-288-GL5B4ERVFARMDDY5GUJ32NFJSOP7ZR6QLATDJG7AYHOHJMZGS6NA\m\maven-enforcer-plugin\target\it\cli-always-pass\build.log, f:\jenkins\jenkins-slave\workspace\aven-enforcer_MENFORCER-288-GL5B4ERVFARMDDY5GUJ32NFJSOP7ZR6QLATDJG7AYHOHJMZGS6NA\m\maven-enforcer-plugin\target\it\dependencies_converge\build.log, f:\jenkins\jenkins-slave\workspace\aven-enforcer_MENFORCER-288-GL5B4ERVFARMDDY5GUJ32NFJSOP7ZR6QLATDJG7AYHOHJMZGS6NA\m\maven-enforcer-plugin\target\it\dependencies_not_converging\build.log, f:\jenkins\jenkins-slave\workspace\aven-enforcer_MENFORCER-288-GL5B4ERVFARMDDY5GUJ32NFJSOP7ZR6QLATDJG7AYHOHJMZGS6NA\m\maven-enforcer-plugin\target\it\dependencies_not_converging_test_scope\build.log, f:\jenkins\jenkins-slave\workspace\aven-enforcer_MENFORCER-288-GL5B4ERVFARMDDY5GUJ32NFJSOP7ZR6QLATDJG7AYHOHJMZGS6NA\m\maven-enforcer-plugin\target\it\display-info\build.log, f:\jenkins\jenkins-slave\workspace\aven-enforcer_MENFORCER-288-GL5B4ERVFARMDDY5GUJ32NFJSOP7ZR6QLATDJG7AYHOHJMZGS6NA\m\maven-enforcer-plugin\target\it\evaluate-beanshell\build.log, f:\jenkins\jenkins-slave\workspace\aven-enforcer_MENFORCER-288-GL5B4ERVFARMDDY5GUJ32NFJSOP7ZR6QLATDJG7AYHOHJMZGS6NA\m\maven-enforcer-plugin\target\it\multimodule\build.log, f:\jenkins\jenkins-slave\workspace\aven-enforcer_MENFORCER-288-GL5B4ERVFARMDDY5GUJ32NFJSOP7ZR6QLATDJG7AYHOHJMZGS6NA\m\maven-enforcer-plugin\target\it\require-active-profile-all\build.log, f:\jenkins\jenkins-slave\workspace\aven-enforcer_MENFORCER-288-GL5B4ERVFARMDDY5GUJ32NFJSOP7ZR6QLATDJG7AYHOHJMZGS6NA\m\maven-enforcer-plugin\target\it\require-active-profile-from-settings\build.log, f:\jenkins\jenkins-slave\workspace\aven-enforcer_MENFORCER-288-GL5B4ERVFARMDDY5GUJ32NFJSOP7ZR6QLATDJG7AYHOHJMZGS6NA\m\maven-enforcer-plugin\target\it\require-active-profile\build.log, f:\jenkins\jenkins-slave\workspace\aven-enforcer_MENFORCER-288-GL5B4ERVFARMDDY5GUJ32NFJSOP7ZR6QLATDJG7AYHOHJMZGS6NA\m\maven-enforcer-plugin\target\it\require-file-checksum\build.log, f:\jenkins\jenkins-slave\workspace\aven-enforcer_MENFORCER-288-GL5B4ERVFARMDDY5GUJ32NFJSOP7ZR6QLATDJG7AYHOHJMZGS6NA\m\maven-enforcer-plugin\target\it\require-files-dont-exist\build.log, f:\jenkins\jenkins-slave\workspace\aven-enforcer_MENFORCER-288-GL5B4ERVFARMDDY5GUJ32NFJSOP7ZR6QLATDJG7AYHOHJMZGS6NA\m\maven-enforcer-plugin\target\it\require-files-exist\build.log, f:\jenkins\jenkins-slave\workspace\aven-enforcer_MENFORCER-288-GL5B4ERVFARMDDY5GUJ32NFJSOP7ZR6QLATDJG7AYHOHJMZGS6NA\m\maven-enforcer-plugin\target\it\require-files-size\build.log, f:\jenkins\jenkins-slave\workspace\aven-enforcer_MENFORCER-288-GL5B4ERVFARMDDY5GUJ32NFJSOP7ZR6QLATDJG7AYHOHJMZGS6NA\m\maven-enforcer-plugin\target\it\require-java-version\build.log, f:\jenkins\jenkins-slave\workspace\aven-enforcer_MENFORCER-288-GL5B4ERVFARMDDY5GUJ32NFJSOP7ZR6QLATDJG7AYHOHJMZGS6NA\m\maven-enforcer-plugin\target\it\require-maven-version\build.log, f:\jenkins\jenkins-slave\workspace\aven-enforcer_MENFORCER-288-GL5B4ERVFARMDDY5GUJ32NFJSOP7ZR6QLATDJG7AYHOHJMZGS6NA\m\maven-enforcer-plugin\target\it\require-no-repositories-allow-plugin-repo\build.log, f:\jenkins\jenkins-slave\workspace\aven-enforcer_MENFORCER-288-GL5B4ERVFARMDDY5GUJ32NFJSOP7ZR6QLATDJG7AYHOHJMZGS6NA\m\maven-enforcer-plugin\target\it\require-no-repositories-allow-repo\build.log, f:\jenkins\jenkins-slave\workspace\aven-enforcer_MENFORCER-288-GL5B4ERVFARMDDY5GUJ32NFJSOP7ZR6QLATDJG7AYHOHJMZGS6NA\m\maven-enforcer-plugin\target\it\require-no-repositories\build.log, f:\jenkins\jenkins-slave\workspace\aven-enforcer_MENFORCER-288-GL5B4ERVFARMDDY5GUJ32NFJSOP7ZR6QLATDJG7AYHOHJMZGS6NA\m\maven-enforcer-plugin\target\it\require-no-repositories_failure\build.log, f:\jenkins\jenkins-slave\workspace\aven-enforcer_MENFORCER-288-GL5B4ERVFARMDDY5GUJ32NFJSOP7ZR6QLATDJG7AYHOHJMZGS6NA\m\maven-enforcer-plugin\target\it\require-no-repositories_failure_allowed-plugin-repo\build.log, f:\jenkins\jenkins-slave\workspace\aven-enforcer_MENFORCER-288-GL5B4ERVFARMDDY5GUJ32NFJSOP7ZR6QLATDJG7AYHOHJMZGS6NA\m\maven-enforcer-plugin\target\it\require-no-repositories_failure_plugin-repositories\build.log, f:\jenkins\jenkins-slave\workspace\aven-enforcer_MENFORCER-288-GL5B4ERVFARMDDY5GUJ32NFJSOP7ZR6QLATDJG7AYHOHJMZGS6NA\m\maven-enforcer-plugin\target\it\require-no-repositories_failure_repositories\build.log, f:\jenkins\jenkins-slave\workspace\aven-enforcer_MENFORCER-288-GL5B4ERVFARMDDY5GUJ32NFJSOP7ZR6QLATDJG7AYHOHJMZGS6NA\m\maven-enforcer-plugin\target\it\require-no-repositories_mm\build.log, f:\jenkins\jenkins-slave\workspace\aven-enforcer_MENFORCER-288-GL5B4ERVFARMDDY5GUJ32NFJSOP7ZR6QLATDJG7AYHOHJMZGS6NA\m\maven-enforcer-plugin\target\it\require-no-repositories_mm_ci\build.log, f:\jenkins\jenkins-slave\workspace\aven-enforcer_MENFORCER-288-GL5B4ERVFARMDDY5GUJ32NFJSOP7ZR6QLATDJG7AYHOHJMZGS6NA\m\maven-enforcer-plugin\target\it\require-plugin-versions-ci\build.log, f:\jenkins\jenkins-slave\workspace\aven-enforcer_MENFORCER-288-GL5B4ERVFARMDDY5GUJ32NFJSOP7ZR6QLATDJG7AYHOHJMZGS6NA\m\maven-enforcer-plugin\target\it\require-plugin-versions-custom-packaging\build.log, f:\jenkins\jenkins-slave\workspace\aven-enforcer_MENFORCER-288-GL5B4ERVFARMDDY5GUJ32NFJSOP7ZR6QLATDJG7AYHOHJMZGS6NA\m\maven-enforcer-plugin\target\it\require-plugin-versions-expressions\build.log, f:\jenkins\jenkins-slave\workspace\aven-enforcer_MENFORCER-288-GL5B4ERVFARMDDY5GUJ32NFJSOP7ZR6QLATDJG7AYHOHJMZGS6NA\m\maven-enforcer-plugin\target\it\require-plugin-versions-mm-ci-friendly\build.log, f:\jenkins\jenkins-slave\workspace\aven-enforcer_MENFORCER-288-GL5B4ERVFARMDDY5GUJ32NFJSOP7ZR6QLATDJG7AYHOHJMZGS6NA\m\maven-enforcer-plugin\target\it\require-plugin-versions-plugin-with-extensions\build.log, f:\jenkins\jenkins-slave\workspace\aven-enforcer_MENFORCER-288-GL5B4ERVFARMDDY5GUJ32NFJSOP7ZR6QLATDJG7AYHOHJMZGS6NA\m\maven-enforcer-plugin\target\it\require-plugin-versions-plugin-with-integration-test-lifecycle\build.log, f:\jenkins\jenkins-slave\workspace\aven-enforcer_MENFORCER-288-GL5B4ERVFARMDDY5GUJ32NFJSOP7ZR6QLATDJG7AYHOHJMZGS6NA\m\maven-enforcer-plugin\target\it\require-plugin-versions-projectGAVexpressions\build.log, f:\jenkins\jenkins-slave\workspace\aven-enforcer_MENFORCER-288-GL5B4ERVFARMDDY5GUJ32NFJSOP7ZR6QLATDJG7AYHOHJMZGS6NA\m\maven-enforcer-plugin\target\it\require-plugin-versions\build.log, f:\jenkins\jenkins-slave\workspace\aven-enforcer_MENFORCER-288-GL5B4ERVFARMDDY5GUJ32NFJSOP7ZR6QLATDJG7AYHOHJMZGS6NA\m\maven-enforcer-plugin\target\it\require-profile-ids-exist_failure\build.log, f:\jenkins\jenkins-slave\workspace\aven-enforcer_MENFORCER-288-GL5B4ERVFARMDDY5GUJ32NFJSOP7ZR6QLATDJG7AYHOHJMZGS6NA\m\maven-enforcer-plugin\target\it\require-profile-ids-exist_success\build.log, f:\jenkins\jenkins-slave\workspace\aven-enforcer_MENFORCER-288-GL5B4ERVFARMDDY5GUJ32NFJSOP7ZR6QLATDJG7AYHOHJMZGS6NA\m\maven-enforcer-plugin\target\it\require-property\build.log, f:\jenkins\jenkins-slave\workspace\aven-enforcer_MENFORCER-288-GL5B4ERVFARMDDY5GUJ32NFJSOP7ZR6QLATDJG7AYHOHJMZGS6NA\m\maven-enforcer-plugin\target\it\require-release-dependencies-excludes\build.log, f:\jenkins\jenkins-slave\workspace\aven-enforcer_MENFORCER-288-GL5B4ERVFARMDDY5GUJ32NFJSOP7ZR6QLATDJG7AYHOHJMZGS6NA\m\maven-enforcer-plugin\target\it\require-release-dependencies-excludes_failure\build.log, f:\jenkins\jenkins-slave\workspace\aven-enforcer_MENFORCER-288-GL5B4ERVFARMDDY5GUJ32NFJSOP7ZR6QLATDJG7AYHOHJMZGS6NA\m\maven-enforcer-plugin\target\it\require-release-dependencies\build.log, f:\jenkins\jenkins-slave\workspace\aven-enforcer_MENFORCER-288-GL5B4ERVFARMDDY5GUJ32NFJSOP7ZR6QLATDJG7AYHOHJMZGS6NA\m\maven-enforcer-plugin\target\it\require-release-version\build.log, f:\jenkins\jenkins-slave\workspace\aven-enforcer_MENFORCER-288-GL5B4ERVFARMDDY5GUJ32NFJSOP7ZR6QLATDJG7AYHOHJMZGS6NA\m\maven-enforcer-plugin\target\it\require-same-versions_failure\build.log, f:\jenkins\jenkins-slave\workspace\aven-enforcer_MENFORCER-288-GL5B4ERVFARMDDY5GUJ32NFJSOP7ZR6QLATDJG7AYHOHJMZGS6NA\m\maven-enforcer-plugin\target\it\require-same-versions_success\build.log, f:\jenkins\jenkins-slave\workspace\aven-enforcer_MENFORCER-288-GL5B4ERVFARMDDY5GUJ32NFJSOP7ZR6QLATDJG7AYHOHJMZGS6NA\m\maven-enforcer-plugin\target\it\require-snapshot-version_failure\build.log, f:\jenkins\jenkins-slave\workspace\aven-enforcer_MENFORCER-288-GL5B4ERVFARMDDY5GUJ32NFJSOP7ZR6QLATDJG7AYHOHJMZGS6NA\m\maven-enforcer-plugin\target\it\require-snapshot-version_success\build.log, f:\jenkins\jenkins-slave\workspace\aven-enforcer_MENFORCER-288-GL5B4ERVFARMDDY5GUJ32NFJSOP7ZR6QLATDJG7AYHOHJMZGS6NA\m\maven-enforcer-plugin\target\it\require-upper-bound-dependencies-managed_failure\build.log, f:\jenkins\jenkins-slave\workspace\aven-enforcer_MENFORCER-288-GL5B4ERVFARMDDY5GUJ32NFJSOP7ZR6QLATDJG7AYHOHJMZGS6NA\m\maven-enforcer-plugin\target\it\require-upper-bound-dependencies-managed_success\build.log, f:\jenkins\jenkins-slave\workspace\aven-enforcer_MENFORCER-288-GL5B4ERVFARMDDY5GUJ32NFJSOP7ZR6QLATDJG7AYHOHJMZGS6NA\m\maven-enforcer-plugin\target\it\require-upper-bound-dependencies-unique_failure\build.log, f:\jenkins\jenkins-slave\workspace\aven-enforcer_MENFORCER-288-GL5B4ERVFARMDDY5GUJ32NFJSOP7ZR6QLATDJG7AYHOHJMZGS6NA\m\maven-enforcer-plugin\target\it\require-upper-bound-dependencies-unique_success\build.log, f:\jenkins\jenkins-slave\workspace\aven-enforcer_MENFORCER-288-GL5B4ERVFARMDDY5GUJ32NFJSOP7ZR6QLATDJG7AYHOHJMZGS6NA\m\maven-enforcer-plugin\target\it\require-upper-bound-deps_failure\build.log, f:\jenkins\jenkins-slave\workspace\aven-enforcer_MENFORCER-288-GL5B4ERVFARMDDY5GUJ32NFJSOP7ZR6QLATDJG7AYHOHJMZGS6NA\m\maven-enforcer-plugin\target\it\require-upper-bound-deps_ignored\build.log, f:\jenkins\jenkins-slave\workspace\aven-enforcer_MENFORCER-288-GL5B4ERVFARMDDY5GUJ32NFJSOP7ZR6QLATDJG7AYHOHJMZGS6NA\m\maven-enforcer-plugin\target\it\require-upper-bound-deps_success\build.log, f:\jenkins\jenkins-slave\workspace\aven-enforcer_MENFORCER-288-GL5B4ERVFARMDDY5GUJ32NFJSOP7ZR6QLATDJG7AYHOHJMZGS6NA\m\maven-enforcer-plugin\target\it\resolve_collect_dependencies\build.log]
[windows-jdk9] Finished parsing Maven Invoker results (found 68)
[windows-jdk9] [withMaven] junitPublisher - Archive test results for Maven artifact org.apache.maven.enforcer:enforcer-api:3.0.0-SNAPSHOT generated by maven-surefire-plugin:test (default-test): m\enforcer-api\target\surefire-reports\*.xml
[windows-jdk9] Recording test results
[windows-jdk9] None of the test reports contained any result
[windows-jdk9] [withMaven] junitPublisher - Archive test results for Maven artifact org.apache.maven.enforcer:enforcer-rules:3.0.0-SNAPSHOT generated by maven-surefire-plugin:test (default-test): m\enforcer-rules\target\surefire-reports\*.xml
[windows-jdk9] Recording test results
[windows-jdk9] [withMaven] junitPublisher - Archive test results for Maven artifact org.apache.maven.plugins:maven-enforcer-plugin:3.0.0-SNAPSHOT generated by maven-surefire-plugin:test (default-test): m\maven-enforcer-plugin\target\surefire-reports\*.xml
[windows-jdk9] Recording test results
[Pipeline] [windows-jdk9] // withMaven
[Pipeline] [windows-jdk9] cleanWs
[windows-jdk9] [WS-CLEANUP] Deleting project workspace...[WS-CLEANUP] done
[Pipeline] [windows-jdk9] }
[Pipeline] [windows-jdk9] // stage
[Pipeline] [windows-jdk9] }
[Pipeline] [windows-jdk9] // node
[Pipeline] [windows-jdk9] }
[windows-jdk8] [INFO] run post-build script verify.groovy
[windows-jdk8] [INFO]           resolve_collect_dependencies\pom.xml ............. SUCCESS (8.6 s)
[windows-jdk8] [INFO] -------------------------------------------------
[windows-jdk8] [INFO] Build Summary:
[windows-jdk8] [INFO]   Passed: 68, Failed: 0, Errors: 0, Skipped: 0
[windows-jdk8] [INFO] -------------------------------------------------
[windows-jdk8] [INFO] 
[windows-jdk8] [INFO] --- mrm-maven-plugin:1.0.0:stop (default) @ maven-enforcer-plugin ---
[windows-jdk8] [INFO] Stopping Mock Repository Manager on http://localhost:60033
[windows-jdk8] [INFO] Mock Repository Manager http://localhost:60033 is stopped.
[windows-jdk8] [INFO] 
[windows-jdk8] [INFO] --- maven-checkstyle-plugin:3.0.0:check (checkstyle-check) @ maven-enforcer-plugin ---
[windows-jdk8] [INFO] ------------------------------------------------------------------------
[windows-jdk8] [INFO] Reactor Summary:
[windows-jdk8] [INFO] 
[windows-jdk8] [INFO] Apache Maven Enforcer .............................. SUCCESS [ 35.100 s]
[windows-jdk8] [INFO] Apache Maven Enforcer API .......................... SUCCESS [  9.547 s]
[windows-jdk8] [INFO] Apache Maven Enforcer Built-In Rules ............... SUCCESS [ 15.282 s]
[windows-jdk8] [INFO] Apache Maven Enforcer Plugin ....................... SUCCESS [07:02 min]
[windows-jdk8] [INFO] ------------------------------------------------------------------------
[windows-jdk8] [INFO] BUILD SUCCESS
[windows-jdk8] [INFO] ------------------------------------------------------------------------
[windows-jdk8] [INFO] Total time: 08:04 min
[windows-jdk8] [INFO] Finished at: 2018-11-01T23:40:16-07:00
[windows-jdk8] [INFO] Final Memory: 59M/869M
[windows-jdk8] [INFO] ------------------------------------------------------------------------
[windows-jdk8] [INFO] [jenkins-event-spy] Generated F:\jenkins\jenkins-slave\workspace\aven-enforcer_MENFORCER-288-GL5B4ERVFARMDDY5GUJ32NFJSOP7ZR6QLATDJG7AYHOHJMZGS6NA@tmp\withMaven3123dba5\maven-spy-20181101-233211-3744756518295352615686.log
[windows-jdk8] Picked up JAVA_TOOL_OPTIONS: -Dmaven.ext.class.path="f:\jenkins\jenkins-slave\workspace\aven-enforcer_MENFORCER-288-GL5B4ERVFARMDDY5GUJ32NFJSOP7ZR6QLATDJG7AYHOHJMZGS6NA@tmp\withMaven3123dba5\pipeline-maven-spy.jar" -Dorg.jenkinsci.plugins.pipeline.maven.reportsFolder="f:\jenkins\jenkins-slave\workspace\aven-enforcer_MENFORCER-288-GL5B4ERVFARMDDY5GUJ32NFJSOP7ZR6QLATDJG7AYHOHJMZGS6NA@tmp\withMaven3123dba5" 
[Pipeline] [windows-jdk8] }
[Pipeline] [windows-jdk8] // dir
[Pipeline] [windows-jdk8] }
[windows-jdk8] [withMaven] invokerPublisher - Archive invoker results for Maven artifact MavenArtifact{org.apache.maven.plugins:maven-enforcer-plugin::3.0.0-SNAPSHOT(version: 3.0.0-SNAPSHOT, snapshot:false) } generated by PluginInvocation{org.apache.maven.plugins:maven-invoker-plugin:3.0.1@run  integration-test}: m\maven-enforcer-plugin\target\invoker-reports\*.xml
[windows-jdk8] performing MavenInvokerRecorder, reportsFilenamePattern:'**/m\maven-enforcer-plugin\target\invoker-reports/BUILD*.xml', invokerBuildDir:'**/m\maven-enforcer-plugin\target\it'
[windows-jdk8] Found reports:[f:\jenkins\jenkins-slave\workspace\aven-enforcer_MENFORCER-288-GL5B4ERVFARMDDY5GUJ32NFJSOP7ZR6QLATDJG7AYHOHJMZGS6NA\m\maven-enforcer-plugin\target\invoker-reports\BUILD-always-fail-warn.xml, f:\jenkins\jenkins-slave\workspace\aven-enforcer_MENFORCER-288-GL5B4ERVFARMDDY5GUJ32NFJSOP7ZR6QLATDJG7AYHOHJMZGS6NA\m\maven-enforcer-plugin\target\invoker-reports\BUILD-always-fail.xml, f:\jenkins\jenkins-slave\workspace\aven-enforcer_MENFORCER-288-GL5B4ERVFARMDDY5GUJ32NFJSOP7ZR6QLATDJG7AYHOHJMZGS6NA\m\maven-enforcer-plugin\target\invoker-reports\BUILD-always-pass.xml, f:\jenkins\jenkins-slave\workspace\aven-enforcer_MENFORCER-288-GL5B4ERVFARMDDY5GUJ32NFJSOP7ZR6QLATDJG7AYHOHJMZGS6NA\m\maven-enforcer-plugin\target\invoker-reports\BUILD-ban-distribution-management-multi-module-build.xml, f:\jenkins\jenkins-slave\workspace\aven-enforcer_MENFORCER-288-GL5B4ERVFARMDDY5GUJ32NFJSOP7ZR6QLATDJG7AYHOHJMZGS6NA\m\maven-enforcer-plugin\target\invoker-reports\BUILD-ban-distribution-management-multi-module-except-site.xml, f:\jenkins\jenkins-slave\workspace\aven-enforcer_MENFORCER-288-GL5B4ERVFARMDDY5GUJ32NFJSOP7ZR6QLATDJG7AYHOHJMZGS6NA\m\maven-enforcer-plugin\target\invoker-reports\BUILD-ban-distribution-management.xml, f:\jenkins\jenkins-slave\workspace\aven-enforcer_MENFORCER-288-GL5B4ERVFARMDDY5GUJ32NFJSOP7ZR6QLATDJG7AYHOHJMZGS6NA\m\maven-enforcer-plugin\target\invoker-reports\BUILD-ban-pom-dependency-version.xml, f:\jenkins\jenkins-slave\workspace\aven-enforcer_MENFORCER-288-GL5B4ERVFARMDDY5GUJ32NFJSOP7ZR6QLATDJG7AYHOHJMZGS6NA\m\maven-enforcer-plugin\target\invoker-reports\BUILD-ban-transitive-dependencies-fail.xml, f:\jenkins\jenkins-slave\workspace\aven-enforcer_MENFORCER-288-GL5B4ERVFARMDDY5GUJ32NFJSOP7ZR6QLATDJG7AYHOHJMZGS6NA\m\maven-enforcer-plugin\target\invoker-reports\BUILD-ban-transitive-dependencies.xml, f:\jenkins\jenkins-slave\workspace\aven-enforcer_MENFORCER-288-GL5B4ERVFARMDDY5GUJ32NFJSOP7ZR6QLATDJG7AYHOHJMZGS6NA\m\maven-enforcer-plugin\target\invoker-reports\BUILD-banned-dependencies-versionrange-fail.xml, f:\jenkins\jenkins-slave\workspace\aven-enforcer_MENFORCER-288-GL5B4ERVFARMDDY5GUJ32NFJSOP7ZR6QLATDJG7AYHOHJMZGS6NA\m\maven-enforcer-plugin\target\invoker-reports\BUILD-banned-dependencies-versionrange.xml, f:\jenkins\jenkins-slave\workspace\aven-enforcer_MENFORCER-288-GL5B4ERVFARMDDY5GUJ32NFJSOP7ZR6QLATDJG7AYHOHJMZGS6NA\m\maven-enforcer-plugin\target\invoker-reports\BUILD-banned-dependencies-wildcards.xml, f:\jenkins\jenkins-slave\workspace\aven-enforcer_MENFORCER-288-GL5B4ERVFARMDDY5GUJ32NFJSOP7ZR6QLATDJG7AYHOHJMZGS6NA\m\maven-enforcer-plugin\target\invoker-reports\BUILD-banned-dependencies.xml, f:\jenkins\jenkins-slave\workspace\aven-enforcer_MENFORCER-288-GL5B4ERVFARMDDY5GUJ32NFJSOP7ZR6QLATDJG7AYHOHJMZGS6NA\m\maven-enforcer-plugin\target\invoker-reports\BUILD-banned-plugins.xml, f:\jenkins\jenkins-slave\workspace\aven-enforcer_MENFORCER-288-GL5B4ERVFARMDDY5GUJ32NFJSOP7ZR6QLATDJG7AYHOHJMZGS6NA\m\maven-enforcer-plugin\target\invoker-reports\BUILD-builds_a_pom_noop.xml, f:\jenkins\jenkins-slave\workspace\aven-enforcer_MENFORCER-288-GL5B4ERVFARMDDY5GUJ32NFJSOP7ZR6QLATDJG7AYHOHJMZGS6NA\m\maven-enforcer-plugin\target\invoker-reports\BUILD-cli-always-fail.xml, f:\jenkins\jenkins-slave\workspace\aven-enforcer_MENFORCER-288-GL5B4ERVFARMDDY5GUJ32NFJSOP7ZR6QLATDJG7AYHOHJMZGS6NA\m\maven-enforcer-plugin\target\invoker-reports\BUILD-cli-always-pass.xml, f:\jenkins\jenkins-slave\workspace\aven-enforcer_MENFORCER-288-GL5B4ERVFARMDDY5GUJ32NFJSOP7ZR6QLATDJG7AYHOHJMZGS6NA\m\maven-enforcer-plugin\target\invoker-reports\BUILD-dependencies_converge.xml, f:\jenkins\jenkins-slave\workspace\aven-enforcer_MENFORCER-288-GL5B4ERVFARMDDY5GUJ32NFJSOP7ZR6QLATDJG7AYHOHJMZGS6NA\m\maven-enforcer-plugin\target\invoker-reports\BUILD-dependencies_not_converging.xml, f:\jenkins\jenkins-slave\workspace\aven-enforcer_MENFORCER-288-GL5B4ERVFARMDDY5GUJ32NFJSOP7ZR6QLATDJG7AYHOHJMZGS6NA\m\maven-enforcer-plugin\target\invoker-reports\BUILD-dependencies_not_converging_test_scope.xml, f:\jenkins\jenkins-slave\workspace\aven-enforcer_MENFORCER-288-GL5B4ERVFARMDDY5GUJ32NFJSOP7ZR6QLATDJG7AYHOHJMZGS6NA\m\maven-enforcer-plugin\target\invoker-reports\BUILD-display-info.xml, f:\jenkins\jenkins-slave\workspace\aven-enforcer_MENFORCER-288-GL5B4ERVFARMDDY5GUJ32NFJSOP7ZR6QLATDJG7AYHOHJMZGS6NA\m\maven-enforcer-plugin\target\invoker-reports\BUILD-evaluate-beanshell.xml, f:\jenkins\jenkins-slave\workspace\aven-enforcer_MENFORCER-288-GL5B4ERVFARMDDY5GUJ32NFJSOP7ZR6QLATDJG7AYHOHJMZGS6NA\m\maven-enforcer-plugin\target\invoker-reports\BUILD-multimodule.xml, f:\jenkins\jenkins-slave\workspace\aven-enforcer_MENFORCER-288-GL5B4ERVFARMDDY5GUJ32NFJSOP7ZR6QLATDJG7AYHOHJMZGS6NA\m\maven-enforcer-plugin\target\invoker-reports\BUILD-require-active-profile-all.xml, f:\jenkins\jenkins-slave\workspace\aven-enforcer_MENFORCER-288-GL5B4ERVFARMDDY5GUJ32NFJSOP7ZR6QLATDJG7AYHOHJMZGS6NA\m\maven-enforcer-plugin\target\invoker-reports\BUILD-require-active-profile-from-settings.xml, f:\jenkins\jenkins-slave\workspace\aven-enforcer_MENFORCER-288-GL5B4ERVFARMDDY5GUJ32NFJSOP7ZR6QLATDJG7AYHOHJMZGS6NA\m\maven-enforcer-plugin\target\invoker-reports\BUILD-require-active-profile.xml, f:\jenkins\jenkins-slave\workspace\aven-enforcer_MENFORCER-288-GL5B4ERVFARMDDY5GUJ32NFJSOP7ZR6QLATDJG7AYHOHJMZGS6NA\m\maven-enforcer-plugin\target\invoker-reports\BUILD-require-file-checksum.xml, f:\jenkins\jenkins-slave\workspace\aven-enforcer_MENFORCER-288-GL5B4ERVFARMDDY5GUJ32NFJSOP7ZR6QLATDJG7AYHOHJMZGS6NA\m\maven-enforcer-plugin\target\invoker-reports\BUILD-require-files-dont-exist.xml, f:\jenkins\jenkins-slave\workspace\aven-enforcer_MENFORCER-288-GL5B4ERVFARMDDY5GUJ32NFJSOP7ZR6QLATDJG7AYHOHJMZGS6NA\m\maven-enforcer-plugin\target\invoker-reports\BUILD-require-files-exist.xml, f:\jenkins\jenkins-slave\workspace\aven-enforcer_MENFORCER-288-GL5B4ERVFARMDDY5GUJ32NFJSOP7ZR6QLATDJG7AYHOHJMZGS6NA\m\maven-enforcer-plugin\target\invoker-reports\BUILD-require-files-size.xml, f:\jenkins\jenkins-slave\workspace\aven-enforcer_MENFORCER-288-GL5B4ERVFARMDDY5GUJ32NFJSOP7ZR6QLATDJG7AYHOHJMZGS6NA\m\maven-enforcer-plugin\target\invoker-reports\BUILD-require-java-version.xml, f:\jenkins\jenkins-slave\workspace\aven-enforcer_MENFORCER-288-GL5B4ERVFARMDDY5GUJ32NFJSOP7ZR6QLATDJG7AYHOHJMZGS6NA\m\maven-enforcer-plugin\target\invoker-reports\BUILD-require-maven-version.xml, f:\jenkins\jenkins-slave\workspace\aven-enforcer_MENFORCER-288-GL5B4ERVFARMDDY5GUJ32NFJSOP7ZR6QLATDJG7AYHOHJMZGS6NA\m\maven-enforcer-plugin\target\invoker-reports\BUILD-require-no-repositories-allow-plugin-repo.xml, f:\jenkins\jenkins-slave\workspace\aven-enforcer_MENFORCER-288-GL5B4ERVFARMDDY5GUJ32NFJSOP7ZR6QLATDJG7AYHOHJMZGS6NA\m\maven-enforcer-plugin\target\invoker-reports\BUILD-require-no-repositories-allow-repo.xml, f:\jenkins\jenkins-slave\workspace\aven-enforcer_MENFORCER-288-GL5B4ERVFARMDDY5GUJ32NFJSOP7ZR6QLATDJG7AYHOHJMZGS6NA\m\maven-enforcer-plugin\target\invoker-reports\BUILD-require-no-repositories.xml, f:\jenkins\jenkins-slave\workspace\aven-enforcer_MENFORCER-288-GL5B4ERVFARMDDY5GUJ32NFJSOP7ZR6QLATDJG7AYHOHJMZGS6NA\m\maven-enforcer-plugin\target\invoker-reports\BUILD-require-no-repositories_failure.xml, f:\jenkins\jenkins-slave\workspace\aven-enforcer_MENFORCER-288-GL5B4ERVFARMDDY5GUJ32NFJSOP7ZR6QLATDJG7AYHOHJMZGS6NA\m\maven-enforcer-plugin\target\invoker-reports\BUILD-require-no-repositories_failure_allowed-plugin-repo.xml, f:\jenkins\jenkins-slave\workspace\aven-enforcer_MENFORCER-288-GL5B4ERVFARMDDY5GUJ32NFJSOP7ZR6QLATDJG7AYHOHJMZGS6NA\m\maven-enforcer-plugin\target\invoker-reports\BUILD-require-no-repositories_failure_plugin-repositories.xml, f:\jenkins\jenkins-slave\workspace\aven-enforcer_MENFORCER-288-GL5B4ERVFARMDDY5GUJ32NFJSOP7ZR6QLATDJG7AYHOHJMZGS6NA\m\maven-enforcer-plugin\target\invoker-reports\BUILD-require-no-repositories_failure_repositories.xml, f:\jenkins\jenkins-slave\workspace\aven-enforcer_MENFORCER-288-GL5B4ERVFARMDDY5GUJ32NFJSOP7ZR6QLATDJG7AYHOHJMZGS6NA\m\maven-enforcer-plugin\target\invoker-reports\BUILD-require-no-repositories_mm.xml, f:\jenkins\jenkins-slave\workspace\aven-enforcer_MENFORCER-288-GL5B4ERVFARMDDY5GUJ32NFJSOP7ZR6QLATDJG7AYHOHJMZGS6NA\m\maven-enforcer-plugin\target\invoker-reports\BUILD-require-no-repositories_mm_ci.xml, f:\jenkins\jenkins-slave\workspace\aven-enforcer_MENFORCER-288-GL5B4ERVFARMDDY5GUJ32NFJSOP7ZR6QLATDJG7AYHOHJMZGS6NA\m\maven-enforcer-plugin\target\invoker-reports\BUILD-require-plugin-versions-ci.xml, f:\jenkins\jenkins-slave\workspace\aven-enforcer_MENFORCER-288-GL5B4ERVFARMDDY5GUJ32NFJSOP7ZR6QLATDJG7AYHOHJMZGS6NA\m\maven-enforcer-plugin\target\invoker-reports\BUILD-require-plugin-versions-custom-packaging.xml, f:\jenkins\jenkins-slave\workspace\aven-enforcer_MENFORCER-288-GL5B4ERVFARMDDY5GUJ32NFJSOP7ZR6QLATDJG7AYHOHJMZGS6NA\m\maven-enforcer-plugin\target\invoker-reports\BUILD-require-plugin-versions-expressions.xml, f:\jenkins\jenkins-slave\workspace\aven-enforcer_MENFORCER-288-GL5B4ERVFARMDDY5GUJ32NFJSOP7ZR6QLATDJG7AYHOHJMZGS6NA\m\maven-enforcer-plugin\target\invoker-reports\BUILD-require-plugin-versions-mm-ci-friendly.xml, f:\jenkins\jenkins-slave\workspace\aven-enforcer_MENFORCER-288-GL5B4ERVFARMDDY5GUJ32NFJSOP7ZR6QLATDJG7AYHOHJMZGS6NA\m\maven-enforcer-plugin\target\invoker-reports\BUILD-require-plugin-versions-plugin-with-extensions.xml, f:\jenkins\jenkins-slave\workspace\aven-enforcer_MENFORCER-288-GL5B4ERVFARMDDY5GUJ32NFJSOP7ZR6QLATDJG7AYHOHJMZGS6NA\m\maven-enforcer-plugin\target\invoker-reports\BUILD-require-plugin-versions-plugin-with-integration-test-lifecycle.xml, f:\jenkins\jenkins-slave\workspace\aven-enforcer_MENFORCER-288-GL5B4ERVFARMDDY5GUJ32NFJSOP7ZR6QLATDJG7AYHOHJMZGS6NA\m\maven-enforcer-plugin\target\invoker-reports\BUILD-require-plugin-versions-projectGAVexpressions.xml, f:\jenkins\jenkins-slave\workspace\aven-enforcer_MENFORCER-288-GL5B4ERVFARMDDY5GUJ32NFJSOP7ZR6QLATDJG7AYHOHJMZGS6NA\m\maven-enforcer-plugin\target\invoker-reports\BUILD-require-plugin-versions.xml, f:\jenkins\jenkins-slave\workspace\aven-enforcer_MENFORCER-288-GL5B4ERVFARMDDY5GUJ32NFJSOP7ZR6QLATDJG7AYHOHJMZGS6NA\m\maven-enforcer-plugin\target\invoker-reports\BUILD-require-profile-ids-exist_failure.xml, f:\jenkins\jenkins-slave\workspace\aven-enforcer_MENFORCER-288-GL5B4ERVFARMDDY5GUJ32NFJSOP7ZR6QLATDJG7AYHOHJMZGS6NA\m\maven-enforcer-plugin\target\invoker-reports\BUILD-require-profile-ids-exist_success.xml, f:\jenkins\jenkins-slave\workspace\aven-enforcer_MENFORCER-288-GL5B4ERVFARMDDY5GUJ32NFJSOP7ZR6QLATDJG7AYHOHJMZGS6NA\m\maven-enforcer-plugin\target\invoker-reports\BUILD-require-property.xml, f:\jenkins\jenkins-slave\workspace\aven-enforcer_MENFORCER-288-GL5B4ERVFARMDDY5GUJ32NFJSOP7ZR6QLATDJG7AYHOHJMZGS6NA\m\maven-enforcer-plugin\target\invoker-reports\BUILD-require-release-dependencies-excludes.xml, f:\jenkins\jenkins-slave\workspace\aven-enforcer_MENFORCER-288-GL5B4ERVFARMDDY5GUJ32NFJSOP7ZR6QLATDJG7AYHOHJMZGS6NA\m\maven-enforcer-plugin\target\invoker-reports\BUILD-require-release-dependencies-excludes_failure.xml, f:\jenkins\jenkins-slave\workspace\aven-enforcer_MENFORCER-288-GL5B4ERVFARMDDY5GUJ32NFJSOP7ZR6QLATDJG7AYHOHJMZGS6NA\m\maven-enforcer-plugin\target\invoker-reports\BUILD-require-release-dependencies.xml, f:\jenkins\jenkins-slave\workspace\aven-enforcer_MENFORCER-288-GL5B4ERVFARMDDY5GUJ32NFJSOP7ZR6QLATDJG7AYHOHJMZGS6NA\m\maven-enforcer-plugin\target\invoker-reports\BUILD-require-release-version.xml, f:\jenkins\jenkins-slave\workspace\aven-enforcer_MENFORCER-288-GL5B4ERVFARMDDY5GUJ32NFJSOP7ZR6QLATDJG7AYHOHJMZGS6NA\m\maven-enforcer-plugin\target\invoker-reports\BUILD-require-same-versions_failure.xml, f:\jenkins\jenkins-slave\workspace\aven-enforcer_MENFORCER-288-GL5B4ERVFARMDDY5GUJ32NFJSOP7ZR6QLATDJG7AYHOHJMZGS6NA\m\maven-enforcer-plugin\target\invoker-reports\BUILD-require-same-versions_success.xml, f:\jenkins\jenkins-slave\workspace\aven-enforcer_MENFORCER-288-GL5B4ERVFARMDDY5GUJ32NFJSOP7ZR6QLATDJG7AYHOHJMZGS6NA\m\maven-enforcer-plugin\target\invoker-reports\BUILD-require-snapshot-version_failure.xml, f:\jenkins\jenkins-slave\workspace\aven-enforcer_MENFORCER-288-GL5B4ERVFARMDDY5GUJ32NFJSOP7ZR6QLATDJG7AYHOHJMZGS6NA\m\maven-enforcer-plugin\target\invoker-reports\BUILD-require-snapshot-version_success.xml, f:\jenkins\jenkins-slave\workspace\aven-enforcer_MENFORCER-288-GL5B4ERVFARMDDY5GUJ32NFJSOP7ZR6QLATDJG7AYHOHJMZGS6NA\m\maven-enforcer-plugin\target\invoker-reports\BUILD-require-upper-bound-dependencies-managed_failure.xml, f:\jenkins\jenkins-slave\workspace\aven-enforcer_MENFORCER-288-GL5B4ERVFARMDDY5GUJ32NFJSOP7ZR6QLATDJG7AYHOHJMZGS6NA\m\maven-enforcer-plugin\target\invoker-reports\BUILD-require-upper-bound-dependencies-managed_success.xml, f:\jenkins\jenkins-slave\workspace\aven-enforcer_MENFORCER-288-GL5B4ERVFARMDDY5GUJ32NFJSOP7ZR6QLATDJG7AYHOHJMZGS6NA\m\maven-enforcer-plugin\target\invoker-reports\BUILD-require-upper-bound-dependencies-unique_failure.xml, f:\jenkins\jenkins-slave\workspace\aven-enforcer_MENFORCER-288-GL5B4ERVFARMDDY5GUJ32NFJSOP7ZR6QLATDJG7AYHOHJMZGS6NA\m\maven-enforcer-plugin\target\invoker-reports\BUILD-require-upper-bound-dependencies-unique_success.xml, f:\jenkins\jenkins-slave\workspace\aven-enforcer_MENFORCER-288-GL5B4ERVFARMDDY5GUJ32NFJSOP7ZR6QLATDJG7AYHOHJMZGS6NA\m\maven-enforcer-plugin\target\invoker-reports\BUILD-require-upper-bound-deps_failure.xml, f:\jenkins\jenkins-slave\workspace\aven-enforcer_MENFORCER-288-GL5B4ERVFARMDDY5GUJ32NFJSOP7ZR6QLATDJG7AYHOHJMZGS6NA\m\maven-enforcer-plugin\target\invoker-reports\BUILD-require-upper-bound-deps_ignored.xml, f:\jenkins\jenkins-slave\workspace\aven-enforcer_MENFORCER-288-GL5B4ERVFARMDDY5GUJ32NFJSOP7ZR6QLATDJG7AYHOHJMZGS6NA\m\maven-enforcer-plugin\target\invoker-reports\BUILD-require-upper-bound-deps_success.xml, f:\jenkins\jenkins-slave\workspace\aven-enforcer_MENFORCER-288-GL5B4ERVFARMDDY5GUJ32NFJSOP7ZR6QLATDJG7AYHOHJMZGS6NA\m\maven-enforcer-plugin\target\invoker-reports\BUILD-resolve_collect_dependencies.xml]
[windows-jdk8] Found logs:[f:\jenkins\jenkins-slave\workspace\aven-enforcer_MENFORCER-288-GL5B4ERVFARMDDY5GUJ32NFJSOP7ZR6QLATDJG7AYHOHJMZGS6NA\m\maven-enforcer-plugin\target\it\always-fail-warn\build.log, f:\jenkins\jenkins-slave\workspace\aven-enforcer_MENFORCER-288-GL5B4ERVFARMDDY5GUJ32NFJSOP7ZR6QLATDJG7AYHOHJMZGS6NA\m\maven-enforcer-plugin\target\it\always-fail\build.log, f:\jenkins\jenkins-slave\workspace\aven-enforcer_MENFORCER-288-GL5B4ERVFARMDDY5GUJ32NFJSOP7ZR6QLATDJG7AYHOHJMZGS6NA\m\maven-enforcer-plugin\target\it\always-pass\build.log, f:\jenkins\jenkins-slave\workspace\aven-enforcer_MENFORCER-288-GL5B4ERVFARMDDY5GUJ32NFJSOP7ZR6QLATDJG7AYHOHJMZGS6NA\m\maven-enforcer-plugin\target\it\ban-distribution-management-multi-module-build\build.log, f:\jenkins\jenkins-slave\workspace\aven-enforcer_MENFORCER-288-GL5B4ERVFARMDDY5GUJ32NFJSOP7ZR6QLATDJG7AYHOHJMZGS6NA\m\maven-enforcer-plugin\target\it\ban-distribution-management-multi-module-except-site\build.log, f:\jenkins\jenkins-slave\workspace\aven-enforcer_MENFORCER-288-GL5B4ERVFARMDDY5GUJ32NFJSOP7ZR6QLATDJG7AYHOHJMZGS6NA\m\maven-enforcer-plugin\target\it\ban-distribution-management\build.log, f:\jenkins\jenkins-slave\workspace\aven-enforcer_MENFORCER-288-GL5B4ERVFARMDDY5GUJ32NFJSOP7ZR6QLATDJG7AYHOHJMZGS6NA\m\maven-enforcer-plugin\target\it\ban-pom-dependency-version\build.log, f:\jenkins\jenkins-slave\workspace\aven-enforcer_MENFORCER-288-GL5B4ERVFARMDDY5GUJ32NFJSOP7ZR6QLATDJG7AYHOHJMZGS6NA\m\maven-enforcer-plugin\target\it\ban-transitive-dependencies-fail\build.log, f:\jenkins\jenkins-slave\workspace\aven-enforcer_MENFORCER-288-GL5B4ERVFARMDDY5GUJ32NFJSOP7ZR6QLATDJG7AYHOHJMZGS6NA\m\maven-enforcer-plugin\target\it\ban-transitive-dependencies\build.log, f:\jenkins\jenkins-slave\workspace\aven-enforcer_MENFORCER-288-GL5B4ERVFARMDDY5GUJ32NFJSOP7ZR6QLATDJG7AYHOHJMZGS6NA\m\maven-enforcer-plugin\target\it\banned-dependencies-versionrange-fail\build.log, f:\jenkins\jenkins-slave\workspace\aven-enforcer_MENFORCER-288-GL5B4ERVFARMDDY5GUJ32NFJSOP7ZR6QLATDJG7AYHOHJMZGS6NA\m\maven-enforcer-plugin\target\it\banned-dependencies-versionrange\build.log, f:\jenkins\jenkins-slave\workspace\aven-enforcer_MENFORCER-288-GL5B4ERVFARMDDY5GUJ32NFJSOP7ZR6QLATDJG7AYHOHJMZGS6NA\m\maven-enforcer-plugin\target\it\banned-dependencies-wildcards\build.log, f:\jenkins\jenkins-slave\workspace\aven-enforcer_MENFORCER-288-GL5B4ERVFARMDDY5GUJ32NFJSOP7ZR6QLATDJG7AYHOHJMZGS6NA\m\maven-enforcer-plugin\target\it\banned-dependencies\build.log, f:\jenkins\jenkins-slave\workspace\aven-enforcer_MENFORCER-288-GL5B4ERVFARMDDY5GUJ32NFJSOP7ZR6QLATDJG7AYHOHJMZGS6NA\m\maven-enforcer-plugin\target\it\banned-plugins\build.log, f:\jenkins\jenkins-slave\workspace\aven-enforcer_MENFORCER-288-GL5B4ERVFARMDDY5GUJ32NFJSOP7ZR6QLATDJG7AYHOHJMZGS6NA\m\maven-enforcer-plugin\target\it\builds_a_pom_noop\build.log, f:\jenkins\jenkins-slave\workspace\aven-enforcer_MENFORCER-288-GL5B4ERVFARMDDY5GUJ32NFJSOP7ZR6QLATDJG7AYHOHJMZGS6NA\m\maven-enforcer-plugin\target\it\cli-always-fail\build.log, f:\jenkins\jenkins-slave\workspace\aven-enforcer_MENFORCER-288-GL5B4ERVFARMDDY5GUJ32NFJSOP7ZR6QLATDJG7AYHOHJMZGS6NA\m\maven-enforcer-plugin\target\it\cli-always-pass\build.log, f:\jenkins\jenkins-slave\workspace\aven-enforcer_MENFORCER-288-GL5B4ERVFARMDDY5GUJ32NFJSOP7ZR6QLATDJG7AYHOHJMZGS6NA\m\maven-enforcer-plugin\target\it\dependencies_converge\build.log, f:\jenkins\jenkins-slave\workspace\aven-enforcer_MENFORCER-288-GL5B4ERVFARMDDY5GUJ32NFJSOP7ZR6QLATDJG7AYHOHJMZGS6NA\m\maven-enforcer-plugin\target\it\dependencies_not_converging\build.log, f:\jenkins\jenkins-slave\workspace\aven-enforcer_MENFORCER-288-GL5B4ERVFARMDDY5GUJ32NFJSOP7ZR6QLATDJG7AYHOHJMZGS6NA\m\maven-enforcer-plugin\target\it\dependencies_not_converging_test_scope\build.log, f:\jenkins\jenkins-slave\workspace\aven-enforcer_MENFORCER-288-GL5B4ERVFARMDDY5GUJ32NFJSOP7ZR6QLATDJG7AYHOHJMZGS6NA\m\maven-enforcer-plugin\target\it\display-info\build.log, f:\jenkins\jenkins-slave\workspace\aven-enforcer_MENFORCER-288-GL5B4ERVFARMDDY5GUJ32NFJSOP7ZR6QLATDJG7AYHOHJMZGS6NA\m\maven-enforcer-plugin\target\it\evaluate-beanshell\build.log, f:\jenkins\jenkins-slave\workspace\aven-enforcer_MENFORCER-288-GL5B4ERVFARMDDY5GUJ32NFJSOP7ZR6QLATDJG7AYHOHJMZGS6NA\m\maven-enforcer-plugin\target\it\multimodule\build.log, f:\jenkins\jenkins-slave\workspace\aven-enforcer_MENFORCER-288-GL5B4ERVFARMDDY5GUJ32NFJSOP7ZR6QLATDJG7AYHOHJMZGS6NA\m\maven-enforcer-plugin\target\it\require-active-profile-all\build.log, f:\jenkins\jenkins-slave\workspace\aven-enforcer_MENFORCER-288-GL5B4ERVFARMDDY5GUJ32NFJSOP7ZR6QLATDJG7AYHOHJMZGS6NA\m\maven-enforcer-plugin\target\it\require-active-profile-from-settings\build.log, f:\jenkins\jenkins-slave\workspace\aven-enforcer_MENFORCER-288-GL5B4ERVFARMDDY5GUJ32NFJSOP7ZR6QLATDJG7AYHOHJMZGS6NA\m\maven-enforcer-plugin\target\it\require-active-profile\build.log, f:\jenkins\jenkins-slave\workspace\aven-enforcer_MENFORCER-288-GL5B4ERVFARMDDY5GUJ32NFJSOP7ZR6QLATDJG7AYHOHJMZGS6NA\m\maven-enforcer-plugin\target\it\require-file-checksum\build.log, f:\jenkins\jenkins-slave\workspace\aven-enforcer_MENFORCER-288-GL5B4ERVFARMDDY5GUJ32NFJSOP7ZR6QLATDJG7AYHOHJMZGS6NA\m\maven-enforcer-plugin\target\it\require-files-dont-exist\build.log, f:\jenkins\jenkins-slave\workspace\aven-enforcer_MENFORCER-288-GL5B4ERVFARMDDY5GUJ32NFJSOP7ZR6QLATDJG7AYHOHJMZGS6NA\m\maven-enforcer-plugin\target\it\require-files-exist\build.log, f:\jenkins\jenkins-slave\workspace\aven-enforcer_MENFORCER-288-GL5B4ERVFARMDDY5GUJ32NFJSOP7ZR6QLATDJG7AYHOHJMZGS6NA\m\maven-enforcer-plugin\target\it\require-files-size\build.log, f:\jenkins\jenkins-slave\workspace\aven-enforcer_MENFORCER-288-GL5B4ERVFARMDDY5GUJ32NFJSOP7ZR6QLATDJG7AYHOHJMZGS6NA\m\maven-enforcer-plugin\target\it\require-java-version\build.log, f:\jenkins\jenkins-slave\workspace\aven-enforcer_MENFORCER-288-GL5B4ERVFARMDDY5GUJ32NFJSOP7ZR6QLATDJG7AYHOHJMZGS6NA\m\maven-enforcer-plugin\target\it\require-maven-version\build.log, f:\jenkins\jenkins-slave\workspace\aven-enforcer_MENFORCER-288-GL5B4ERVFARMDDY5GUJ32NFJSOP7ZR6QLATDJG7AYHOHJMZGS6NA\m\maven-enforcer-plugin\target\it\require-no-repositories-allow-plugin-repo\build.log, f:\jenkins\jenkins-slave\workspace\aven-enforcer_MENFORCER-288-GL5B4ERVFARMDDY5GUJ32NFJSOP7ZR6QLATDJG7AYHOHJMZGS6NA\m\maven-enforcer-plugin\target\it\require-no-repositories-allow-repo\build.log, f:\jenkins\jenkins-slave\workspace\aven-enforcer_MENFORCER-288-GL5B4ERVFARMDDY5GUJ32NFJSOP7ZR6QLATDJG7AYHOHJMZGS6NA\m\maven-enforcer-plugin\target\it\require-no-repositories\build.log, f:\jenkins\jenkins-slave\workspace\aven-enforcer_MENFORCER-288-GL5B4ERVFARMDDY5GUJ32NFJSOP7ZR6QLATDJG7AYHOHJMZGS6NA\m\maven-enforcer-plugin\target\it\require-no-repositories_failure\build.log, f:\jenkins\jenkins-slave\workspace\aven-enforcer_MENFORCER-288-GL5B4ERVFARMDDY5GUJ32NFJSOP7ZR6QLATDJG7AYHOHJMZGS6NA\m\maven-enforcer-plugin\target\it\require-no-repositories_failure_allowed-plugin-repo\build.log, f:\jenkins\jenkins-slave\workspace\aven-enforcer_MENFORCER-288-GL5B4ERVFARMDDY5GUJ32NFJSOP7ZR6QLATDJG7AYHOHJMZGS6NA\m\maven-enforcer-plugin\target\it\require-no-repositories_failure_plugin-repositories\build.log, f:\jenkins\jenkins-slave\workspace\aven-enforcer_MENFORCER-288-GL5B4ERVFARMDDY5GUJ32NFJSOP7ZR6QLATDJG7AYHOHJMZGS6NA\m\maven-enforcer-plugin\target\it\require-no-repositories_failure_repositories\build.log, f:\jenkins\jenkins-slave\workspace\aven-enforcer_MENFORCER-288-GL5B4ERVFARMDDY5GUJ32NFJSOP7ZR6QLATDJG7AYHOHJMZGS6NA\m\maven-enforcer-plugin\target\it\require-no-repositories_mm\build.log, f:\jenkins\jenkins-slave\workspace\aven-enforcer_MENFORCER-288-GL5B4ERVFARMDDY5GUJ32NFJSOP7ZR6QLATDJG7AYHOHJMZGS6NA\m\maven-enforcer-plugin\target\it\require-no-repositories_mm_ci\build.log, f:\jenkins\jenkins-slave\workspace\aven-enforcer_MENFORCER-288-GL5B4ERVFARMDDY5GUJ32NFJSOP7ZR6QLATDJG7AYHOHJMZGS6NA\m\maven-enforcer-plugin\target\it\require-plugin-versions-ci\build.log, f:\jenkins\jenkins-slave\workspace\aven-enforcer_MENFORCER-288-GL5B4ERVFARMDDY5GUJ32NFJSOP7ZR6QLATDJG7AYHOHJMZGS6NA\m\maven-enforcer-plugin\target\it\require-plugin-versions-custom-packaging\build.log, f:\jenkins\jenkins-slave\workspace\aven-enforcer_MENFORCER-288-GL5B4ERVFARMDDY5GUJ32NFJSOP7ZR6QLATDJG7AYHOHJMZGS6NA\m\maven-enforcer-plugin\target\it\require-plugin-versions-expressions\build.log, f:\jenkins\jenkins-slave\workspace\aven-enforcer_MENFORCER-288-GL5B4ERVFARMDDY5GUJ32NFJSOP7ZR6QLATDJG7AYHOHJMZGS6NA\m\maven-enforcer-plugin\target\it\require-plugin-versions-mm-ci-friendly\build.log, f:\jenkins\jenkins-slave\workspace\aven-enforcer_MENFORCER-288-GL5B4ERVFARMDDY5GUJ32NFJSOP7ZR6QLATDJG7AYHOHJMZGS6NA\m\maven-enforcer-plugin\target\it\require-plugin-versions-plugin-with-extensions\build.log, f:\jenkins\jenkins-slave\workspace\aven-enforcer_MENFORCER-288-GL5B4ERVFARMDDY5GUJ32NFJSOP7ZR6QLATDJG7AYHOHJMZGS6NA\m\maven-enforcer-plugin\target\it\require-plugin-versions-plugin-with-integration-test-lifecycle\build.log, f:\jenkins\jenkins-slave\workspace\aven-enforcer_MENFORCER-288-GL5B4ERVFARMDDY5GUJ32NFJSOP7ZR6QLATDJG7AYHOHJMZGS6NA\m\maven-enforcer-plugin\target\it\require-plugin-versions-projectGAVexpressions\build.log, f:\jenkins\jenkins-slave\workspace\aven-enforcer_MENFORCER-288-GL5B4ERVFARMDDY5GUJ32NFJSOP7ZR6QLATDJG7AYHOHJMZGS6NA\m\maven-enforcer-plugin\target\it\require-plugin-versions\build.log, f:\jenkins\jenkins-slave\workspace\aven-enforcer_MENFORCER-288-GL5B4ERVFARMDDY5GUJ32NFJSOP7ZR6QLATDJG7AYHOHJMZGS6NA\m\maven-enforcer-plugin\target\it\require-profile-ids-exist_failure\build.log, f:\jenkins\jenkins-slave\workspace\aven-enforcer_MENFORCER-288-GL5B4ERVFARMDDY5GUJ32NFJSOP7ZR6QLATDJG7AYHOHJMZGS6NA\m\maven-enforcer-plugin\target\it\require-profile-ids-exist_success\build.log, f:\jenkins\jenkins-slave\workspace\aven-enforcer_MENFORCER-288-GL5B4ERVFARMDDY5GUJ32NFJSOP7ZR6QLATDJG7AYHOHJMZGS6NA\m\maven-enforcer-plugin\target\it\require-property\build.log, f:\jenkins\jenkins-slave\workspace\aven-enforcer_MENFORCER-288-GL5B4ERVFARMDDY5GUJ32NFJSOP7ZR6QLATDJG7AYHOHJMZGS6NA\m\maven-enforcer-plugin\target\it\require-release-dependencies-excludes\build.log, f:\jenkins\jenkins-slave\workspace\aven-enforcer_MENFORCER-288-GL5B4ERVFARMDDY5GUJ32NFJSOP7ZR6QLATDJG7AYHOHJMZGS6NA\m\maven-enforcer-plugin\target\it\require-release-dependencies-excludes_failure\build.log, f:\jenkins\jenkins-slave\workspace\aven-enforcer_MENFORCER-288-GL5B4ERVFARMDDY5GUJ32NFJSOP7ZR6QLATDJG7AYHOHJMZGS6NA\m\maven-enforcer-plugin\target\it\require-release-dependencies\build.log, f:\jenkins\jenkins-slave\workspace\aven-enforcer_MENFORCER-288-GL5B4ERVFARMDDY5GUJ32NFJSOP7ZR6QLATDJG7AYHOHJMZGS6NA\m\maven-enforcer-plugin\target\it\require-release-version\build.log, f:\jenkins\jenkins-slave\workspace\aven-enforcer_MENFORCER-288-GL5B4ERVFARMDDY5GUJ32NFJSOP7ZR6QLATDJG7AYHOHJMZGS6NA\m\maven-enforcer-plugin\target\it\require-same-versions_failure\build.log, f:\jenkins\jenkins-slave\workspace\aven-enforcer_MENFORCER-288-GL5B4ERVFARMDDY5GUJ32NFJSOP7ZR6QLATDJG7AYHOHJMZGS6NA\m\maven-enforcer-plugin\target\it\require-same-versions_success\build.log, f:\jenkins\jenkins-slave\workspace\aven-enforcer_MENFORCER-288-GL5B4ERVFARMDDY5GUJ32NFJSOP7ZR6QLATDJG7AYHOHJMZGS6NA\m\maven-enforcer-plugin\target\it\require-snapshot-version_failure\build.log, f:\jenkins\jenkins-slave\workspace\aven-enforcer_MENFORCER-288-GL5B4ERVFARMDDY5GUJ32NFJSOP7ZR6QLATDJG7AYHOHJMZGS6NA\m\maven-enforcer-plugin\target\it\require-snapshot-version_success\build.log, f:\jenkins\jenkins-slave\workspace\aven-enforcer_MENFORCER-288-GL5B4ERVFARMDDY5GUJ32NFJSOP7ZR6QLATDJG7AYHOHJMZGS6NA\m\maven-enforcer-plugin\target\it\require-upper-bound-dependencies-managed_failure\build.log, f:\jenkins\jenkins-slave\workspace\aven-enforcer_MENFORCER-288-GL5B4ERVFARMDDY5GUJ32NFJSOP7ZR6QLATDJG7AYHOHJMZGS6NA\m\maven-enforcer-plugin\target\it\require-upper-bound-dependencies-managed_success\build.log, f:\jenkins\jenkins-slave\workspace\aven-enforcer_MENFORCER-288-GL5B4ERVFARMDDY5GUJ32NFJSOP7ZR6QLATDJG7AYHOHJMZGS6NA\m\maven-enforcer-plugin\target\it\require-upper-bound-dependencies-unique_failure\build.log, f:\jenkins\jenkins-slave\workspace\aven-enforcer_MENFORCER-288-GL5B4ERVFARMDDY5GUJ32NFJSOP7ZR6QLATDJG7AYHOHJMZGS6NA\m\maven-enforcer-plugin\target\it\require-upper-bound-dependencies-unique_success\build.log, f:\jenkins\jenkins-slave\workspace\aven-enforcer_MENFORCER-288-GL5B4ERVFARMDDY5GUJ32NFJSOP7ZR6QLATDJG7AYHOHJMZGS6NA\m\maven-enforcer-plugin\target\it\require-upper-bound-deps_failure\build.log, f:\jenkins\jenkins-slave\workspace\aven-enforcer_MENFORCER-288-GL5B4ERVFARMDDY5GUJ32NFJSOP7ZR6QLATDJG7AYHOHJMZGS6NA\m\maven-enforcer-plugin\target\it\require-upper-bound-deps_ignored\build.log, f:\jenkins\jenkins-slave\workspace\aven-enforcer_MENFORCER-288-GL5B4ERVFARMDDY5GUJ32NFJSOP7ZR6QLATDJG7AYHOHJMZGS6NA\m\maven-enforcer-plugin\target\it\require-upper-bound-deps_success\build.log, f:\jenkins\jenkins-slave\workspace\aven-enforcer_MENFORCER-288-GL5B4ERVFARMDDY5GUJ32NFJSOP7ZR6QLATDJG7AYHOHJMZGS6NA\m\maven-enforcer-plugin\target\it\resolve_collect_dependencies\build.log]
[windows-jdk8] Finished parsing Maven Invoker results (found 68)
[windows-jdk8] [withMaven] junitPublisher - Archive test results for Maven artifact org.apache.maven.enforcer:enforcer-api:3.0.0-SNAPSHOT generated by maven-surefire-plugin:test (default-test): m\enforcer-api\target\surefire-reports\*.xml
[windows-jdk8] Recording test results
[windows-jdk8] None of the test reports contained any result
[windows-jdk8] [withMaven] junitPublisher - Archive test results for Maven artifact org.apache.maven.enforcer:enforcer-rules:3.0.0-SNAPSHOT generated by maven-surefire-plugin:test (default-test): m\enforcer-rules\target\surefire-reports\*.xml
[windows-jdk8] Recording test results
[windows-jdk8] [withMaven] junitPublisher - Archive test results for Maven artifact org.apache.maven.plugins:maven-enforcer-plugin:3.0.0-SNAPSHOT generated by maven-surefire-plugin:test (default-test): m\maven-enforcer-plugin\target\surefire-reports\*.xml
[windows-jdk8] Recording test results
[Pipeline] [windows-jdk8] // withMaven
[Pipeline] [windows-jdk8] cleanWs
[windows-jdk8] [WS-CLEANUP] Deleting project workspace...[WS-CLEANUP] done
[Pipeline] [windows-jdk8] }
[Pipeline] [windows-jdk8] // stage
[Pipeline] [windows-jdk8] }
[Pipeline] [windows-jdk8] // node
[Pipeline] [windows-jdk8] }
[Pipeline] // parallel
[Pipeline] stage
[Pipeline] { (Notifications)
[Pipeline] echo
Build result: UNSTABLE
[Pipeline] jiraIssueSelector
[Pipeline] emailext
Mime
  • Unnamed multipart/mixed (inline, None, 0 bytes)
View raw message