maven-notifications mailing list archives

Site index · List index
Message view « Date » · « Thread »
Top « Date » · « Thread »
From Apache Jenkins Server <jenk...@builds.apache.org>
Subject Build failed in Jenkins: Maven TLP » maven-surefire » SUREFIRE-1593 #1
Date Fri, 16 Nov 2018 21:56:58 GMT
See https://builds.apache.org/job/maven-box/job/maven-surefire/job/SUREFIRE-1593/1/

No changes.

All tests passed

Build log:
[...truncated 6.96 MB...]
[windows-jdk7-maven3.5.x] [INFO] 
[windows-jdk7-maven3.5.x] [INFO] --- maven-compiler-plugin:3.7.0:compile (default-compile)
@ surefire-shadefire ---
[windows-jdk7-maven3.5.x] [INFO] No sources to compile
[windows-jdk7-maven3.5.x] [INFO] 
[windows-jdk7-maven3.5.x] [INFO] --- animal-sniffer-maven-plugin:1.17:check (signature-check)
@ surefire-shadefire ---
[windows-jdk7-maven3.5.x] [INFO] Checking unresolved references to org.codehaus.mojo.signature:java17:1.0
[windows-jdk7-maven3.5.x] [INFO] 
[windows-jdk7-maven3.5.x] [INFO] --- maven-resources-plugin:3.1.0:testResources (default-testResources)
@ surefire-shadefire ---
[windows-jdk7-maven3.5.x] [INFO] Using 'UTF-8' encoding to copy filtered resources.
[windows-jdk7-maven3.5.x] [INFO] skip non existing resourceDirectory F:\jenkins\jenkins-slave\workspace\aven-surefire_SUREFIRE-1593-3IZ2FI6QAWKKKGKPO3ATISHDKVXIAGIYCSR3I7CWJVHRAR5VAQ3Q\surefire-shadefire\src\test\resources
[windows-jdk7-maven3.5.x] [INFO] Copying 3 resources
[windows-jdk7-maven3.5.x] [INFO] 
[windows-jdk7-maven3.5.x] [INFO] --- maven-compiler-plugin:3.7.0:testCompile (default-testCompile)
@ surefire-shadefire ---
[windows-jdk7-maven3.5.x] [INFO] No sources to compile
[windows-jdk7-maven3.5.x] [INFO] 
[windows-jdk7-maven3.5.x] [INFO] --- maven-surefire-plugin:2.12.4:test (default-test) @ surefire-shadefire
---
[windows-jdk7-maven3.5.x] [INFO] Tests are skipped.
[windows-jdk7-maven3.5.x] [INFO] 
[windows-jdk7-maven3.5.x] [INFO] --- maven-jar-plugin:3.1.0:jar (default-jar) @ surefire-shadefire
---
[windows-jdk7-maven3.5.x] [INFO] Building jar: F:\jenkins\jenkins-slave\workspace\aven-surefire_SUREFIRE-1593-3IZ2FI6QAWKKKGKPO3ATISHDKVXIAGIYCSR3I7CWJVHRAR5VAQ3Q\surefire-shadefire\target\surefire-shadefire-3.0.0-M2-SNAPSHOT.jar
[windows-jdk7-maven3.5.x] [INFO] 
[windows-jdk7-maven3.5.x] [INFO] --- maven-site-plugin:3.7.1:attach-descriptor (attach-descriptor)
@ surefire-shadefire ---
[windows-jdk7-maven3.5.x] [INFO] Skipping because packaging 'jar' is not pom.
[windows-jdk7-maven3.5.x] [INFO] 
[windows-jdk7-maven3.5.x] [INFO] --- maven-shade-plugin:3.1.1:shade (default) @ surefire-shadefire
---
[windows-jdk7-maven3.5.x] [INFO] Including org.apache.maven.surefire:surefire-junit3:jar:2.12.4
in the shaded jar.
[windows-jdk7-maven3.5.x] [INFO] Including org.apache.maven.surefire:surefire-api:jar:2.12.4
in the shaded jar.
[windows-jdk7-maven3.5.x] [INFO] Including org.apache.maven.surefire:surefire-booter:jar:2.12.4
in the shaded jar.
[windows-jdk7-maven3.5.x] [INFO] Replacing original artifact with shaded artifact.
[windows-jdk7-maven3.5.x] [INFO] Replacing F:\jenkins\jenkins-slave\workspace\aven-surefire_SUREFIRE-1593-3IZ2FI6QAWKKKGKPO3ATISHDKVXIAGIYCSR3I7CWJVHRAR5VAQ3Q\surefire-shadefire\target\surefire-shadefire-3.0.0-M2-SNAPSHOT.jar
with F:\jenkins\jenkins-slave\workspace\aven-surefire_SUREFIRE-1593-3IZ2FI6QAWKKKGKPO3ATISHDKVXIAGIYCSR3I7CWJVHRAR5VAQ3Q\surefire-shadefire\target\surefire-shadefire-3.0.0-M2-SNAPSHOT-shaded.jar
[windows-jdk7-maven3.5.x] [INFO] Dependency-reduced POM written at: F:\jenkins\jenkins-slave\workspace\aven-surefire_SUREFIRE-1593-3IZ2FI6QAWKKKGKPO3ATISHDKVXIAGIYCSR3I7CWJVHRAR5VAQ3Q\surefire-shadefire\dependency-reduced-pom.xml
[windows-jdk7-maven3.5.x] [INFO] 
[windows-jdk7-maven3.5.x] [INFO] --- maven-checkstyle-plugin:3.0.0:check (checkstyle-check)
@ surefire-shadefire ---
[windows-jdk7-maven3.5.x] [INFO] 
[windows-jdk7-maven3.5.x] [INFO] --- maven-install-plugin:2.5.2:install (default-install)
@ surefire-shadefire ---
[windows-jdk7-maven3.5.x] [INFO] Installing F:\jenkins\jenkins-slave\workspace\aven-surefire_SUREFIRE-1593-3IZ2FI6QAWKKKGKPO3ATISHDKVXIAGIYCSR3I7CWJVHRAR5VAQ3Q\surefire-shadefire\target\surefire-shadefire-3.0.0-M2-SNAPSHOT.jar
to f:\jenkins\jenkins-slave\workspace\aven-surefire_SUREFIRE-1593-3IZ2FI6QAWKKKGKPO3ATISHDKVXIAGIYCSR3I7CWJVHRAR5VAQ3Q\.m2\org\apache\maven\surefire\surefire-shadefire\3.0.0-M2-SNAPSHOT\surefire-shadefire-3.0.0-M2-SNAPSHOT.jar
[windows-jdk7-maven3.5.x] [INFO] Installing F:\jenkins\jenkins-slave\workspace\aven-surefire_SUREFIRE-1593-3IZ2FI6QAWKKKGKPO3ATISHDKVXIAGIYCSR3I7CWJVHRAR5VAQ3Q\surefire-shadefire\dependency-reduced-pom.xml
to f:\jenkins\jenkins-slave\workspace\aven-surefire_SUREFIRE-1593-3IZ2FI6QAWKKKGKPO3ATISHDKVXIAGIYCSR3I7CWJVHRAR5VAQ3Q\.m2\org\apache\maven\surefire\surefire-shadefire\3.0.0-M2-SNAPSHOT\surefire-shadefire-3.0.0-M2-SNAPSHOT.pom
[windows-jdk7-maven3.5.x] [INFO] 
[windows-jdk7-maven3.5.x] [INFO] --- jacoco-maven-plugin:0.8.2:report (default-cli) @ surefire-shadefire
---
[windows-jdk7-maven3.5.x] [INFO] Skipping JaCoCo execution because property jacoco.skip is
set.
[windows-jdk7-maven3.5.x] [INFO] 
[windows-jdk7-maven3.5.x] [INFO] ------------------------------------------------------------------------
[windows-jdk7-maven3.5.x] [INFO] Building SureFire Booter 3.0.0-M2-SNAPSHOT
[windows-jdk7-maven3.5.x] [INFO] ------------------------------------------------------------------------
[windows-jdk7-maven3.5.x] [INFO] Downloading from central: https://repo.maven.apache.org/maven2/org/apache/maven/plugins/maven-dependency-plugin/3.1.1/maven-dependency-plugin-3.1.1.pom
[windows-jdk7-maven3.5.x] [INFO] Downloaded from central: https://repo.maven.apache.org/maven2/org/apache/maven/plugins/maven-dependency-plugin/3.1.1/maven-dependency-plugin-3.1.1.pom
(15 kB at 474 kB/s)
[windows-jdk7-maven3.5.x] [INFO] Downloading from central: https://repo.maven.apache.org/maven2/org/apache/maven/plugins/maven-dependency-plugin/3.1.1/maven-dependency-plugin-3.1.1.jar
[windows-jdk7-maven3.5.x] [INFO] Downloaded from central: https://repo.maven.apache.org/maven2/org/apache/maven/plugins/maven-dependency-plugin/3.1.1/maven-dependency-plugin-3.1.1.jar
(167 kB at 3.8 MB/s)
[windows-jdk7-maven3.5.x] [INFO] Downloading from central: https://repo.maven.apache.org/maven2/org/apache/commons/commons-lang3/3.8.1/commons-lang3-3.8.1.pom
[windows-jdk7-maven3.5.x] [INFO] Downloaded from central: https://repo.maven.apache.org/maven2/org/apache/commons/commons-lang3/3.8.1/commons-lang3-3.8.1.pom
(28 kB at 1.2 MB/s)
[windows-jdk7-maven3.5.x] [INFO] Downloading from central: https://repo.maven.apache.org/maven2/org/apache/commons/commons-parent/47/commons-parent-47.pom
[windows-jdk7-maven3.5.x] [INFO] Downloaded from central: https://repo.maven.apache.org/maven2/org/apache/commons/commons-parent/47/commons-parent-47.pom
(78 kB at 1.7 MB/s)
[windows-jdk7-maven3.5.x] [INFO] Downloading from central: https://repo.maven.apache.org/maven2/commons-io/commons-io/2.6/commons-io-2.6.pom
[windows-jdk7-maven3.5.x] [INFO] Downloaded from central: https://repo.maven.apache.org/maven2/commons-io/commons-io/2.6/commons-io-2.6.pom
(14 kB at 509 kB/s)
[windows-jdk7-maven3.5.x] [INFO] Downloading from central: https://repo.maven.apache.org/maven2/org/mockito/mockito-core/2.21.0/mockito-core-2.21.0.pom
[windows-jdk7-maven3.5.x] [INFO] Downloaded from central: https://repo.maven.apache.org/maven2/org/mockito/mockito-core/2.21.0/mockito-core-2.21.0.pom
(17 kB at 704 kB/s)
[windows-jdk7-maven3.5.x] [INFO] Downloading from central: https://repo.maven.apache.org/maven2/net/bytebuddy/byte-buddy/1.8.15/byte-buddy-1.8.15.pom
[windows-jdk7-maven3.5.x] [INFO] Downloaded from central: https://repo.maven.apache.org/maven2/net/bytebuddy/byte-buddy/1.8.15/byte-buddy-1.8.15.pom
(9.3 kB at 371 kB/s)
[windows-jdk7-maven3.5.x] [INFO] Downloading from central: https://repo.maven.apache.org/maven2/net/bytebuddy/byte-buddy-parent/1.8.15/byte-buddy-parent-1.8.15.pom
[windows-jdk7-maven3.5.x] [INFO] Downloaded from central: https://repo.maven.apache.org/maven2/net/bytebuddy/byte-buddy-parent/1.8.15/byte-buddy-parent-1.8.15.pom
(27 kB at 930 kB/s)
[windows-jdk7-maven3.5.x] [INFO] Downloading from central: https://repo.maven.apache.org/maven2/net/bytebuddy/byte-buddy-agent/1.8.15/byte-buddy-agent-1.8.15.pom
[windows-jdk7-maven3.5.x] [INFO] Downloaded from central: https://repo.maven.apache.org/maven2/net/bytebuddy/byte-buddy-agent/1.8.15/byte-buddy-agent-1.8.15.pom
(4.3 kB at 181 kB/s)
[windows-jdk7-maven3.5.x] [INFO] Downloading from central: https://repo.maven.apache.org/maven2/org/objenesis/objenesis/2.6/objenesis-2.6.pom
[windows-jdk7-maven3.5.x] [INFO] Downloaded from central: https://repo.maven.apache.org/maven2/org/objenesis/objenesis/2.6/objenesis-2.6.pom
(2.8 kB at 111 kB/s)
[windows-jdk7-maven3.5.x] [INFO] Downloading from central: https://repo.maven.apache.org/maven2/org/objenesis/objenesis-parent/2.6/objenesis-parent-2.6.pom
[windows-jdk7-maven3.5.x] [INFO] Downloaded from central: https://repo.maven.apache.org/maven2/org/objenesis/objenesis-parent/2.6/objenesis-parent-2.6.pom
(17 kB at 570 kB/s)
[windows-jdk7-maven3.5.x] [INFO] Downloading from central: https://repo.maven.apache.org/maven2/org/powermock/powermock-core/2.0.0-RC.3/powermock-core-2.0.0-RC.3.pom
[windows-jdk7-maven3.5.x] [INFO] Downloaded from central: https://repo.maven.apache.org/maven2/org/powermock/powermock-core/2.0.0-RC.3/powermock-core-2.0.0-RC.3.pom
(6.4 kB at 268 kB/s)
[windows-jdk7-maven3.5.x] [INFO] Downloading from central: https://repo.maven.apache.org/maven2/org/powermock/powermock-reflect/2.0.0-RC.3/powermock-reflect-2.0.0-RC.3.pom
[windows-jdk7-maven3.5.x] [INFO] Downloaded from central: https://repo.maven.apache.org/maven2/org/powermock/powermock-reflect/2.0.0-RC.3/powermock-reflect-2.0.0-RC.3.pom
(6.2 kB at 271 kB/s)
[windows-jdk7-maven3.5.x] [INFO] Downloading from central: https://repo.maven.apache.org/maven2/org/objenesis/objenesis/3.0.1/objenesis-3.0.1.pom
[windows-jdk7-maven3.5.x] [INFO] Downloaded from central: https://repo.maven.apache.org/maven2/org/objenesis/objenesis/3.0.1/objenesis-3.0.1.pom
(3.5 kB at 153 kB/s)
[windows-jdk7-maven3.5.x] [INFO] Downloading from central: https://repo.maven.apache.org/maven2/org/objenesis/objenesis-parent/3.0.1/objenesis-parent-3.0.1.pom
[windows-jdk7-maven3.5.x] [INFO] Downloaded from central: https://repo.maven.apache.org/maven2/org/objenesis/objenesis-parent/3.0.1/objenesis-parent-3.0.1.pom
(17 kB at 636 kB/s)
[windows-jdk7-maven3.5.x] [INFO] Downloading from central: https://repo.maven.apache.org/maven2/net/bytebuddy/byte-buddy/1.9.3/byte-buddy-1.9.3.pom
[windows-jdk7-maven3.5.x] [INFO] Downloaded from central: https://repo.maven.apache.org/maven2/net/bytebuddy/byte-buddy/1.9.3/byte-buddy-1.9.3.pom
(10 kB at 409 kB/s)
[windows-jdk7-maven3.5.x] [INFO] Downloading from central: https://repo.maven.apache.org/maven2/net/bytebuddy/byte-buddy-parent/1.9.3/byte-buddy-parent-1.9.3.pom
[windows-jdk7-maven3.5.x] [INFO] Downloaded from central: https://repo.maven.apache.org/maven2/net/bytebuddy/byte-buddy-parent/1.9.3/byte-buddy-parent-1.9.3.pom
(34 kB at 1.1 MB/s)
[windows-jdk7-maven3.5.x] [INFO] Downloading from central: https://repo.maven.apache.org/maven2/net/bytebuddy/byte-buddy-agent/1.9.3/byte-buddy-agent-1.9.3.pom
[windows-jdk7-maven3.5.x] [INFO] Downloaded from central: https://repo.maven.apache.org/maven2/net/bytebuddy/byte-buddy-agent/1.9.3/byte-buddy-agent-1.9.3.pom
(6.0 kB at 177 kB/s)
[windows-jdk7-maven3.5.x] [INFO] Downloading from central: https://repo.maven.apache.org/maven2/org/javassist/javassist/3.24.0-GA/javassist-3.24.0-GA.pom
[windows-jdk7-maven3.5.x] [INFO] Downloaded from central: https://repo.maven.apache.org/maven2/org/javassist/javassist/3.24.0-GA/javassist-3.24.0-GA.pom
(11 kB at 384 kB/s)
[windows-jdk7-maven3.5.x] [INFO] Downloading from central: https://repo.maven.apache.org/maven2/org/powermock/powermock-module-junit4/2.0.0-RC.3/powermock-module-junit4-2.0.0-RC.3.pom
[windows-jdk7-maven3.5.x] [INFO] Downloaded from central: https://repo.maven.apache.org/maven2/org/powermock/powermock-module-junit4/2.0.0-RC.3/powermock-module-junit4-2.0.0-RC.3.pom
(6.4 kB at 256 kB/s)
[windows-jdk7-maven3.5.x] [INFO] Downloading from central: https://repo.maven.apache.org/maven2/org/powermock/powermock-module-junit4-common/2.0.0-RC.3/powermock-module-junit4-common-2.0.0-RC.3.pom
[windows-jdk7-maven3.5.x] [INFO] Downloaded from central: https://repo.maven.apache.org/maven2/org/powermock/powermock-module-junit4-common/2.0.0-RC.3/powermock-module-junit4-common-2.0.0-RC.3.pom
(6.6 kB at 275 kB/s)
[windows-jdk7-maven3.5.x] [INFO] Downloading from central: https://repo.maven.apache.org/maven2/org/powermock/powermock-api-mockito2/2.0.0-RC.3/powermock-api-mockito2-2.0.0-RC.3.pom
[windows-jdk7-maven3.5.x] [INFO] Downloaded from central: https://repo.maven.apache.org/maven2/org/powermock/powermock-api-mockito2/2.0.0-RC.3/powermock-api-mockito2-2.0.0-RC.3.pom
(6.4 kB at 235 kB/s)
[windows-jdk7-maven3.5.x] [INFO] Downloading from central: https://repo.maven.apache.org/maven2/org/powermock/powermock-api-support/2.0.0-RC.3/powermock-api-support-2.0.0-RC.3.pom
[windows-jdk7-maven3.5.x] [INFO] Downloaded from central: https://repo.maven.apache.org/maven2/org/powermock/powermock-api-support/2.0.0-RC.3/powermock-api-support-2.0.0-RC.3.pom
(6.1 kB at 209 kB/s)
[windows-jdk7-maven3.5.x] [INFO] Downloading from central: https://repo.maven.apache.org/maven2/org/apache/commons/commons-lang3/3.8.1/commons-lang3-3.8.1.jar
[windows-jdk7-maven3.5.x] [INFO] Downloading from central: https://repo.maven.apache.org/maven2/commons-io/commons-io/2.6/commons-io-2.6.jar
[windows-jdk7-maven3.5.x] [INFO] Downloading from central: https://repo.maven.apache.org/maven2/org/mockito/mockito-core/2.21.0/mockito-core-2.21.0.jar
[windows-jdk7-maven3.5.x] [INFO] Downloading from central: https://repo.maven.apache.org/maven2/net/bytebuddy/byte-buddy-agent/1.8.15/byte-buddy-agent-1.8.15.jar
[windows-jdk7-maven3.5.x] [INFO] Downloading from central: https://repo.maven.apache.org/maven2/net/bytebuddy/byte-buddy/1.8.15/byte-buddy-1.8.15.jar
[windows-jdk7-maven3.5.x] [INFO] Downloaded from central: https://repo.maven.apache.org/maven2/commons-io/commons-io/2.6/commons-io-2.6.jar
(215 kB at 2.6 MB/s)
[windows-jdk7-maven3.5.x] [INFO] Downloading from central: https://repo.maven.apache.org/maven2/org/objenesis/objenesis/2.6/objenesis-2.6.jar
[windows-jdk7-maven3.5.x] [INFO] Downloaded from central: https://repo.maven.apache.org/maven2/org/apache/commons/commons-lang3/3.8.1/commons-lang3-3.8.1.jar
(502 kB at 4.7 MB/s)
[windows-jdk7-maven3.5.x] [INFO] Downloading from central: https://repo.maven.apache.org/maven2/org/powermock/powermock-core/2.0.0-RC.3/powermock-core-2.0.0-RC.3.jar
[windows-jdk7-maven3.5.x] [INFO] Downloaded from central: https://repo.maven.apache.org/maven2/org/objenesis/objenesis/2.6/objenesis-2.6.jar
(56 kB at 520 kB/s)
[windows-jdk7-maven3.5.x] [INFO] Downloading from central: https://repo.maven.apache.org/maven2/org/powermock/powermock-reflect/2.0.0-RC.3/powermock-reflect-2.0.0-RC.3.jar
[windows-jdk7-maven3.5.x] [INFO] Downloaded from central: https://repo.maven.apache.org/maven2/org/mockito/mockito-core/2.21.0/mockito-core-2.21.0.jar
(564 kB at 5.1 MB/s)
[windows-jdk7-maven3.5.x] [INFO] Downloading from central: https://repo.maven.apache.org/maven2/org/javassist/javassist/3.24.0-GA/javassist-3.24.0-GA.jar
[windows-jdk7-maven3.5.x] [INFO] Downloaded from central: https://repo.maven.apache.org/maven2/org/powermock/powermock-core/2.0.0-RC.3/powermock-core-2.0.0-RC.3.jar
(198 kB at 1.4 MB/s)
[windows-jdk7-maven3.5.x] [INFO] Downloading from central: https://repo.maven.apache.org/maven2/org/powermock/powermock-module-junit4/2.0.0-RC.3/powermock-module-junit4-2.0.0-RC.3.jar
[windows-jdk7-maven3.5.x] [INFO] Downloaded from central: https://repo.maven.apache.org/maven2/org/powermock/powermock-reflect/2.0.0-RC.3/powermock-reflect-2.0.0-RC.3.jar
(66 kB at 428 kB/s)
[windows-jdk7-maven3.5.x] [INFO] Downloading from central: https://repo.maven.apache.org/maven2/org/powermock/powermock-module-junit4-common/2.0.0-RC.3/powermock-module-junit4-common-2.0.0-RC.3.jar
[windows-jdk7-maven3.5.x] [INFO] Downloaded from central: https://repo.maven.apache.org/maven2/org/javassist/javassist/3.24.0-GA/javassist-3.24.0-GA.jar
(778 kB at 3.1 MB/s)
[windows-jdk7-maven3.5.x] [INFO] Downloading from central: https://repo.maven.apache.org/maven2/org/powermock/powermock-api-mockito2/2.0.0-RC.3/powermock-api-mockito2-2.0.0-RC.3.jar
[windows-jdk7-maven3.5.x] [INFO] Downloaded from central: https://repo.maven.apache.org/maven2/net/bytebuddy/byte-buddy-agent/1.8.15/byte-buddy-agent-1.8.15.jar
(42 kB at 166 kB/s)
[windows-jdk7-maven3.5.x] [INFO] Downloading from central: https://repo.maven.apache.org/maven2/org/powermock/powermock-api-support/2.0.0-RC.3/powermock-api-support-2.0.0-RC.3.jar
[windows-jdk7-maven3.5.x] [INFO] Downloaded from central: https://repo.maven.apache.org/maven2/net/bytebuddy/byte-buddy/1.8.15/byte-buddy-1.8.15.jar
(3.0 MB at 11 MB/s)
[windows-jdk7-maven3.5.x] [INFO] Downloaded from central: https://repo.maven.apache.org/maven2/org/powermock/powermock-module-junit4-common/2.0.0-RC.3/powermock-module-junit4-common-2.0.0-RC.3.jar
(18 kB at 64 kB/s)
[windows-jdk7-maven3.5.x] [INFO] Downloaded from central: https://repo.maven.apache.org/maven2/org/powermock/powermock-api-mockito2/2.0.0-RC.3/powermock-api-mockito2-2.0.0-RC.3.jar
(88 kB at 308 kB/s)
[windows-jdk7-maven3.5.x] [INFO] Downloaded from central: https://repo.maven.apache.org/maven2/org/powermock/powermock-module-junit4/2.0.0-RC.3/powermock-module-junit4-2.0.0-RC.3.jar
(48 kB at 153 kB/s)
[windows-jdk7-maven3.5.x] [INFO] Downloaded from central: https://repo.maven.apache.org/maven2/org/powermock/powermock-api-support/2.0.0-RC.3/powermock-api-support-2.0.0-RC.3.jar
(22 kB at 63 kB/s)
[windows-jdk7-maven3.5.x] [INFO] 
[windows-jdk7-maven3.5.x] [INFO] --- maven-clean-plugin:3.1.0:clean (default-clean) @ surefire-booter
---
[windows-jdk7-maven3.5.x] [INFO] 
[windows-jdk7-maven3.5.x] [INFO] --- maven-enforcer-plugin:3.0.0-M2:enforce (enforce-maven-version)
@ surefire-booter ---
[windows-jdk7-maven3.5.x] [INFO] 
[windows-jdk7-maven3.5.x] [INFO] --- maven-enforcer-plugin:3.0.0-M2:enforce (enforce-bytecode-version)
@ surefire-booter ---
[windows-jdk7-maven3.5.x] [INFO] Restricted to JDK 1.7 yet org.javassist:javassist:jar:3.24.0-GA:test
contains javassist/ByteArrayClassPath$1.class targeted to JDK 1.8
[windows-jdk7-maven3.5.x] [WARNING] Rule 0: org.apache.maven.plugins.enforcer.EnforceBytecodeVersion
failed with message:
[windows-jdk7-maven3.5.x] Found Banned Dependency: org.javassist:javassist:jar:3.24.0-GA
[windows-jdk7-maven3.5.x] Use 'mvn dependency:tree' to locate the source of the banned dependencies.
[windows-jdk7-maven3.5.x] [INFO] ------------------------------------------------------------------------
[windows-jdk7-maven3.5.x] [INFO] Reactor Summary:
[windows-jdk7-maven3.5.x] [INFO] 
[windows-jdk7-maven3.5.x] [INFO] Apache Maven Surefire .............................. SUCCESS
[ 38.896 s]
[windows-jdk7-maven3.5.x] [INFO] SureFire Logger API ................................ SUCCESS
[  8.734 s]
[windows-jdk7-maven3.5.x] [INFO] SureFire API ....................................... SUCCESS
[ 14.636 s]
[windows-jdk7-maven3.5.x] [INFO] ShadeFire JUnit3 Provider .......................... SUCCESS
[  3.223 s]
[windows-jdk7-maven3.5.x] [INFO] SureFire Booter .................................... FAILURE
[  1.958 s]
[windows-jdk7-maven3.5.x] [INFO] Maven Surefire Test-Grouping Support ............... SKIPPED
[windows-jdk7-maven3.5.x] [INFO] SureFire Providers ................................. SKIPPED
[windows-jdk7-maven3.5.x] [INFO] Shared JUnit3 Provider Code ........................ SKIPPED
[windows-jdk7-maven3.5.x] [INFO] Shared Java 5 Provider Base ........................ SKIPPED
[windows-jdk7-maven3.5.x] [INFO] Shared JUnit4 Provider Code ........................ SKIPPED
[windows-jdk7-maven3.5.x] [INFO] Shared JUnit48 Provider Code ....................... SKIPPED
[windows-jdk7-maven3.5.x] [INFO] SureFire JUnit Runner .............................. SKIPPED
[windows-jdk7-maven3.5.x] [INFO] SureFire JUnit4 Runner ............................. SKIPPED
[windows-jdk7-maven3.5.x] [INFO] Maven Surefire Common .............................. SKIPPED
[windows-jdk7-maven3.5.x] [INFO] SureFire JUnitCore Runner .......................... SKIPPED
[windows-jdk7-maven3.5.x] [INFO] SureFire JUnit Platform Runner ..................... SKIPPED
[windows-jdk7-maven3.5.x] [INFO] SureFire TestNG Utils .............................. SKIPPED
[windows-jdk7-maven3.5.x] [INFO] SureFire TestNG Runner ............................. SKIPPED
[windows-jdk7-maven3.5.x] [INFO] Surefire Report Parser ............................. SKIPPED
[windows-jdk7-maven3.5.x] [INFO] Maven Surefire Plugin .............................. SKIPPED
[windows-jdk7-maven3.5.x] [INFO] Maven Failsafe Plugin .............................. SKIPPED
[windows-jdk7-maven3.5.x] [INFO] Maven Surefire Report Plugin ....................... SKIPPED
[windows-jdk7-maven3.5.x] [INFO] Maven Surefire Integration Tests ................... SKIPPED
[windows-jdk7-maven3.5.x] [INFO] ------------------------------------------------------------------------
[windows-jdk7-maven3.5.x] [INFO] BUILD FAILURE
[windows-jdk7-maven3.5.x] [INFO] ------------------------------------------------------------------------
[windows-jdk7-maven3.5.x] [INFO] Total time: 01:09 min
[windows-jdk7-maven3.5.x] [INFO] Finished at: 2018-11-16T13:56:57-08:00
[windows-jdk7-maven3.5.x] [INFO] Final Memory: 47M/138M
[windows-jdk7-maven3.5.x] [INFO] ------------------------------------------------------------------------
[windows-jdk7-maven3.5.x] [ERROR] Failed to execute goal org.apache.maven.plugins:maven-enforcer-plugin:3.0.0-M2:enforce
(enforce-bytecode-version) on project surefire-booter: Some Enforcer rules have failed. Look
above for specific messages explaining why the rule failed. -> [Help 1]
[windows-jdk7-maven3.5.x] org.apache.maven.lifecycle.LifecycleExecutionException: Failed to
execute goal org.apache.maven.plugins:maven-enforcer-plugin:3.0.0-M2:enforce (enforce-bytecode-version)
on project surefire-booter: Some Enforcer rules have failed. Look above for specific messages
explaining why the rule failed.
[windows-jdk7-maven3.5.x]     at org.apache.maven.lifecycle.internal.MojoExecutor.execute
(MojoExecutor.java:213)
[windows-jdk7-maven3.5.x]     at org.apache.maven.lifecycle.internal.MojoExecutor.execute
(MojoExecutor.java:154)
[windows-jdk7-maven3.5.x]     at org.apache.maven.lifecycle.internal.MojoExecutor.execute
(MojoExecutor.java:146)
[windows-jdk7-maven3.5.x]     at org.apache.maven.lifecycle.internal.LifecycleModuleBuilder.buildProject
(LifecycleModuleBuilder.java:117)
[windows-jdk7-maven3.5.x]     at org.apache.maven.lifecycle.internal.LifecycleModuleBuilder.buildProject
(LifecycleModuleBuilder.java:81)
[windows-jdk7-maven3.5.x]     at org.apache.maven.lifecycle.internal.builder.singlethreaded.SingleThreadedBuilder.build
(SingleThreadedBuilder.java:51)
[windows-jdk7-maven3.5.x]     at org.apache.maven.lifecycle.internal.LifecycleStarter.execute
(LifecycleStarter.java:128)
[windows-jdk7-maven3.5.x]     at org.apache.maven.DefaultMaven.doExecute (DefaultMaven.java:309)
[windows-jdk7-maven3.5.x]     at org.apache.maven.DefaultMaven.doExecute (DefaultMaven.java:194)
[windows-jdk7-maven3.5.x]     at org.apache.maven.DefaultMaven.execute (DefaultMaven.java:107)
[windows-jdk7-maven3.5.x]     at org.apache.maven.cli.MavenCli.execute (MavenCli.java:955)
[windows-jdk7-maven3.5.x]     at org.apache.maven.cli.MavenCli.doMain (MavenCli.java:290)
[windows-jdk7-maven3.5.x]     at org.apache.maven.cli.MavenCli.main (MavenCli.java:194)
[windows-jdk7-maven3.5.x]     at sun.reflect.NativeMethodAccessorImpl.invoke0 (Native Method)
[windows-jdk7-maven3.5.x]     at sun.reflect.NativeMethodAccessorImpl.invoke (NativeMethodAccessorImpl.java:62)
[windows-jdk7-maven3.5.x]     at sun.reflect.DelegatingMethodAccessorImpl.invoke (DelegatingMethodAccessorImpl.java:43)
[windows-jdk7-maven3.5.x]     at java.lang.reflect.Method.invoke (Method.java:498)
[windows-jdk7-maven3.5.x]     at org.codehaus.plexus.classworlds.launcher.Launcher.launchEnhanced
(Launcher.java:289)
[windows-jdk7-maven3.5.x]     at org.codehaus.plexus.classworlds.launcher.Launcher.launch
(Launcher.java:229)
[windows-jdk7-maven3.5.x]     at org.codehaus.plexus.classworlds.launcher.Launcher.mainWithExitCode
(Launcher.java:415)
[windows-jdk7-maven3.5.x]     at org.codehaus.plexus.classworlds.launcher.Launcher.main (Launcher.java:356)
[windows-jdk7-maven3.5.x] Caused by: org.apache.maven.plugin.MojoExecutionException: Some
Enforcer rules have failed. Look above for specific messages explaining why the rule failed.
[windows-jdk7-maven3.5.x]     at org.apache.maven.plugins.enforcer.EnforceMojo.execute (EnforceMojo.java:235)
[windows-jdk7-maven3.5.x]     at org.apache.maven.plugin.DefaultBuildPluginManager.executeMojo
(DefaultBuildPluginManager.java:134)
[windows-jdk7-maven3.5.x]     at org.apache.maven.lifecycle.internal.MojoExecutor.execute
(MojoExecutor.java:208)
[windows-jdk7-maven3.5.x]     at org.apache.maven.lifecycle.internal.MojoExecutor.execute
(MojoExecutor.java:154)
[windows-jdk7-maven3.5.x]     at org.apache.maven.lifecycle.internal.MojoExecutor.execute
(MojoExecutor.java:146)
[windows-jdk7-maven3.5.x]     at org.apache.maven.lifecycle.internal.LifecycleModuleBuilder.buildProject
(LifecycleModuleBuilder.java:117)
[windows-jdk7-maven3.5.x]     at org.apache.maven.lifecycle.internal.LifecycleModuleBuilder.buildProject
(LifecycleModuleBuilder.java:81)
[windows-jdk7-maven3.5.x]     at org.apache.maven.lifecycle.internal.builder.singlethreaded.SingleThreadedBuilder.build
(SingleThreadedBuilder.java:51)
[windows-jdk7-maven3.5.x]     at org.apache.maven.lifecycle.internal.LifecycleStarter.execute
(LifecycleStarter.java:128)
[windows-jdk7-maven3.5.x]     at org.apache.maven.DefaultMaven.doExecute (DefaultMaven.java:309)
[windows-jdk7-maven3.5.x]     at org.apache.maven.DefaultMaven.doExecute (DefaultMaven.java:194)
[windows-jdk7-maven3.5.x]     at org.apache.maven.DefaultMaven.execute (DefaultMaven.java:107)
[windows-jdk7-maven3.5.x]     at org.apache.maven.cli.MavenCli.execute (MavenCli.java:955)
[windows-jdk7-maven3.5.x]     at org.apache.maven.cli.MavenCli.doMain (MavenCli.java:290)
[windows-jdk7-maven3.5.x]     at org.apache.maven.cli.MavenCli.main (MavenCli.java:194)
[windows-jdk7-maven3.5.x]     at sun.reflect.NativeMethodAccessorImpl.invoke0 (Native Method)
[windows-jdk7-maven3.5.x]     at sun.reflect.NativeMethodAccessorImpl.invoke (NativeMethodAccessorImpl.java:62)
[windows-jdk7-maven3.5.x]     at sun.reflect.DelegatingMethodAccessorImpl.invoke (DelegatingMethodAccessorImpl.java:43)
[windows-jdk7-maven3.5.x]     at java.lang.reflect.Method.invoke (Method.java:498)
[windows-jdk7-maven3.5.x]     at org.codehaus.plexus.classworlds.launcher.Launcher.launchEnhanced
(Launcher.java:289)
[windows-jdk7-maven3.5.x]     at org.codehaus.plexus.classworlds.launcher.Launcher.launch
(Launcher.java:229)
[windows-jdk7-maven3.5.x]     at org.codehaus.plexus.classworlds.launcher.Launcher.mainWithExitCode
(Launcher.java:415)
[windows-jdk7-maven3.5.x]     at org.codehaus.plexus.classworlds.launcher.Launcher.main (Launcher.java:356)
[windows-jdk7-maven3.5.x] [ERROR] 
[windows-jdk7-maven3.5.x] [ERROR] Re-run Maven using the -X switch to enable full debug logging.
[windows-jdk7-maven3.5.x] [ERROR] 
[windows-jdk7-maven3.5.x] [ERROR] For more information about the errors and possible solutions,
please read the following articles:
[windows-jdk7-maven3.5.x] [ERROR] [Help 1] http://cwiki.apache.org/confluence/display/MAVEN/MojoExecutionException
[windows-jdk7-maven3.5.x] [ERROR] 
[windows-jdk7-maven3.5.x] [ERROR] After correcting the problems, you can resume the build
with the command
[windows-jdk7-maven3.5.x] [ERROR]   mvn <goals> -rf :surefire-booter
[Pipeline] [windows-jdk7-maven3.5.x] }
[Pipeline] [windows-jdk7-maven3.5.x] // withEnv
[Pipeline] [windows-jdk7-maven3.5.x] }
[Pipeline] [windows-jdk7-maven3.5.x] // stage
[Pipeline] [windows-jdk7-maven3.5.x] stage
[Pipeline] [windows-jdk7-maven3.5.x] { (reporting windows-jdk7-maven3.5.x)
[Pipeline] [windows-jdk7-maven3.5.x] fileExists
[Pipeline] [windows-jdk7-maven3.5.x] fileExists
[Pipeline] [windows-jdk7-maven3.5.x] archiveArtifacts
[windows-jdk7-maven3.5.x] Archiving artifacts
[windows-jdk7-maven3.5.x] ‘*--windows-jdk7-maven3.5.x.zip’ doesn’t match anything
[windows-jdk7-maven3.5.x] No artifacts found that match the file pattern "*--windows-jdk7-maven3.5.x.zip".
Configuration error?
[Pipeline] [windows-jdk7-maven3.5.x] }
[Pipeline] [windows-jdk7-maven3.5.x] // stage
[Pipeline] [windows-jdk7-maven3.5.x] stage
[Pipeline] [windows-jdk7-maven3.5.x] { (cleanup windows-jdk7-maven3.5.x)
[Pipeline] [windows-jdk7-maven3.5.x] cleanWs
[windows-jdk7-maven3.5.x] [WS-CLEANUP] Deleting project workspace...[WS-CLEANUP] done
[Pipeline] [windows-jdk7-maven3.5.x] }
[Pipeline] [windows-jdk7-maven3.5.x] // stage
[Pipeline] [windows-jdk7-maven3.5.x] }
[Pipeline] [windows-jdk7-maven3.5.x] // timestamps
[Pipeline] [windows-jdk7-maven3.5.x] }
[Pipeline] [windows-jdk7-maven3.5.x] // node
[Pipeline] [windows-jdk7-maven3.5.x] }
[windows-jdk7-maven3.5.x] Failed in branch windows-jdk7-maven3.5.x
[Pipeline] // parallel
[Pipeline] echo
hudson.AbortException: hudson.AbortException: script returned exit code 1
[Pipeline] stage
[Pipeline] { (notifications)
[Pipeline] echo
Build result: FAILURE
[Pipeline] jiraIssueSelector
[Pipeline] emailext
Mime
  • Unnamed multipart/mixed (inline, None, 0 bytes)
View raw message