maven-notifications mailing list archives

Site index · List index
Message view « Date » · « Thread »
Top « Date » · « Thread »
From Apache Jenkins Server <jenk...@builds.apache.org>
Subject Build failed in Jenkins: Maven TLP » maven-surefire » 3.0.0-M1 #22
Date Thu, 01 Nov 2018 11:04:05 GMT
See https://builds.apache.org/job/maven-box/job/maven-surefire/job/3.0.0-M1/22/

No changes.

All tests passed

Build log:
[...truncated 15.56 MB...]
[windows-jdk8-maven3.5.x] Running org.apache.maven.surefire.its.jiras.Surefire818NpeIgnoresTestsIT
[windows-jdk8-maven3.5.x] Tests run: 1, Failures: 0, Errors: 0, Skipped: 0, Time elapsed:
16.564 sec
[windows-jdk7-maven3.5.x] Running org.apache.maven.surefire.its.jiras.Surefire943ReportContentIT
[windows-jdk7-maven3.5.x] Tests run: 2, Failures: 0, Errors: 0, Skipped: 0, Time elapsed:
30.512 sec
[windows-jdk7-maven3.5.x] Running org.apache.maven.surefire.its.jiras.Surefire946KillMainProcessInReusableForkIT
[windows-jdk7-maven3.5.x] Tests run: 3, Failures: 0, Errors: 0, Skipped: 0, Time elapsed:
25.157 sec
[windows-jdk7-maven3.5.x] Running org.apache.maven.surefire.its.jiras.Surefire972BizarreNoClassDefIT
[windows-jdk7-maven3.5.x] Tests run: 1, Failures: 0, Errors: 0, Skipped: 0, Time elapsed:
17.399 sec
[windows-jdk8-maven3.5.x] Running org.apache.maven.surefire.its.jiras.Surefire828EmptyGroupExprIT
[windows-jdk8-maven3.5.x] Tests run: 4, Failures: 0, Errors: 0, Skipped: 0, Time elapsed:
61.368 sec
[windows-jdk7-maven3.5.x] Running org.apache.maven.surefire.its.jiras.Surefire975DefaultVMEncodingIT
[windows-jdk7-maven3.5.x] Tests run: 1, Failures: 0, Errors: 0, Skipped: 0, Time elapsed:
16.039 sec
[windows-jdk8-maven3.5.x] Running org.apache.maven.surefire.its.jiras.Surefire832ProviderSelectionIT
[windows-jdk8-maven3.5.x] Tests run: 1, Failures: 0, Errors: 0, Skipped: 0, Time elapsed:
15.551 sec
[windows-jdk7-maven3.5.x] Running org.apache.maven.surefire.its.jiras.Surefire979WrongClassLoaderIT
[windows-jdk7-maven3.5.x] Tests run: 1, Failures: 0, Errors: 0, Skipped: 0, Time elapsed:
15.215 sec
[windows-jdk7-maven3.5.x] Running org.apache.maven.surefire.its.jiras.Surefire985ParameterizedRunnerAndCategoriesIT
[windows-jdk7-maven3.5.x] Tests run: 1, Failures: 0, Errors: 0, Skipped: 0, Time elapsed:
5.408 sec
[windows-jdk8-maven3.5.x] Running org.apache.maven.surefire.its.jiras.Surefire839TestWithoutCategoriesIT
[windows-jdk8-maven3.5.x] Tests run: 2, Failures: 0, Errors: 0, Skipped: 0, Time elapsed:
31.192 sec
[windows-jdk7-maven3.5.x] Running org.apache.maven.surefire.its.ModulePathIT
[windows-jdk7-maven3.5.x] Tests run: 1, Failures: 0, Errors: 0, Skipped: 1, Time elapsed:
0 sec
[windows-jdk7-maven3.5.x] Running org.apache.maven.surefire.its.JUnitPlatformIT
[windows-jdk7-maven3.5.x] Tests run: 5, Failures: 0, Errors: 0, Skipped: 5, Time elapsed:
0 sec
[windows-jdk7-maven3.5.x] Running org.apache.maven.surefire.its.jiras.Surefire1295AttributeJvmCrashesToTestsIT
[windows-jdk7-maven3.5.x] Tests run: 9, Failures: 0, Errors: 0, Skipped: 9, Time elapsed:
0.002 sec
[windows-jdk7-maven3.5.x] Running org.apache.maven.surefire.its.jiras.Surefire1265Java9IT
[windows-jdk7-maven3.5.x] Tests run: 1, Failures: 0, Errors: 0, Skipped: 1, Time elapsed:
0 sec
[windows-jdk7-maven3.5.x] Running org.apache.maven.surefire.its.JUnitPlatformEnginesIT
[windows-jdk7-maven3.5.x] Tests run: 10, Failures: 0, Errors: 0, Skipped: 10, Time elapsed:
0.002 sec
[windows-jdk7-maven3.5.x] Running org.apache.maven.surefire.its.TestMultipleMethodPatternsIT
[windows-jdk7-maven3.5.x] Tests run: 180, Failures: 0, Errors: 0, Skipped: 87, Time elapsed:
490.005 sec
[windows-jdk7-maven3.5.x] Running org.apache.maven.surefire.its.jiras.Surefire260TestWithIdenticalNamesIT
[windows-jdk7-maven3.5.x] Tests run: 1, Failures: 0, Errors: 0, Skipped: 1, Time elapsed:
0 sec
[windows-jdk7-maven3.5.x] Running org.apache.maven.surefire.its.jiras.Surefire995CategoryInheritanceIT
[windows-jdk7-maven3.5.x] Tests run: 5, Failures: 0, Errors: 0, Skipped: 0, Time elapsed:
26.576 sec
[windows-jdk7-maven3.5.x] Running org.apache.maven.surefire.its.TestMultipleMethodPatternsTestNGIT
[windows-jdk7-maven3.5.x] Tests run: 90, Failures: 0, Errors: 0, Skipped: 41, Time elapsed:
255.164 sec
[windows-jdk7-maven3.5.x] Running org.apache.maven.surefire.its.Java9FullApiIT
[windows-jdk7-maven3.5.x] Tests run: 3, Failures: 0, Errors: 0, Skipped: 3, Time elapsed:
0.001 sec
[windows-jdk7-maven3.5.x] 
[windows-jdk7-maven3.5.x] Results :
[windows-jdk7-maven3.5.x] 
[windows-jdk7-maven3.5.x] Tests run: 780, Failures: 0, Errors: 0, Skipped: 162
[windows-jdk7-maven3.5.x] 
[windows-jdk7-maven3.5.x] [INFO] 
[windows-jdk7-maven3.5.x] [INFO] --- maven-checkstyle-plugin:3.0.0:check (checkstyle-check)
@ surefire-its ---
[windows-jdk7-maven3.5.x] [INFO] 
[windows-jdk7-maven3.5.x] [INFO] --- maven-failsafe-plugin:2.12.4:verify (default) @ surefire-its
---
[windows-jdk7-maven3.5.x] [INFO] Failsafe report directory: F:\jenkins\jenkins-slave\workspace\box_maven-surefire_3.0.0-M1-VOMECAKSVISJOPKETIPDSWOOERZ2GRJICZTDYCTKUOMZVRQP4WVQ@2\surefire-its\target\failsafe-reports
[windows-jdk7-maven3.5.x] [INFO] 
[windows-jdk7-maven3.5.x] [INFO] --- maven-install-plugin:2.5.2:install (default-install)
@ surefire-its ---
[windows-jdk7-maven3.5.x] [INFO] Skipping artifact installation
[windows-jdk7-maven3.5.x] [INFO] 
[windows-jdk7-maven3.5.x] [INFO] --- jacoco-maven-plugin:0.8.2:report (default-cli) @ surefire-its
---
[windows-jdk7-maven3.5.x] [INFO] Skipping JaCoCo execution because property jacoco.skip is
set.
[windows-jdk7-maven3.5.x] [INFO] ------------------------------------------------------------------------
[windows-jdk7-maven3.5.x] [INFO] Reactor Summary:
[windows-jdk7-maven3.5.x] [INFO] 
[windows-jdk7-maven3.5.x] [INFO] Apache Maven Surefire .............................. SUCCESS
[ 38.251 s]
[windows-jdk7-maven3.5.x] [INFO] SureFire Logger API ................................ SUCCESS
[  8.258 s]
[windows-jdk7-maven3.5.x] [INFO] SureFire API ....................................... SUCCESS
[ 16.548 s]
[windows-jdk7-maven3.5.x] [INFO] ShadeFire JUnit3 Provider .......................... SUCCESS
[  1.766 s]
[windows-jdk7-maven3.5.x] [INFO] SureFire Booter .................................... SUCCESS
[ 15.263 s]
[windows-jdk7-maven3.5.x] [INFO] Maven Surefire Test-Grouping Support ............... SUCCESS
[  8.649 s]
[windows-jdk7-maven3.5.x] [INFO] SureFire Providers ................................. SUCCESS
[  1.288 s]
[windows-jdk7-maven3.5.x] [INFO] Shared JUnit3 Provider Code ........................ SUCCESS
[  4.749 s]
[windows-jdk7-maven3.5.x] [INFO] Shared Java 5 Provider Base ........................ SUCCESS
[  5.908 s]
[windows-jdk7-maven3.5.x] [INFO] Shared JUnit4 Provider Code ........................ SUCCESS
[  6.624 s]
[windows-jdk7-maven3.5.x] [INFO] Shared JUnit48 Provider Code ....................... SUCCESS
[  7.197 s]
[windows-jdk7-maven3.5.x] [INFO] SureFire JUnit Runner .............................. SUCCESS
[  5.332 s]
[windows-jdk7-maven3.5.x] [INFO] SureFire JUnit4 Runner ............................. SUCCESS
[  6.024 s]
[windows-jdk7-maven3.5.x] [INFO] Maven Surefire Common .............................. SUCCESS
[ 33.179 s]
[windows-jdk7-maven3.5.x] [INFO] SureFire JUnitCore Runner .......................... SUCCESS
[02:23 min]
[windows-jdk7-maven3.5.x] [INFO] SureFire JUnit Platform Runner ..................... SUCCESS
[  9.193 s]
[windows-jdk7-maven3.5.x] [INFO] SureFire TestNG Utils .............................. SUCCESS
[  5.602 s]
[windows-jdk7-maven3.5.x] [INFO] SureFire TestNG Runner ............................. SUCCESS
[  6.098 s]
[windows-jdk7-maven3.5.x] [INFO] Surefire Report Parser ............................. SUCCESS
[  6.850 s]
[windows-jdk7-maven3.5.x] [INFO] Maven Surefire Plugin .............................. SUCCESS
[ 13.412 s]
[windows-jdk7-maven3.5.x] [INFO] Maven Failsafe Plugin .............................. SUCCESS
[02:29 min]
[windows-jdk7-maven3.5.x] [INFO] Maven Surefire Report Plugin ....................... SUCCESS
[ 17.750 s]
[windows-jdk7-maven3.5.x] [INFO] Maven Surefire Integration Tests ................... SUCCESS
[  02:07 h]
[windows-jdk7-maven3.5.x] [INFO] ------------------------------------------------------------------------
[windows-jdk7-maven3.5.x] [INFO] BUILD SUCCESS
[windows-jdk7-maven3.5.x] [INFO] ------------------------------------------------------------------------
[windows-jdk7-maven3.5.x] [INFO] Total time: 02:16 h
[windows-jdk7-maven3.5.x] [INFO] Finished at: 2018-11-01T03:58:33-07:00
[windows-jdk7-maven3.5.x] [INFO] Final Memory: 50M/167M
[windows-jdk7-maven3.5.x] [INFO] ------------------------------------------------------------------------
[Pipeline] [windows-jdk7-maven3.5.x] }
[Pipeline] [windows-jdk7-maven3.5.x] // withEnv
[Pipeline] [windows-jdk7-maven3.5.x] }
[Pipeline] [windows-jdk7-maven3.5.x] // stage
[Pipeline] [windows-jdk7-maven3.5.x] stage
[Pipeline] [windows-jdk7-maven3.5.x] { (reporting windows-jdk7-maven3.5.x)
[Pipeline] [windows-jdk7-maven3.5.x] fileExists
[Pipeline] [windows-jdk7-maven3.5.x] zip
[windows-jdk7-maven3.5.x] Writing zip file of f:\jenkins\jenkins-slave\workspace\box_maven-surefire_3.0.0-M1-VOMECAKSVISJOPKETIPDSWOOERZ2GRJICZTDYCTKUOMZVRQP4WVQ@2\maven-failsafe-plugin\target\it
to f:\jenkins\jenkins-slave\workspace\box_maven-surefire_3.0.0-M1-VOMECAKSVISJOPKETIPDSWOOERZ2GRJICZTDYCTKUOMZVRQP4WVQ@2\maven-failsafe-plugin--windows-jdk7-maven3.5.x.zip
[windows-jdk7-maven3.5.x] Zipped 78 entries.
[windows-jdk7-maven3.5.x] Archiving f:\jenkins\jenkins-slave\workspace\box_maven-surefire_3.0.0-M1-VOMECAKSVISJOPKETIPDSWOOERZ2GRJICZTDYCTKUOMZVRQP4WVQ@2\maven-failsafe-plugin--windows-jdk7-maven3.5.x.zip
[Pipeline] [windows-jdk7-maven3.5.x] fileExists
[Pipeline] [windows-jdk7-maven3.5.x] zip
[windows-jdk7-maven3.5.x] Writing zip file of f:\jenkins\jenkins-slave\workspace\box_maven-surefire_3.0.0-M1-VOMECAKSVISJOPKETIPDSWOOERZ2GRJICZTDYCTKUOMZVRQP4WVQ@2\surefire-its\target
to f:\jenkins\jenkins-slave\workspace\box_maven-surefire_3.0.0-M1-VOMECAKSVISJOPKETIPDSWOOERZ2GRJICZTDYCTKUOMZVRQP4WVQ@2\surefire-its--windows-jdk7-maven3.5.x.zip
[windows-jdk8-maven3.5.x] Running org.apache.maven.surefire.its.jiras.Surefire847AdditionalFailureIT
[windows-jdk8-maven3.5.x] Tests run: 1, Failures: 0, Errors: 0, Skipped: 0, Time elapsed:
16.554 sec
[windows-jdk7-maven3.5.x] Zipped 15701 entries.
[windows-jdk7-maven3.5.x] Archiving f:\jenkins\jenkins-slave\workspace\box_maven-surefire_3.0.0-M1-VOMECAKSVISJOPKETIPDSWOOERZ2GRJICZTDYCTKUOMZVRQP4WVQ@2\surefire-its--windows-jdk7-maven3.5.x.zip
[Pipeline] [windows-jdk7-maven3.5.x] archiveArtifacts
[windows-jdk7-maven3.5.x] Archiving artifacts
[Pipeline] [windows-jdk7-maven3.5.x] }
[Pipeline] [windows-jdk7-maven3.5.x] // stage
[Pipeline] [windows-jdk7-maven3.5.x] stage
[Pipeline] [windows-jdk7-maven3.5.x] { (cleanup windows-jdk7-maven3.5.x)
[Pipeline] [windows-jdk7-maven3.5.x] cleanWs
[windows-jdk7-maven3.5.x] [WS-CLEANUP] Deleting project workspace...[WS-CLEANUP] done
[Pipeline] [windows-jdk7-maven3.5.x] }
[Pipeline] [windows-jdk7-maven3.5.x] // stage
[Pipeline] [windows-jdk7-maven3.5.x] }
[Pipeline] [windows-jdk7-maven3.5.x] // timestamps
[Pipeline] [windows-jdk7-maven3.5.x] }
[Pipeline] [windows-jdk7-maven3.5.x] // node
[Pipeline] [windows-jdk7-maven3.5.x] }
[windows-jdk8-maven3.5.x] Running org.apache.maven.surefire.its.jiras.Surefire855AllowFailsafeUseArtifactFileIT
[windows-jdk8-maven3.5.x] Tests run: 4, Failures: 0, Errors: 0, Skipped: 0, Time elapsed:
80.945 sec
[windows-jdk8-maven3.5.x] Running org.apache.maven.surefire.its.jiras.Surefire901MIssingResultfileWhenNoTestsIT
[windows-jdk8-maven3.5.x] Tests run: 1, Failures: 0, Errors: 0, Skipped: 0, Time elapsed:
4.953 sec
[windows-jdk8-maven3.5.x] Running org.apache.maven.surefire.its.jiras.Surefire907PerThreadWithoutThreadCountIT
[windows-jdk8-maven3.5.x] Tests run: 1, Failures: 0, Errors: 0, Skipped: 0, Time elapsed:
4.314 sec
[windows-jdk8-maven3.5.x] Running org.apache.maven.surefire.its.jiras.Surefire920TestFailureIgnoreWithTimeoutIT
[windows-jdk8-maven3.5.x] Tests run: 2, Failures: 0, Errors: 0, Skipped: 0, Time elapsed:
30.197 sec
[windows-jdk8-maven3.5.x] Running org.apache.maven.surefire.its.jiras.Surefire926FailureWith2ProvidersIT
[windows-jdk8-maven3.5.x] Tests run: 1, Failures: 0, Errors: 0, Skipped: 0, Time elapsed:
26.463 sec
[windows-jdk8-maven3.5.x] Running org.apache.maven.surefire.its.jiras.Surefire930TestNgSuiteXmlIT
[windows-jdk8-maven3.5.x] Tests run: 1, Failures: 0, Errors: 0, Skipped: 0, Time elapsed:
16.043 sec
[windows-jdk8-maven3.5.x] Running org.apache.maven.surefire.its.jiras.Surefire943ReportContentIT
[windows-jdk8-maven3.5.x] Tests run: 2, Failures: 0, Errors: 0, Skipped: 0, Time elapsed:
30.326 sec
[windows-jdk8-maven3.5.x] Running org.apache.maven.surefire.its.jiras.Surefire946KillMainProcessInReusableForkIT
[windows-jdk8-maven3.5.x] Tests run: 3, Failures: 0, Errors: 0, Skipped: 0, Time elapsed:
24.694 sec
[windows-jdk8-maven3.5.x] Running org.apache.maven.surefire.its.jiras.Surefire972BizarreNoClassDefIT
[windows-jdk8-maven3.5.x] Tests run: 1, Failures: 0, Errors: 0, Skipped: 0, Time elapsed:
18.097 sec
[windows-jdk8-maven3.5.x] Running org.apache.maven.surefire.its.jiras.Surefire975DefaultVMEncodingIT
[windows-jdk8-maven3.5.x] Tests run: 1, Failures: 0, Errors: 0, Skipped: 0, Time elapsed:
15.318 sec
[windows-jdk8-maven3.5.x] Running org.apache.maven.surefire.its.jiras.Surefire979WrongClassLoaderIT
[windows-jdk8-maven3.5.x] Tests run: 1, Failures: 0, Errors: 0, Skipped: 0, Time elapsed:
14.96 sec
[windows-jdk8-maven3.5.x] Running org.apache.maven.surefire.its.jiras.Surefire985ParameterizedRunnerAndCategoriesIT
[windows-jdk8-maven3.5.x] Tests run: 1, Failures: 0, Errors: 0, Skipped: 0, Time elapsed:
5.314 sec
[windows-jdk8-maven3.5.x] Running org.apache.maven.surefire.its.jiras.Surefire995CategoryInheritanceIT
[windows-jdk8-maven3.5.x] Tests run: 5, Failures: 0, Errors: 0, Skipped: 0, Time elapsed:
25.627 sec
[windows-jdk8-maven3.5.x] Running org.apache.maven.surefire.its.jiras.Surefire1265Java9IT
[windows-jdk8-maven3.5.x] Tests run: 1, Failures: 0, Errors: 0, Skipped: 1, Time elapsed:
0.001 sec
[windows-jdk8-maven3.5.x] Running org.apache.maven.surefire.its.jiras.Surefire1295AttributeJvmCrashesToTestsIT
[windows-jdk8-maven3.5.x] Tests run: 9, Failures: 0, Errors: 0, Skipped: 9, Time elapsed:
0 sec
[windows-jdk8-maven3.5.x] Running org.apache.maven.surefire.its.TestMultipleMethodPatternsTestNGIT
[windows-jdk8-maven3.5.x] Tests run: 90, Failures: 0, Errors: 0, Skipped: 41, Time elapsed:
257.229 sec
[windows-jdk8-maven3.5.x] Running org.apache.maven.surefire.its.Java9FullApiIT
[windows-jdk8-maven3.5.x] Tests run: 3, Failures: 0, Errors: 0, Skipped: 3, Time elapsed:
0.005 sec
[windows-jdk8-maven3.5.x] Running org.apache.maven.surefire.its.TestMultipleMethodPatternsIT
[windows-jdk8-maven3.5.x] Tests run: 180, Failures: 0, Errors: 0, Skipped: 87, Time elapsed:
506.088 sec
[windows-jdk8-maven3.5.x] Running org.apache.maven.surefire.its.ModulePathIT
[windows-jdk8-maven3.5.x] Tests run: 1, Failures: 0, Errors: 0, Skipped: 1, Time elapsed:
0.001 sec
[windows-jdk8-maven3.5.x] 
[windows-jdk8-maven3.5.x] Results :
[windows-jdk8-maven3.5.x] 
[windows-jdk8-maven3.5.x] Tests run: 780, Failures: 0, Errors: 0, Skipped: 146
[windows-jdk8-maven3.5.x] 
[windows-jdk8-maven3.5.x] [INFO] 
[windows-jdk8-maven3.5.x] [INFO] --- maven-checkstyle-plugin:3.0.0:check (checkstyle-check)
@ surefire-its ---
[windows-jdk8-maven3.5.x] [INFO] 
[windows-jdk8-maven3.5.x] [INFO] --- maven-failsafe-plugin:2.12.4:verify (default) @ surefire-its
---
[windows-jdk8-maven3.5.x] [INFO] Failsafe report directory: F:\jenkins\jenkins-slave\workspace\box_maven-surefire_3.0.0-M1-VOMECAKSVISJOPKETIPDSWOOERZ2GRJICZTDYCTKUOMZVRQP4WVQ\surefire-its\target\failsafe-reports
[windows-jdk8-maven3.5.x] [INFO] 
[windows-jdk8-maven3.5.x] [INFO] --- maven-install-plugin:2.5.2:install (default-install)
@ surefire-its ---
[windows-jdk8-maven3.5.x] [INFO] Skipping artifact installation
[windows-jdk8-maven3.5.x] [INFO] 
[windows-jdk8-maven3.5.x] [INFO] --- jacoco-maven-plugin:0.8.2:report (default-cli) @ surefire-its
---
[windows-jdk8-maven3.5.x] [INFO] Skipping JaCoCo execution because property jacoco.skip is
set.
[windows-jdk8-maven3.5.x] [INFO] ------------------------------------------------------------------------
[windows-jdk8-maven3.5.x] [INFO] Reactor Summary:
[windows-jdk8-maven3.5.x] [INFO] 
[windows-jdk8-maven3.5.x] [INFO] Apache Maven Surefire .............................. SUCCESS
[ 38.048 s]
[windows-jdk8-maven3.5.x] [INFO] SureFire Logger API ................................ SUCCESS
[  8.536 s]
[windows-jdk8-maven3.5.x] [INFO] SureFire API ....................................... SUCCESS
[ 15.991 s]
[windows-jdk8-maven3.5.x] [INFO] ShadeFire JUnit3 Provider .......................... SUCCESS
[  1.832 s]
[windows-jdk8-maven3.5.x] [INFO] SureFire Booter .................................... SUCCESS
[ 15.663 s]
[windows-jdk8-maven3.5.x] [INFO] Maven Surefire Test-Grouping Support ............... SUCCESS
[  8.619 s]
[windows-jdk8-maven3.5.x] [INFO] SureFire Providers ................................. SUCCESS
[  1.206 s]
[windows-jdk8-maven3.5.x] [INFO] Shared JUnit3 Provider Code ........................ SUCCESS
[  4.955 s]
[windows-jdk8-maven3.5.x] [INFO] Shared Java 5 Provider Base ........................ SUCCESS
[  5.932 s]
[windows-jdk8-maven3.5.x] [INFO] Shared JUnit4 Provider Code ........................ SUCCESS
[  6.581 s]
[windows-jdk8-maven3.5.x] [INFO] Shared JUnit48 Provider Code ....................... SUCCESS
[  7.073 s]
[windows-jdk8-maven3.5.x] [INFO] SureFire JUnit Runner .............................. SUCCESS
[  5.404 s]
[windows-jdk8-maven3.5.x] [INFO] SureFire JUnit4 Runner ............................. SUCCESS
[  5.833 s]
[windows-jdk8-maven3.5.x] [INFO] Maven Surefire Common .............................. SUCCESS
[ 32.115 s]
[windows-jdk8-maven3.5.x] [INFO] SureFire JUnitCore Runner .......................... SUCCESS
[02:16 min]
[windows-jdk8-maven3.5.x] [INFO] SureFire JUnit Platform Runner ..................... SUCCESS
[  9.252 s]
[windows-jdk8-maven3.5.x] [INFO] SureFire TestNG Utils .............................. SUCCESS
[  5.430 s]
[windows-jdk8-maven3.5.x] [INFO] SureFire TestNG Runner ............................. SUCCESS
[  6.027 s]
[windows-jdk8-maven3.5.x] [INFO] Surefire Report Parser ............................. SUCCESS
[  6.909 s]
[windows-jdk8-maven3.5.x] [INFO] Maven Surefire Plugin .............................. SUCCESS
[ 13.600 s]
[windows-jdk8-maven3.5.x] [INFO] Maven Failsafe Plugin .............................. SUCCESS
[02:27 min]
[windows-jdk8-maven3.5.x] [INFO] Maven Surefire Report Plugin ....................... SUCCESS
[ 17.441 s]
[windows-jdk8-maven3.5.x] [INFO] Maven Surefire Integration Tests ................... SUCCESS
[  02:12 h]
[windows-jdk8-maven3.5.x] [INFO] ------------------------------------------------------------------------
[windows-jdk8-maven3.5.x] [INFO] BUILD SUCCESS
[windows-jdk8-maven3.5.x] [INFO] ------------------------------------------------------------------------
[windows-jdk8-maven3.5.x] [INFO] Total time: 02:21 h
[windows-jdk8-maven3.5.x] [INFO] Finished at: 2018-11-01T04:03:43-07:00
[windows-jdk8-maven3.5.x] [INFO] Final Memory: 50M/168M
[windows-jdk8-maven3.5.x] [INFO] ------------------------------------------------------------------------
[Pipeline] [windows-jdk8-maven3.5.x] }
[Pipeline] [windows-jdk8-maven3.5.x] // withEnv
[Pipeline] [windows-jdk8-maven3.5.x] }
[Pipeline] [windows-jdk8-maven3.5.x] // stage
[Pipeline] [windows-jdk8-maven3.5.x] stage
[Pipeline] [windows-jdk8-maven3.5.x] { (reporting windows-jdk8-maven3.5.x)
[Pipeline] [windows-jdk8-maven3.5.x] fileExists
[Pipeline] [windows-jdk8-maven3.5.x] zip
[windows-jdk8-maven3.5.x] Writing zip file of f:\jenkins\jenkins-slave\workspace\box_maven-surefire_3.0.0-M1-VOMECAKSVISJOPKETIPDSWOOERZ2GRJICZTDYCTKUOMZVRQP4WVQ\maven-failsafe-plugin\target\it
to f:\jenkins\jenkins-slave\workspace\box_maven-surefire_3.0.0-M1-VOMECAKSVISJOPKETIPDSWOOERZ2GRJICZTDYCTKUOMZVRQP4WVQ\maven-failsafe-plugin--windows-jdk8-maven3.5.x.zip
[windows-jdk8-maven3.5.x] Zipped 78 entries.
[windows-jdk8-maven3.5.x] Archiving f:\jenkins\jenkins-slave\workspace\box_maven-surefire_3.0.0-M1-VOMECAKSVISJOPKETIPDSWOOERZ2GRJICZTDYCTKUOMZVRQP4WVQ\maven-failsafe-plugin--windows-jdk8-maven3.5.x.zip
[Pipeline] [windows-jdk8-maven3.5.x] fileExists
[Pipeline] [windows-jdk8-maven3.5.x] zip
[windows-jdk8-maven3.5.x] Writing zip file of f:\jenkins\jenkins-slave\workspace\box_maven-surefire_3.0.0-M1-VOMECAKSVISJOPKETIPDSWOOERZ2GRJICZTDYCTKUOMZVRQP4WVQ\surefire-its\target
to f:\jenkins\jenkins-slave\workspace\box_maven-surefire_3.0.0-M1-VOMECAKSVISJOPKETIPDSWOOERZ2GRJICZTDYCTKUOMZVRQP4WVQ\surefire-its--windows-jdk8-maven3.5.x.zip
[windows-jdk8-maven3.5.x] Zipped 15809 entries.
[windows-jdk8-maven3.5.x] Archiving f:\jenkins\jenkins-slave\workspace\box_maven-surefire_3.0.0-M1-VOMECAKSVISJOPKETIPDSWOOERZ2GRJICZTDYCTKUOMZVRQP4WVQ\surefire-its--windows-jdk8-maven3.5.x.zip
[Pipeline] [windows-jdk8-maven3.5.x] archiveArtifacts
[windows-jdk8-maven3.5.x] Archiving artifacts
[Pipeline] [windows-jdk8-maven3.5.x] }
[Pipeline] [windows-jdk8-maven3.5.x] // stage
[Pipeline] [windows-jdk8-maven3.5.x] stage
[Pipeline] [windows-jdk8-maven3.5.x] { (cleanup windows-jdk8-maven3.5.x)
[Pipeline] [windows-jdk8-maven3.5.x] cleanWs
[windows-jdk8-maven3.5.x] [WS-CLEANUP] Deleting project workspace...[WS-CLEANUP] done
[Pipeline] [windows-jdk8-maven3.5.x] }
[Pipeline] [windows-jdk8-maven3.5.x] // stage
[Pipeline] [windows-jdk8-maven3.5.x] }
[Pipeline] [windows-jdk8-maven3.5.x] // timestamps
[Pipeline] [windows-jdk8-maven3.5.x] }
[Pipeline] [windows-jdk8-maven3.5.x] // node
[Pipeline] [windows-jdk8-maven3.5.x] }
[Pipeline] // parallel
[Pipeline] echo
hudson.AbortException: hudson.AbortException: script returned exit code 1
[Pipeline] stage
[Pipeline] { (notifications)
[Pipeline] echo
Build result: FAILURE
[Pipeline] jiraIssueSelector
[Pipeline] emailext
Mime
  • Unnamed multipart/mixed (inline, None, 0 bytes)
View raw message