maven-notifications mailing list archives

Site index · List index
Message view « Date » · « Thread »
Top « Date » · « Thread »
From Apache Jenkins Server <jenk...@builds.apache.org>
Subject Build failed in Jenkins: Maven TLP » maven-site-plugin » master #66
Date Thu, 29 Nov 2018 08:35:21 GMT
See https://builds.apache.org/job/maven-box/job/maven-site-plugin/job/master/66/

Changes:

* fix full-reporting it
* fix full-reporting it
* fix full-reporting it
* fix full-reporting it
* fix full-reporting it
* fix full-reporting it
* fix full-reporting it
* fix full-reporting it
* fix full-reporting it
* fix full-reporting it
* fix full-reporting it
* fix full-reporting it

All tests passed

Build log:
[...truncated 4.94 MB...]
[windows-jdk8-m3.2.x_build] [ERROR] Failed to execute goal org.apache.maven.plugins:maven-invoker-plugin:3.1.0:verify (integration-test) on project maven-site-plugin: 1 build failed. See console output above for details. -> [Help 1]
[windows-jdk8-m3.2.x_build] org.apache.maven.lifecycle.LifecycleExecutionException: Failed to execute goal org.apache.maven.plugins:maven-invoker-plugin:3.1.0:verify (integration-test) on project maven-site-plugin: 1 build failed. See console output above for details.
[windows-jdk8-m3.2.x_build] 	at org.apache.maven.lifecycle.internal.MojoExecutor.execute(MojoExecutor.java:212)
[windows-jdk8-m3.2.x_build] 	at org.apache.maven.lifecycle.internal.MojoExecutor.execute(MojoExecutor.java:153)
[windows-jdk8-m3.2.x_build] 	at org.apache.maven.lifecycle.internal.MojoExecutor.execute(MojoExecutor.java:145)
[windows-jdk8-m3.2.x_build] 	at org.apache.maven.lifecycle.internal.LifecycleModuleBuilder.buildProject(LifecycleModuleBuilder.java:116)
[windows-jdk8-m3.2.x_build] 	at org.apache.maven.lifecycle.internal.LifecycleModuleBuilder.buildProject(LifecycleModuleBuilder.java:80)
[windows-jdk8-m3.2.x_build] 	at org.apache.maven.lifecycle.internal.builder.singlethreaded.SingleThreadedBuilder.build(SingleThreadedBuilder.java:51)
[windows-jdk8-m3.2.x_build] 	at org.apache.maven.lifecycle.internal.LifecycleStarter.execute(LifecycleStarter.java:120)
[windows-jdk8-m3.2.x_build] 	at org.apache.maven.DefaultMaven.doExecute(DefaultMaven.java:355)
[windows-jdk8-m3.2.x_build] 	at org.apache.maven.DefaultMaven.execute(DefaultMaven.java:155)
[windows-jdk8-m3.2.x_build] 	at org.apache.maven.cli.MavenCli.execute(MavenCli.java:584)
[windows-jdk8-m3.2.x_build] 	at org.apache.maven.cli.MavenCli.doMain(MavenCli.java:216)
[windows-jdk8-m3.2.x_build] 	at org.apache.maven.cli.MavenCli.main(MavenCli.java:160)
[windows-jdk8-m3.2.x_build] 	at sun.reflect.NativeMethodAccessorImpl.invoke0(Native Method)
[windows-jdk8-m3.2.x_build] 	at sun.reflect.NativeMethodAccessorImpl.invoke(NativeMethodAccessorImpl.java:62)
[windows-jdk8-m3.2.x_build] 	at sun.reflect.DelegatingMethodAccessorImpl.invoke(DelegatingMethodAccessorImpl.java:43)
[windows-jdk8-m3.2.x_build] 	at java.lang.reflect.Method.invoke(Method.java:498)
[windows-jdk8-m3.2.x_build] 	at org.codehaus.plexus.classworlds.launcher.Launcher.launchEnhanced(Launcher.java:289)
[windows-jdk8-m3.2.x_build] 	at org.codehaus.plexus.classworlds.launcher.Launcher.launch(Launcher.java:229)
[windows-jdk8-m3.2.x_build] 	at org.codehaus.plexus.classworlds.launcher.Launcher.mainWithExitCode(Launcher.java:415)
[windows-jdk8-m3.2.x_build] 	at org.codehaus.plexus.classworlds.launcher.Launcher.main(Launcher.java:356)
[windows-jdk8-m3.2.x_build] Caused by: org.apache.maven.plugin.MojoFailureException: 1 build failed. See console output above for details.
[windows-jdk8-m3.2.x_build] 	at org.apache.maven.plugins.invoker.InvokerSession.handleFailures(InvokerSession.java:260)
[windows-jdk8-m3.2.x_build] 	at org.apache.maven.plugins.invoker.VerifyMojo.execute(VerifyMojo.java:137)
[windows-jdk8-m3.2.x_build] 	at org.apache.maven.plugin.DefaultBuildPluginManager.executeMojo(DefaultBuildPluginManager.java:132)
[windows-jdk8-m3.2.x_build] 	at org.apache.maven.lifecycle.internal.MojoExecutor.execute(MojoExecutor.java:208)
[windows-jdk8-m3.2.x_build] 	... 19 more
[windows-jdk8-m3.2.x_build] [ERROR] 
[windows-jdk8-m3.2.x_build] [ERROR] Re-run Maven using the -X switch to enable full debug logging.
[windows-jdk8-m3.2.x_build] [ERROR] 
[windows-jdk8-m3.2.x_build] [ERROR] For more information about the errors and possible solutions, please read the following articles:
[windows-jdk8-m3.2.x_build] [ERROR] [Help 1] http://cwiki.apache.org/confluence/display/MAVEN/MojoFailureException
[windows-jdk8-m3.2.x_build] Picked up JAVA_TOOL_OPTIONS: -Dmaven.ext.class.path="f:\jenkins\jenkins-slave\workspace\ox_maven-site-plugin_master-LZWAKOPRMO5JAZW5HRA2IQ56LLTFU3PLKDIE2JNFFXEGASBYKK3Q@3@tmp\withMavenc779130a\pipeline-maven-spy.jar" -Dorg.jenkinsci.plugins.pipeline.maven.reportsFolder="f:\jenkins\jenkins-slave\workspace\ox_maven-site-plugin_master-LZWAKOPRMO5JAZW5HRA2IQ56LLTFU3PLKDIE2JNFFXEGASBYKK3Q@3@tmp\withMavenc779130a" 
[Pipeline] [windows-jdk8-m3.2.x_build] }
[Pipeline] [windows-jdk8-m3.2.x_build] // dir
[windows-jdk8-m3.3.x_build] [INFO] 
[windows-jdk8-m3.3.x_build] [INFO] --- maven-invoker-plugin:3.1.0:verify (integration-test) @ maven-site-plugin ---
[windows-jdk8-m3.3.x_build] [INFO] -------------------------------------------------
[windows-jdk8-m3.3.x_build] [INFO] Build Summary:
[windows-jdk8-m3.3.x_build] [INFO]   Passed: 55, Failed: 1, Errors: 0, Skipped: 0
[windows-jdk8-m3.3.x_build] [INFO] -------------------------------------------------
[windows-jdk8-m3.3.x_build] [ERROR] The following builds failed:
[windows-jdk8-m3.3.x_build] [ERROR] *  emma-plugin-it\pom.xml
[windows-jdk8-m3.3.x_build] [INFO] -------------------------------------------------
[windows-jdk8-m3.3.x_build] [INFO] ------------------------------------------------------------------------
[windows-jdk8-m3.3.x_build] [INFO] BUILD FAILURE
[windows-jdk8-m3.3.x_build] [INFO] ------------------------------------------------------------------------
[windows-jdk8-m3.3.x_build] [INFO] Total time: 15:37 min
[windows-jdk8-m3.3.x_build] [INFO] Finished at: 2018-11-29T00:35:05-08:00
[windows-jdk8-m3.3.x_build] [INFO] Final Memory: 71M/1159M
[windows-jdk8-m3.3.x_build] [INFO] ------------------------------------------------------------------------
[windows-jdk8-m3.3.x_build] [INFO] [jenkins-event-spy] Generated F:\jenkins\jenkins-slave\workspace\ox_maven-site-plugin_master-LZWAKOPRMO5JAZW5HRA2IQ56LLTFU3PLKDIE2JNFFXEGASBYKK3Q@2@2@tmp\withMaven961b8298\maven-spy-20181129-001927-6812181273519218879372.log
[windows-jdk8-m3.3.x_build] [ERROR] Failed to execute goal org.apache.maven.plugins:maven-invoker-plugin:3.1.0:verify (integration-test) on project maven-site-plugin: 1 build failed. See console output above for details. -> [Help 1]
[windows-jdk8-m3.3.x_build] org.apache.maven.lifecycle.LifecycleExecutionException: Failed to execute goal org.apache.maven.plugins:maven-invoker-plugin:3.1.0:verify (integration-test) on project maven-site-plugin: 1 build failed. See console output above for details.
[windows-jdk8-m3.3.x_build] 	at org.apache.maven.lifecycle.internal.MojoExecutor.execute(MojoExecutor.java:212)
[windows-jdk8-m3.3.x_build] 	at org.apache.maven.lifecycle.internal.MojoExecutor.execute(MojoExecutor.java:153)
[windows-jdk8-m3.3.x_build] 	at org.apache.maven.lifecycle.internal.MojoExecutor.execute(MojoExecutor.java:145)
[windows-jdk8-m3.3.x_build] 	at org.apache.maven.lifecycle.internal.LifecycleModuleBuilder.buildProject(LifecycleModuleBuilder.java:116)
[windows-jdk8-m3.3.x_build] 	at org.apache.maven.lifecycle.internal.LifecycleModuleBuilder.buildProject(LifecycleModuleBuilder.java:80)
[windows-jdk8-m3.3.x_build] 	at org.apache.maven.lifecycle.internal.builder.singlethreaded.SingleThreadedBuilder.build(SingleThreadedBuilder.java:51)
[windows-jdk8-m3.3.x_build] 	at org.apache.maven.lifecycle.internal.LifecycleStarter.execute(LifecycleStarter.java:128)
[windows-jdk8-m3.3.x_build] 	at org.apache.maven.DefaultMaven.doExecute(DefaultMaven.java:307)
[windows-jdk8-m3.3.x_build] 	at org.apache.maven.DefaultMaven.doExecute(DefaultMaven.java:193)
[windows-jdk8-m3.3.x_build] 	at org.apache.maven.DefaultMaven.execute(DefaultMaven.java:106)
[windows-jdk8-m3.3.x_build] 	at org.apache.maven.cli.MavenCli.execute(MavenCli.java:863)
[windows-jdk8-m3.3.x_build] 	at org.apache.maven.cli.MavenCli.doMain(MavenCli.java:288)
[windows-jdk8-m3.3.x_build] 	at org.apache.maven.cli.MavenCli.main(MavenCli.java:199)
[windows-jdk8-m3.3.x_build] 	at sun.reflect.NativeMethodAccessorImpl.invoke0(Native Method)
[windows-jdk8-m3.3.x_build] 	at sun.reflect.NativeMethodAccessorImpl.invoke(NativeMethodAccessorImpl.java:62)
[windows-jdk8-m3.3.x_build] 	at sun.reflect.DelegatingMethodAccessorImpl.invoke(DelegatingMethodAccessorImpl.java:43)
[windows-jdk8-m3.3.x_build] 	at java.lang.reflect.Method.invoke(Method.java:498)
[windows-jdk8-m3.3.x_build] 	at org.codehaus.plexus.classworlds.launcher.Launcher.launchEnhanced(Launcher.java:289)
[windows-jdk8-m3.3.x_build] 	at org.codehaus.plexus.classworlds.launcher.Launcher.launch(Launcher.java:229)
[windows-jdk8-m3.3.x_build] 	at org.codehaus.plexus.classworlds.launcher.Launcher.mainWithExitCode(Launcher.java:415)
[windows-jdk8-m3.3.x_build] 	at org.codehaus.plexus.classworlds.launcher.Launcher.main(Launcher.java:356)
[windows-jdk8-m3.3.x_build] Caused by: org.apache.maven.plugin.MojoFailureException: 1 build failed. See console output above for details.
[windows-jdk8-m3.3.x_build] 	at org.apache.maven.plugins.invoker.InvokerSession.handleFailures(InvokerSession.java:260)
[windows-jdk8-m3.3.x_build] 	at org.apache.maven.plugins.invoker.VerifyMojo.execute(VerifyMojo.java:137)
[windows-jdk8-m3.3.x_build] 	at org.apache.maven.plugin.DefaultBuildPluginManager.executeMojo(DefaultBuildPluginManager.java:134)
[windows-jdk8-m3.3.x_build] 	at org.apache.maven.lifecycle.internal.MojoExecutor.execute(MojoExecutor.java:207)
[windows-jdk8-m3.3.x_build] 	... 20 more
[windows-jdk8-m3.3.x_build] [ERROR] 
[windows-jdk8-m3.3.x_build] [ERROR] Re-run Maven using the -X switch to enable full debug logging.
[windows-jdk8-m3.3.x_build] [ERROR] 
[windows-jdk8-m3.3.x_build] [ERROR] For more information about the errors and possible solutions, please read the following articles:
[windows-jdk8-m3.3.x_build] [ERROR] [Help 1] http://cwiki.apache.org/confluence/display/MAVEN/MojoFailureException
[windows-jdk8-m3.3.x_build] Picked up JAVA_TOOL_OPTIONS: -Dmaven.ext.class.path="f:\jenkins\jenkins-slave\workspace\ox_maven-site-plugin_master-LZWAKOPRMO5JAZW5HRA2IQ56LLTFU3PLKDIE2JNFFXEGASBYKK3Q@2@2@tmp\withMaven961b8298\pipeline-maven-spy.jar" -Dorg.jenkinsci.plugins.pipeline.maven.reportsFolder="f:\jenkins\jenkins-slave\workspace\ox_maven-site-plugin_master-LZWAKOPRMO5JAZW5HRA2IQ56LLTFU3PLKDIE2JNFFXEGASBYKK3Q@2@2@tmp\withMaven961b8298" 
[windows-jdk9-m3.5.x_build] [INFO] 
[windows-jdk9-m3.5.x_build] [INFO] --- maven-invoker-plugin:3.1.0:verify (integration-test) @ maven-site-plugin ---
[windows-jdk9-m3.5.x_build] [INFO] -------------------------------------------------
[windows-jdk9-m3.5.x_build] [INFO] Build Summary:
[windows-jdk9-m3.5.x_build] [INFO]   Passed: 55, Failed: 1, Errors: 0, Skipped: 0
[windows-jdk9-m3.5.x_build] [INFO] -------------------------------------------------
[windows-jdk9-m3.5.x_build] [ERROR] The following builds failed:
[windows-jdk9-m3.5.x_build] [ERROR] *  emma-plugin-it\pom.xml
[windows-jdk9-m3.5.x_build] [INFO] -------------------------------------------------
[windows-jdk9-m3.5.x_build] [INFO] ------------------------------------------------------------------------
[windows-jdk9-m3.5.x_build] [INFO] BUILD FAILURE
[windows-jdk9-m3.5.x_build] [INFO] ------------------------------------------------------------------------
[windows-jdk9-m3.5.x_build] [INFO] Total time: 15:36 min
[windows-jdk9-m3.5.x_build] [INFO] Finished at: 2018-11-29T08:35:04Z
[windows-jdk9-m3.5.x_build] [INFO] Final Memory: 53M/177M
[windows-jdk9-m3.5.x_build] [INFO] ------------------------------------------------------------------------
[windows-jdk9-m3.5.x_build] [INFO] [jenkins-event-spy] Generated F:\jenkins\jenkins-slave\workspace\ox_maven-site-plugin_master-LZWAKOPRMO5JAZW5HRA2IQ56LLTFU3PLKDIE2JNFFXEGASBYKK3Q@3@tmp\withMavenbdd3716d\maven-spy-20181129-081926-9409336554332752716532.log
[windows-jdk9-m3.5.x_build] [ERROR] Failed to execute goal org.apache.maven.plugins:maven-invoker-plugin:3.1.0:verify (integration-test) on project maven-site-plugin: 1 build failed. See console output above for details. -> [Help 1]
[windows-jdk9-m3.5.x_build] org.apache.maven.lifecycle.LifecycleExecutionException: Failed to execute goal org.apache.maven.plugins:maven-invoker-plugin:3.1.0:verify (integration-test) on project maven-site-plugin: 1 build failed. See console output above for details.
[windows-jdk9-m3.5.x_build]     at org.apache.maven.lifecycle.internal.MojoExecutor.execute (MojoExecutor.java:213)
[windows-jdk9-m3.5.x_build]     at org.apache.maven.lifecycle.internal.MojoExecutor.execute (MojoExecutor.java:154)
[windows-jdk9-m3.5.x_build]     at org.apache.maven.lifecycle.internal.MojoExecutor.execute (MojoExecutor.java:146)
[windows-jdk9-m3.5.x_build]     at org.apache.maven.lifecycle.internal.LifecycleModuleBuilder.buildProject (LifecycleModuleBuilder.java:117)
[windows-jdk9-m3.5.x_build]     at org.apache.maven.lifecycle.internal.LifecycleModuleBuilder.buildProject (LifecycleModuleBuilder.java:81)
[windows-jdk9-m3.5.x_build]     at org.apache.maven.lifecycle.internal.builder.singlethreaded.SingleThreadedBuilder.build (SingleThreadedBuilder.java:51)
[windows-jdk9-m3.5.x_build]     at org.apache.maven.lifecycle.internal.LifecycleStarter.execute (LifecycleStarter.java:128)
[windows-jdk9-m3.5.x_build]     at org.apache.maven.DefaultMaven.doExecute (DefaultMaven.java:309)
[windows-jdk9-m3.5.x_build]     at org.apache.maven.DefaultMaven.doExecute (DefaultMaven.java:194)
[windows-jdk9-m3.5.x_build]     at org.apache.maven.DefaultMaven.execute (DefaultMaven.java:107)
[windows-jdk9-m3.5.x_build]     at org.apache.maven.cli.MavenCli.execute (MavenCli.java:955)
[windows-jdk9-m3.5.x_build]     at org.apache.maven.cli.MavenCli.doMain (MavenCli.java:290)
[windows-jdk9-m3.5.x_build]     at org.apache.maven.cli.MavenCli.main (MavenCli.java:194)
[windows-jdk9-m3.5.x_build]     at jdk.internal.reflect.NativeMethodAccessorImpl.invoke0 (Native Method)
[windows-jdk9-m3.5.x_build]     at jdk.internal.reflect.NativeMethodAccessorImpl.invoke (NativeMethodAccessorImpl.java:62)
[windows-jdk9-m3.5.x_build]     at jdk.internal.reflect.DelegatingMethodAccessorImpl.invoke (DelegatingMethodAccessorImpl.java:43)
[windows-jdk9-m3.5.x_build]     at java.lang.reflect.Method.invoke (Method.java:564)
[windows-jdk9-m3.5.x_build]     at org.codehaus.plexus.classworlds.launcher.Launcher.launchEnhanced (Launcher.java:289)
[windows-jdk9-m3.5.x_build]     at org.codehaus.plexus.classworlds.launcher.Launcher.launch (Launcher.java:229)
[windows-jdk9-m3.5.x_build]     at org.codehaus.plexus.classworlds.launcher.Launcher.mainWithExitCode (Launcher.java:415)
[windows-jdk9-m3.5.x_build]     at org.codehaus.plexus.classworlds.launcher.Launcher.main (Launcher.java:356)
[windows-jdk9-m3.5.x_build] Caused by: org.apache.maven.plugin.MojoFailureException: 1 build failed. See console output above for details.
[windows-jdk9-m3.5.x_build]     at org.apache.maven.plugins.invoker.InvokerSession.handleFailures (InvokerSession.java:260)
[windows-jdk9-m3.5.x_build]     at org.apache.maven.plugins.invoker.VerifyMojo.execute (VerifyMojo.java:137)
[windows-jdk9-m3.5.x_build]     at org.apache.maven.plugin.DefaultBuildPluginManager.executeMojo (DefaultBuildPluginManager.java:134)
[windows-jdk9-m3.5.x_build]     at org.apache.maven.lifecycle.internal.MojoExecutor.execute (MojoExecutor.java:208)
[windows-jdk9-m3.5.x_build]     at org.apache.maven.lifecycle.internal.MojoExecutor.execute (MojoExecutor.java:154)
[windows-jdk9-m3.5.x_build]     at org.apache.maven.lifecycle.internal.MojoExecutor.execute (MojoExecutor.java:146)
[windows-jdk9-m3.5.x_build]     at org.apache.maven.lifecycle.internal.LifecycleModuleBuilder.buildProject (LifecycleModuleBuilder.java:117)
[windows-jdk9-m3.5.x_build]     at org.apache.maven.lifecycle.internal.LifecycleModuleBuilder.buildProject (LifecycleModuleBuilder.java:81)
[windows-jdk9-m3.5.x_build]     at org.apache.maven.lifecycle.internal.builder.singlethreaded.SingleThreadedBuilder.build (SingleThreadedBuilder.java:51)
[windows-jdk9-m3.5.x_build]     at org.apache.maven.lifecycle.internal.LifecycleStarter.execute (LifecycleStarter.java:128)
[windows-jdk9-m3.5.x_build]     at org.apache.maven.DefaultMaven.doExecute (DefaultMaven.java:309)
[windows-jdk9-m3.5.x_build]     at org.apache.maven.DefaultMaven.doExecute (DefaultMaven.java:194)
[windows-jdk9-m3.5.x_build]     at org.apache.maven.DefaultMaven.execute (DefaultMaven.java:107)
[windows-jdk9-m3.5.x_build]     at org.apache.maven.cli.MavenCli.execute (MavenCli.java:955)
[windows-jdk9-m3.5.x_build]     at org.apache.maven.cli.MavenCli.doMain (MavenCli.java:290)
[windows-jdk9-m3.5.x_build]     at org.apache.maven.cli.MavenCli.main (MavenCli.java:194)
[windows-jdk9-m3.5.x_build]     at jdk.internal.reflect.NativeMethodAccessorImpl.invoke0 (Native Method)
[windows-jdk9-m3.5.x_build]     at jdk.internal.reflect.NativeMethodAccessorImpl.invoke (NativeMethodAccessorImpl.java:62)
[windows-jdk9-m3.5.x_build]     at jdk.internal.reflect.DelegatingMethodAccessorImpl.invoke (DelegatingMethodAccessorImpl.java:43)
[windows-jdk9-m3.5.x_build]     at java.lang.reflect.Method.invoke (Method.java:564)
[windows-jdk9-m3.5.x_build]     at org.codehaus.plexus.classworlds.launcher.Launcher.launchEnhanced (Launcher.java:289)
[windows-jdk9-m3.5.x_build]     at org.codehaus.plexus.classworlds.launcher.Launcher.launch (Launcher.java:229)
[windows-jdk9-m3.5.x_build]     at org.codehaus.plexus.classworlds.launcher.Launcher.mainWithExitCode (Launcher.java:415)
[windows-jdk9-m3.5.x_build]     at org.codehaus.plexus.classworlds.launcher.Launcher.main (Launcher.java:356)
[windows-jdk9-m3.5.x_build] [ERROR] 
[windows-jdk9-m3.5.x_build] [ERROR] Re-run Maven using the -X switch to enable full debug logging.
[windows-jdk9-m3.5.x_build] [ERROR] 
[windows-jdk9-m3.5.x_build] [ERROR] For more information about the errors and possible solutions, please read the following articles:
[windows-jdk9-m3.5.x_build] [ERROR] [Help 1] http://cwiki.apache.org/confluence/display/MAVEN/MojoFailureException
[Pipeline] [windows-jdk8-m3.2.x_build] }
[windows-jdk8-m3.2.x_build] [withMaven] invokerPublisher - Archive invoker results for Maven artifact MavenArtifact{org.apache.maven.plugins:maven-site-plugin::3.8-SNAPSHOT(version: 3.8-SNAPSHOT, snapshot:false) } generated by PluginInvocation{org.apache.maven.plugins:maven-invoker-plugin:3.1.0@integration-test  integration-test}: windows-jdk8-m3.2.x_build\target\invoker-reports\*.xml
[windows-jdk8-m3.2.x_build] performing MavenInvokerRecorder, reportsFilenamePattern:'**/windows-jdk8-m3.2.x_build\target\invoker-reports/BUILD*.xml', invokerBuildDir:'**/windows-jdk8-m3.2.x_build\target\it'
[windows-jdk8-m3.2.x_build] Found reports:[f:\jenkins\jenkins-slave\workspace\ox_maven-site-plugin_master-LZWAKOPRMO5JAZW5HRA2IQ56LLTFU3PLKDIE2JNFFXEGASBYKK3Q@3\windows-jdk8-m3.2.x_build\target\invoker-reports\BUILD-MSITE-159.xml, f:\jenkins\jenkins-slave\workspace\ox_maven-site-plugin_master-LZWAKOPRMO5JAZW5HRA2IQ56LLTFU3PLKDIE2JNFFXEGASBYKK3Q@3\windows-jdk8-m3.2.x_build\target\invoker-reports\BUILD-MSITE-265.xml, f:\jenkins\jenkins-slave\workspace\ox_maven-site-plugin_master-LZWAKOPRMO5JAZW5HRA2IQ56LLTFU3PLKDIE2JNFFXEGASBYKK3Q@3\windows-jdk8-m3.2.x_build\target\invoker-reports\BUILD-MSITE-354.xml, f:\jenkins\jenkins-slave\workspace\ox_maven-site-plugin_master-LZWAKOPRMO5JAZW5HRA2IQ56LLTFU3PLKDIE2JNFFXEGASBYKK3Q@3\windows-jdk8-m3.2.x_build\target\invoker-reports\BUILD-MSITE-456.xml, f:\jenkins\jenkins-slave\workspace\ox_maven-site-plugin_master-LZWAKOPRMO5JAZW5HRA2IQ56LLTFU3PLKDIE2JNFFXEGASBYKK3Q@3\windows-jdk8-m3.2.x_build\target\invoker-reports\BUILD-MSITE-458.xml, f:\jenkins\jenkins-slave\workspace\ox_maven-site-plugin_master-LZWAKOPRMO5JAZW5HRA2IQ56LLTFU3PLKDIE2JNFFXEGASBYKK3Q@3\windows-jdk8-m3.2.x_build\target\invoker-reports\BUILD-MSITE-484.xml, f:\jenkins\jenkins-slave\workspace\ox_maven-site-plugin_master-LZWAKOPRMO5JAZW5HRA2IQ56LLTFU3PLKDIE2JNFFXEGASBYKK3Q@3\windows-jdk8-m3.2.x_build\target\invoker-reports\BUILD-MSITE-497.xml, f:\jenkins\jenkins-slave\workspace\ox_maven-site-plugin_master-LZWAKOPRMO5JAZW5HRA2IQ56LLTFU3PLKDIE2JNFFXEGASBYKK3Q@3\windows-jdk8-m3.2.x_build\target\invoker-reports\BUILD-MSITE-504.xml, f:\jenkins\jenkins-slave\workspace\ox_maven-site-plugin_master-LZWAKOPRMO5JAZW5HRA2IQ56LLTFU3PLKDIE2JNFFXEGASBYKK3Q@3\windows-jdk8-m3.2.x_build\target\invoker-reports\BUILD-MSITE-506.xml, f:\jenkins\jenkins-slave\workspace\ox_maven-site-plugin_master-LZWAKOPRMO5JAZW5HRA2IQ56LLTFU3PLKDIE2JNFFXEGASBYKK3Q@3\windows-jdk8-m3.2.x_build\target\invoker-reports\BUILD-MSITE-507.xml, f:\jenkins\jenkins-slave\workspace\ox_maven-site-plugin_master-LZWAKOPRMO5JAZW5HRA2IQ56LLTFU3PLKDIE2JNFFXEGASBYKK3Q@3\windows-jdk8-m3.2.x_build\target\invoker-reports\BUILD-MSITE-512.xml, f:\jenkins\jenkins-slave\workspace\ox_maven-site-plugin_master-LZWAKOPRMO5JAZW5HRA2IQ56LLTFU3PLKDIE2JNFFXEGASBYKK3Q@3\windows-jdk8-m3.2.x_build\target\invoker-reports\BUILD-MSITE-548.xml, f:\jenkins\jenkins-slave\workspace\ox_maven-site-plugin_master-LZWAKOPRMO5JAZW5HRA2IQ56LLTFU3PLKDIE2JNFFXEGASBYKK3Q@3\windows-jdk8-m3.2.x_build\target\invoker-reports\BUILD-MSITE-566.xml, f:\jenkins\jenkins-slave\workspace\ox_maven-site-plugin_master-LZWAKOPRMO5JAZW5HRA2IQ56LLTFU3PLKDIE2JNFFXEGASBYKK3Q@3\windows-jdk8-m3.2.x_build\target\invoker-reports\BUILD-MSITE-582.xml, f:\jenkins\jenkins-slave\workspace\ox_maven-site-plugin_master-LZWAKOPRMO5JAZW5HRA2IQ56LLTFU3PLKDIE2JNFFXEGASBYKK3Q@3\windows-jdk8-m3.2.x_build\target\invoker-reports\BUILD-MSITE-604.xml, f:\jenkins\jenkins-slave\workspace\ox_maven-site-plugin_master-LZWAKOPRMO5JAZW5HRA2IQ56LLTFU3PLKDIE2JNFFXEGASBYKK3Q@3\windows-jdk8-m3.2.x_build\target\invoker-reports\BUILD-MSITE-609.xml, f:\jenkins\jenkins-slave\workspace\ox_maven-site-plugin_master-LZWAKOPRMO5JAZW5HRA2IQ56LLTFU3PLKDIE2JNFFXEGASBYKK3Q@3\windows-jdk8-m3.2.x_build\target\invoker-reports\BUILD-MSITE-627.xml, f:\jenkins\jenkins-slave\workspace\ox_maven-site-plugin_master-LZWAKOPRMO5JAZW5HRA2IQ56LLTFU3PLKDIE2JNFFXEGASBYKK3Q@3\windows-jdk8-m3.2.x_build\target\invoker-reports\BUILD-MSITE-644.xml, f:\jenkins\jenkins-slave\workspace\ox_maven-site-plugin_master-LZWAKOPRMO5JAZW5HRA2IQ56LLTFU3PLKDIE2JNFFXEGASBYKK3Q@3\windows-jdk8-m3.2.x_build\target\invoker-reports\BUILD-MSITE-658.xml, f:\jenkins\jenkins-slave\workspace\ox_maven-site-plugin_master-LZWAKOPRMO5JAZW5HRA2IQ56LLTFU3PLKDIE2JNFFXEGASBYKK3Q@3\windows-jdk8-m3.2.x_build\target\invoker-reports\BUILD-MSITE-665.xml, f:\jenkins\jenkins-slave\workspace\ox_maven-site-plugin_master-LZWAKOPRMO5JAZW5HRA2IQ56LLTFU3PLKDIE2JNFFXEGASBYKK3Q@3\windows-jdk8-m3.2.x_build\target\invoker-reports\BUILD-MSITE-705-debug.xml, f:\jenkins\jenkins-slave\workspace\ox_maven-site-plugin_master-LZWAKOPRMO5JAZW5HRA2IQ56LLTFU3PLKDIE2JNFFXEGASBYKK3Q@3\windows-jdk8-m3.2.x_build\target\invoker-reports\BUILD-MSITE-705-no-debug.xml, f:\jenkins\jenkins-slave\workspace\ox_maven-site-plugin_master-LZWAKOPRMO5JAZW5HRA2IQ56LLTFU3PLKDIE2JNFFXEGASBYKK3Q@3\windows-jdk8-m3.2.x_build\target\invoker-reports\BUILD-MSITE-723.xml, f:\jenkins\jenkins-slave\workspace\ox_maven-site-plugin_master-LZWAKOPRMO5JAZW5HRA2IQ56LLTFU3PLKDIE2JNFFXEGASBYKK3Q@3\windows-jdk8-m3.2.x_build\target\invoker-reports\BUILD-default-reports-excluded.xml, f:\jenkins\jenkins-slave\workspace\ox_maven-site-plugin_master-LZWAKOPRMO5JAZW5HRA2IQ56LLTFU3PLKDIE2JNFFXEGASBYKK3Q@3\windows-jdk8-m3.2.x_build\target\invoker-reports\BUILD-default-reports.xml, f:\jenkins\jenkins-slave\workspace\ox_maven-site-plugin_master-LZWAKOPRMO5JAZW5HRA2IQ56LLTFU3PLKDIE2JNFFXEGASBYKK3Q@3\windows-jdk8-m3.2.x_build\target\invoker-reports\BUILD-doxia-formats.xml, f:\jenkins\jenkins-slave\workspace\ox_maven-site-plugin_master-LZWAKOPRMO5JAZW5HRA2IQ56LLTFU3PLKDIE2JNFFXEGASBYKK3Q@3\windows-jdk8-m3.2.x_build\target\invoker-reports\BUILD-effective-site.xml, f:\jenkins\jenkins-slave\workspace\ox_maven-site-plugin_master-LZWAKOPRMO5JAZW5HRA2IQ56LLTFU3PLKDIE2JNFFXEGASBYKK3Q@3\windows-jdk8-m3.2.x_build\target\invoker-reports\BUILD-emma-plugin-it.xml, f:\jenkins\jenkins-slave\workspace\ox_maven-site-plugin_master-LZWAKOPRMO5JAZW5HRA2IQ56LLTFU3PLKDIE2JNFFXEGASBYKK3Q@3\windows-jdk8-m3.2.x_build\target\invoker-reports\BUILD-empty-report-set.xml, f:\jenkins\jenkins-slave\workspace\ox_maven-site-plugin_master-LZWAKOPRMO5JAZW5HRA2IQ56LLTFU3PLKDIE2JNFFXEGASBYKK3Q@3\windows-jdk8-m3.2.x_build\target\invoker-reports\BUILD-failure.xml, f:\jenkins\jenkins-slave\workspace\ox_maven-site-plugin_master-LZWAKOPRMO5JAZW5HRA2IQ56LLTFU3PLKDIE2JNFFXEGASBYKK3Q@3\windows-jdk8-m3.2.x_build\target\invoker-reports\BUILD-full-reporting.xml, f:\jenkins\jenkins-slave\workspace\ox_maven-site-plugin_master-LZWAKOPRMO5JAZW5HRA2IQ56LLTFU3PLKDIE2JNFFXEGASBYKK3Q@3\windows-jdk8-m3.2.x_build\target\invoker-reports\BUILD-inheritance-interpolation.xml, f:\jenkins\jenkins-slave\workspace\ox_maven-site-plugin_master-LZWAKOPRMO5JAZW5HRA2IQ56LLTFU3PLKDIE2JNFFXEGASBYKK3Q@3\windows-jdk8-m3.2.x_build\target\invoker-reports\BUILD-inheritedMenus.xml, f:\jenkins\jenkins-slave\workspace\ox_maven-site-plugin_master-LZWAKOPRMO5JAZW5HRA2IQ56LLTFU3PLKDIE2JNFFXEGASBYKK3Q@3\windows-jdk8-m3.2.x_build\target\invoker-reports\BUILD-inheritedReports.xml, f:\jenkins\jenkins-slave\workspace\ox_maven-site-plugin_master-LZWAKOPRMO5JAZW5HRA2IQ56LLTFU3PLKDIE2JNFFXEGASBYKK3Q@3\windows-jdk8-m3.2.x_build\target\invoker-reports\BUILD-it-plugin-test.xml, f:\jenkins\jenkins-slave\workspace\ox_maven-site-plugin_master-LZWAKOPRMO5JAZW5HRA2IQ56LLTFU3PLKDIE2JNFFXEGASBYKK3Q@3\windows-jdk8-m3.2.x_build\target\invoker-reports\BUILD-new-configuration.xml, f:\jenkins\jenkins-slave\workspace\ox_maven-site-plugin_master-LZWAKOPRMO5JAZW5HRA2IQ56LLTFU3PLKDIE2JNFFXEGASBYKK3Q@3\windows-jdk8-m3.2.x_build\target\invoker-reports\BUILD-no-version.xml, f:\jenkins\jenkins-slave\workspace\ox_maven-site-plugin_master-LZWAKOPRMO5JAZW5HRA2IQ56LLTFU3PLKDIE2JNFFXEGASBYKK3Q@3\windows-jdk8-m3.2.x_build\target\invoker-reports\BUILD-report-changes-generation.xml, f:\jenkins\jenkins-slave\workspace\ox_maven-site-plugin_master-LZWAKOPRMO5JAZW5HRA2IQ56LLTFU3PLKDIE2JNFFXEGASBYKK3Q@3\windows-jdk8-m3.2.x_build\target\invoker-reports\BUILD-reportConfig.xml, f:\jenkins\jenkins-slave\workspace\ox_maven-site-plugin_master-LZWAKOPRMO5JAZW5HRA2IQ56LLTFU3PLKDIE2JNFFXEGASBYKK3Q@3\windows-jdk8-m3.2.x_build\target\invoker-reports\BUILD-resources.xml, f:\jenkins\jenkins-slave\workspace\ox_maven-site-plugin_master-LZWAKOPRMO5JAZW5HRA2IQ56LLTFU3PLKDIE2JNFFXEGASBYKK3Q@3\windows-jdk8-m3.2.x_build\target\invoker-reports\BUILD-site-attach-descriptor.xml, f:\jenkins\jenkins-slave\workspace\ox_maven-site-plugin_master-LZWAKOPRMO5JAZW5HRA2IQ56LLTFU3PLKDIE2JNFFXEGASBYKK3Q@3\windows-jdk8-m3.2.x_build\target\invoker-reports\BUILD-site-deploy.xml, f:\jenkins\jenkins-slave\workspace\ox_maven-site-plugin_master-LZWAKOPRMO5JAZW5HRA2IQ56LLTFU3PLKDIE2JNFFXEGASBYKK3Q@3\windows-jdk8-m3.2.x_build\target\invoker-reports\BUILD-site-inheritance.xml, f:\jenkins\jenkins-slave\workspace\ox_maven-site-plugin_master-LZWAKOPRMO5JAZW5HRA2IQ56LLTFU3PLKDIE2JNFFXEGASBYKK3Q@3\windows-jdk8-m3.2.x_build\target\invoker-reports\BUILD-site-jar.xml, f:\jenkins\jenkins-slave\workspace\ox_maven-site-plugin_master-LZWAKOPRMO5JAZW5HRA2IQ56LLTFU3PLKDIE2JNFFXEGASBYKK3Q@3\windows-jdk8-m3.2.x_build\target\invoker-reports\BUILD-site-sd-2.xml, f:\jenkins\jenkins-slave\workspace\ox_maven-site-plugin_master-LZWAKOPRMO5JAZW5HRA2IQ56LLTFU3PLKDIE2JNFFXEGASBYKK3Q@3\windows-jdk8-m3.2.x_build\target\invoker-reports\BUILD-site-sd-lang.xml, f:\jenkins\jenkins-slave\workspace\ox_maven-site-plugin_master-LZWAKOPRMO5JAZW5HRA2IQ56LLTFU3PLKDIE2JNFFXEGASBYKK3Q@3\windows-jdk8-m3.2.x_build\target\invoker-reports\BUILD-site-sd-stagingSiteURL.xml, f:\jenkins\jenkins-slave\workspace\ox_maven-site-plugin_master-LZWAKOPRMO5JAZW5HRA2IQ56LLTFU3PLKDIE2JNFFXEGASBYKK3Q@3\windows-jdk8-m3.2.x_build\target\invoker-reports\BUILD-site-sd-submodule.xml, f:\jenkins\jenkins-slave\workspace\ox_maven-site-plugin_master-LZWAKOPRMO5JAZW5HRA2IQ56LLTFU3PLKDIE2JNFFXEGASBYKK3Q@3\windows-jdk8-m3.2.x_build\target\invoker-reports\BUILD-site-sd-top-parent-different-site.xml, f:\jenkins\jenkins-slave\workspace\ox_maven-site-plugin_master-LZWAKOPRMO5JAZW5HRA2IQ56LLTFU3PLKDIE2JNFFXEGASBYKK3Q@3\windows-jdk8-m3.2.x_build\target\invoker-reports\BUILD-site-sd-top-parent-no-site.xml, f:\jenkins\jenkins-slave\workspace\ox_maven-site-plugin_master-LZWAKOPRMO5JAZW5HRA2IQ56LLTFU3PLKDIE2JNFFXEGASBYKK3Q@3\windows-jdk8-m3.2.x_build\target\invoker-reports\BUILD-site-sd-top-parent-same-site.xml, f:\jenkins\jenkins-slave\workspace\ox_maven-site-plugin_master-LZWAKOPRMO5JAZW5HRA2IQ56LLTFU3PLKDIE2JNFFXEGASBYKK3Q@3\windows-jdk8-m3.2.x_build\target\invoker-reports\BUILD-site-sd.xml, f:\jenkins\jenkins-slave\workspace\ox_maven-site-plugin_master-LZWAKOPRMO5JAZW5HRA2IQ56LLTFU3PLKDIE2JNFFXEGASBYKK3Q@3\windows-jdk8-m3.2.x_build\target\invoker-reports\BUILD-site-skip.xml, f:\jenkins\jenkins-slave\workspace\ox_maven-site-plugin_master-LZWAKOPRMO5JAZW5HRA2IQ56LLTFU3PLKDIE2JNFFXEGASBYKK3Q@3\windows-jdk8-m3.2.x_build\target\invoker-reports\BUILD-surefire-report.xml, f:\jenkins\jenkins-slave\workspace\ox_maven-site-plugin_master-LZWAKOPRMO5JAZW5HRA2IQ56LLTFU3PLKDIE2JNFFXEGASBYKK3Q@3\windows-jdk8-m3.2.x_build\target\invoker-reports\BUILD-template-skin.xml, f:\jenkins\jenkins-slave\workspace\ox_maven-site-plugin_master-LZWAKOPRMO5JAZW5HRA2IQ56LLTFU3PLKDIE2JNFFXEGASBYKK3Q@3\windows-jdk8-m3.2.x_build\target\invoker-reports\BUILD-validate.xml]
[windows-jdk8-m3.2.x_build] Found logs:[f:\jenkins\jenkins-slave\workspace\ox_maven-site-plugin_master-LZWAKOPRMO5JAZW5HRA2IQ56LLTFU3PLKDIE2JNFFXEGASBYKK3Q@3\windows-jdk8-m3.2.x_build\target\it\MSITE-159\build.log, f:\jenkins\jenkins-slave\workspace\ox_maven-site-plugin_master-LZWAKOPRMO5JAZW5HRA2IQ56LLTFU3PLKDIE2JNFFXEGASBYKK3Q@3\windows-jdk8-m3.2.x_build\target\it\MSITE-265\build.log, f:\jenkins\jenkins-slave\workspace\ox_maven-site-plugin_master-LZWAKOPRMO5JAZW5HRA2IQ56LLTFU3PLKDIE2JNFFXEGASBYKK3Q@3\windows-jdk8-m3.2.x_build\target\it\MSITE-354\build.log, f:\jenkins\jenkins-slave\workspace\ox_maven-site-plugin_master-LZWAKOPRMO5JAZW5HRA2IQ56LLTFU3PLKDIE2JNFFXEGASBYKK3Q@3\windows-jdk8-m3.2.x_build\target\it\MSITE-456\build.log, f:\jenkins\jenkins-slave\workspace\ox_maven-site-plugin_master-LZWAKOPRMO5JAZW5HRA2IQ56LLTFU3PLKDIE2JNFFXEGASBYKK3Q@3\windows-jdk8-m3.2.x_build\target\it\MSITE-458\build.log, f:\jenkins\jenkins-slave\workspace\ox_maven-site-plugin_master-LZWAKOPRMO5JAZW5HRA2IQ56LLTFU3PLKDIE2JNFFXEGASBYKK3Q@3\windows-jdk8-m3.2.x_build\target\it\MSITE-484\build.log, f:\jenkins\jenkins-slave\workspace\ox_maven-site-plugin_master-LZWAKOPRMO5JAZW5HRA2IQ56LLTFU3PLKDIE2JNFFXEGASBYKK3Q@3\windows-jdk8-m3.2.x_build\target\it\MSITE-497\build.log, f:\jenkins\jenkins-slave\workspace\ox_maven-site-plugin_master-LZWAKOPRMO5JAZW5HRA2IQ56LLTFU3PLKDIE2JNFFXEGASBYKK3Q@3\windows-jdk8-m3.2.x_build\target\it\MSITE-504\build.log, f:\jenkins\jenkins-slave\workspace\ox_maven-site-plugin_master-LZWAKOPRMO5JAZW5HRA2IQ56LLTFU3PLKDIE2JNFFXEGASBYKK3Q@3\windows-jdk8-m3.2.x_build\target\it\MSITE-506\build.log, f:\jenkins\jenkins-slave\workspace\ox_maven-site-plugin_master-LZWAKOPRMO5JAZW5HRA2IQ56LLTFU3PLKDIE2JNFFXEGASBYKK3Q@3\windows-jdk8-m3.2.x_build\target\it\MSITE-507\build.log, f:\jenkins\jenkins-slave\workspace\ox_maven-site-plugin_master-LZWAKOPRMO5JAZW5HRA2IQ56LLTFU3PLKDIE2JNFFXEGASBYKK3Q@3\windows-jdk8-m3.2.x_build\target\it\MSITE-512\build.log, f:\jenkins\jenkins-slave\workspace\ox_maven-site-plugin_master-LZWAKOPRMO5JAZW5HRA2IQ56LLTFU3PLKDIE2JNFFXEGASBYKK3Q@3\windows-jdk8-m3.2.x_build\target\it\MSITE-548\build.log, f:\jenkins\jenkins-slave\workspace\ox_maven-site-plugin_master-LZWAKOPRMO5JAZW5HRA2IQ56LLTFU3PLKDIE2JNFFXEGASBYKK3Q@3\windows-jdk8-m3.2.x_build\target\it\MSITE-566\build.log, f:\jenkins\jenkins-slave\workspace\ox_maven-site-plugin_master-LZWAKOPRMO5JAZW5HRA2IQ56LLTFU3PLKDIE2JNFFXEGASBYKK3Q@3\windows-jdk8-m3.2.x_build\target\it\MSITE-582\build.log, f:\jenkins\jenkins-slave\workspace\ox_maven-site-plugin_master-LZWAKOPRMO5JAZW5HRA2IQ56LLTFU3PLKDIE2JNFFXEGASBYKK3Q@3\windows-jdk8-m3.2.x_build\target\it\MSITE-604\build.log, f:\jenkins\jenkins-slave\workspace\ox_maven-site-plugin_master-LZWAKOPRMO5JAZW5HRA2IQ56LLTFU3PLKDIE2JNFFXEGASBYKK3Q@3\windows-jdk8-m3.2.x_build\target\it\MSITE-609\build.log, f:\jenkins\jenkins-slave\workspace\ox_maven-site-plugin_master-LZWAKOPRMO5JAZW5HRA2IQ56LLTFU3PLKDIE2JNFFXEGASBYKK3Q@3\windows-jdk8-m3.2.x_build\target\it\MSITE-627\build.log, f:\jenkins\jenkins-slave\workspace\ox_maven-site-plugin_master-LZWAKOPRMO5JAZW5HRA2IQ56LLTFU3PLKDIE2JNFFXEGASBYKK3Q@3\windows-jdk8-m3.2.x_build\target\it\MSITE-644\build.log, f:\jenkins\jenkins-slave\workspace\ox_maven-site-plugin_master-LZWAKOPRMO5JAZW5HRA2IQ56LLTFU3PLKDIE2JNFFXEGASBYKK3Q@3\windows-jdk8-m3.2.x_build\target\it\MSITE-658\build.log, f:\jenkins\jenkins-slave\workspace\ox_maven-site-plugin_master-LZWAKOPRMO5JAZW5HRA2IQ56LLTFU3PLKDIE2JNFFXEGASBYKK3Q@3\windows-jdk8-m3.2.x_build\target\it\MSITE-665\build.log, f:\jenkins\jenkins-slave\workspace\ox_maven-site-plugin_master-LZWAKOPRMO5JAZW5HRA2IQ56LLTFU3PLKDIE2JNFFXEGASBYKK3Q@3\windows-jdk8-m3.2.x_build\target\it\MSITE-705-debug\build.log, f:\jenkins\jenkins-slave\workspace\ox_maven-site-plugin_master-LZWAKOPRMO5JAZW5HRA2IQ56LLTFU3PLKDIE2JNFFXEGASBYKK3Q@3\windows-jdk8-m3.2.x_build\target\it\MSITE-705-no-debug\build.log, f:\jenkins\jenkins-slave\workspace\ox_maven-site-plugin_master-LZWAKOPRMO5JAZW5HRA2IQ56LLTFU3PLKDIE2JNFFXEGASBYKK3Q@3\windows-jdk8-m3.2.x_build\target\it\MSITE-723\build.log, f:\jenkins\jenkins-slave\workspace\ox_maven-site-plugin_master-LZWAKOPRMO5JAZW5HRA2IQ56LLTFU3PLKDIE2JNFFXEGASBYKK3Q@3\windows-jdk8-m3.2.x_build\target\it\default-reports-excluded\build.log, f:\jenkins\jenkins-slave\workspace\ox_maven-site-plugin_master-LZWAKOPRMO5JAZW5HRA2IQ56LLTFU3PLKDIE2JNFFXEGASBYKK3Q@3\windows-jdk8-m3.2.x_build\target\it\default-reports\build.log, f:\jenkins\jenkins-slave\workspace\ox_maven-site-plugin_master-LZWAKOPRMO5JAZW5HRA2IQ56LLTFU3PLKDIE2JNFFXEGASBYKK3Q@3\windows-jdk8-m3.2.x_build\target\it\doxia-formats\build.log, f:\jenkins\jenkins-slave\workspace\ox_maven-site-plugin_master-LZWAKOPRMO5JAZW5HRA2IQ56LLTFU3PLKDIE2JNFFXEGASBYKK3Q@3\windows-jdk8-m3.2.x_build\target\it\effective-site\build.log, f:\jenkins\jenkins-slave\workspace\ox_maven-site-plugin_master-LZWAKOPRMO5JAZW5HRA2IQ56LLTFU3PLKDIE2JNFFXEGASBYKK3Q@3\windows-jdk8-m3.2.x_build\target\it\emma-plugin-it\build.log, f:\jenkins\jenkins-slave\workspace\ox_maven-site-plugin_master-LZWAKOPRMO5JAZW5HRA2IQ56LLTFU3PLKDIE2JNFFXEGASBYKK3Q@3\windows-jdk8-m3.2.x_build\target\it\empty-report-set\build.log, f:\jenkins\jenkins-slave\workspace\ox_maven-site-plugin_master-LZWAKOPRMO5JAZW5HRA2IQ56LLTFU3PLKDIE2JNFFXEGASBYKK3Q@3\windows-jdk8-m3.2.x_build\target\it\failure\build.log, f:\jenkins\jenkins-slave\workspace\ox_maven-site-plugin_master-LZWAKOPRMO5JAZW5HRA2IQ56LLTFU3PLKDIE2JNFFXEGASBYKK3Q@3\windows-jdk8-m3.2.x_build\target\it\full-reporting\build.log, f:\jenkins\jenkins-slave\workspace\ox_maven-site-plugin_master-LZWAKOPRMO5JAZW5HRA2IQ56LLTFU3PLKDIE2JNFFXEGASBYKK3Q@3\windows-jdk8-m3.2.x_build\target\it\inheritance-interpolation\build.log, f:\jenkins\jenkins-slave\workspace\ox_maven-site-plugin_master-LZWAKOPRMO5JAZW5HRA2IQ56LLTFU3PLKDIE2JNFFXEGASBYKK3Q@3\windows-jdk8-m3.2.x_build\target\it\inheritedMenus\build.log, f:\jenkins\jenkins-slave\workspace\ox_maven-site-plugin_master-LZWAKOPRMO5JAZW5HRA2IQ56LLTFU3PLKDIE2JNFFXEGASBYKK3Q@3\windows-jdk8-m3.2.x_build\target\it\inheritedReports\build.log, f:\jenkins\jenkins-slave\workspace\ox_maven-site-plugin_master-LZWAKOPRMO5JAZW5HRA2IQ56LLTFU3PLKDIE2JNFFXEGASBYKK3Q@3\windows-jdk8-m3.2.x_build\target\it\it-plugin-test\build.log, f:\jenkins\jenkins-slave\workspace\ox_maven-site-plugin_master-LZWAKOPRMO5JAZW5HRA2IQ56LLTFU3PLKDIE2JNFFXEGASBYKK3Q@3\windows-jdk8-m3.2.x_build\target\it\new-configuration\build.log, f:\jenkins\jenkins-slave\workspace\ox_maven-site-plugin_master-LZWAKOPRMO5JAZW5HRA2IQ56LLTFU3PLKDIE2JNFFXEGASBYKK3Q@3\windows-jdk8-m3.2.x_build\target\it\no-version\build.log, f:\jenkins\jenkins-slave\workspace\ox_maven-site-plugin_master-LZWAKOPRMO5JAZW5HRA2IQ56LLTFU3PLKDIE2JNFFXEGASBYKK3Q@3\windows-jdk8-m3.2.x_build\target\it\report-changes-generation\build.log, f:\jenkins\jenkins-slave\workspace\ox_maven-site-plugin_master-LZWAKOPRMO5JAZW5HRA2IQ56LLTFU3PLKDIE2JNFFXEGASBYKK3Q@3\windows-jdk8-m3.2.x_build\target\it\reportConfig\build.log, f:\jenkins\jenkins-slave\workspace\ox_maven-site-plugin_master-LZWAKOPRMO5JAZW5HRA2IQ56LLTFU3PLKDIE2JNFFXEGASBYKK3Q@3\windows-jdk8-m3.2.x_build\target\it\resources\build.log, f:\jenkins\jenkins-slave\workspace\ox_maven-site-plugin_master-LZWAKOPRMO5JAZW5HRA2IQ56LLTFU3PLKDIE2JNFFXEGASBYKK3Q@3\windows-jdk8-m3.2.x_build\target\it\site-attach-descriptor\build.log, f:\jenkins\jenkins-slave\workspace\ox_maven-site-plugin_master-LZWAKOPRMO5JAZW5HRA2IQ56LLTFU3PLKDIE2JNFFXEGASBYKK3Q@3\windows-jdk8-m3.2.x_build\target\it\site-deploy\build.log, f:\jenkins\jenkins-slave\workspace\ox_maven-site-plugin_master-LZWAKOPRMO5JAZW5HRA2IQ56LLTFU3PLKDIE2JNFFXEGASBYKK3Q@3\windows-jdk8-m3.2.x_build\target\it\site-inheritance\build.log, f:\jenkins\jenkins-slave\workspace\ox_maven-site-plugin_master-LZWAKOPRMO5JAZW5HRA2IQ56LLTFU3PLKDIE2JNFFXEGASBYKK3Q@3\windows-jdk8-m3.2.x_build\target\it\site-jar\build.log, f:\jenkins\jenkins-slave\workspace\ox_maven-site-plugin_master-LZWAKOPRMO5JAZW5HRA2IQ56LLTFU3PLKDIE2JNFFXEGASBYKK3Q@3\windows-jdk8-m3.2.x_build\target\it\site-sd-2\build.log, f:\jenkins\jenkins-slave\workspace\ox_maven-site-plugin_master-LZWAKOPRMO5JAZW5HRA2IQ56LLTFU3PLKDIE2JNFFXEGASBYKK3Q@3\windows-jdk8-m3.2.x_build\target\it\site-sd-lang\build.log, f:\jenkins\jenkins-slave\workspace\ox_maven-site-plugin_master-LZWAKOPRMO5JAZW5HRA2IQ56LLTFU3PLKDIE2JNFFXEGASBYKK3Q@3\windows-jdk8-m3.2.x_build\target\it\site-sd-stagingSiteURL\build.log, f:\jenkins\jenkins-slave\workspace\ox_maven-site-plugin_master-LZWAKOPRMO5JAZW5HRA2IQ56LLTFU3PLKDIE2JNFFXEGASBYKK3Q@3\windows-jdk8-m3.2.x_build\target\it\site-sd-submodule\build.log, f:\jenkins\jenkins-slave\workspace\ox_maven-site-plugin_master-LZWAKOPRMO5JAZW5HRA2IQ56LLTFU3PLKDIE2JNFFXEGASBYKK3Q@3\windows-jdk8-m3.2.x_build\target\it\site-sd-top-parent-different-site\build.log, f:\jenkins\jenkins-slave\workspace\ox_maven-site-plugin_master-LZWAKOPRMO5JAZW5HRA2IQ56LLTFU3PLKDIE2JNFFXEGASBYKK3Q@3\windows-jdk8-m3.2.x_build\target\it\site-sd-top-parent-no-site\build.log, f:\jenkins\jenkins-slave\workspace\ox_maven-site-plugin_master-LZWAKOPRMO5JAZW5HRA2IQ56LLTFU3PLKDIE2JNFFXEGASBYKK3Q@3\windows-jdk8-m3.2.x_build\target\it\site-sd-top-parent-same-site\build.log, f:\jenkins\jenkins-slave\workspace\ox_maven-site-plugin_master-LZWAKOPRMO5JAZW5HRA2IQ56LLTFU3PLKDIE2JNFFXEGASBYKK3Q@3\windows-jdk8-m3.2.x_build\target\it\site-sd\build.log, f:\jenkins\jenkins-slave\workspace\ox_maven-site-plugin_master-LZWAKOPRMO5JAZW5HRA2IQ56LLTFU3PLKDIE2JNFFXEGASBYKK3Q@3\windows-jdk8-m3.2.x_build\target\it\site-skip\build.log, f:\jenkins\jenkins-slave\workspace\ox_maven-site-plugin_master-LZWAKOPRMO5JAZW5HRA2IQ56LLTFU3PLKDIE2JNFFXEGASBYKK3Q@3\windows-jdk8-m3.2.x_build\target\it\surefire-report\build.log, f:\jenkins\jenkins-slave\workspace\ox_maven-site-plugin_master-LZWAKOPRMO5JAZW5HRA2IQ56LLTFU3PLKDIE2JNFFXEGASBYKK3Q@3\windows-jdk8-m3.2.x_build\target\it\template-skin\build.log, f:\jenkins\jenkins-slave\workspace\ox_maven-site-plugin_master-LZWAKOPRMO5JAZW5HRA2IQ56LLTFU3PLKDIE2JNFFXEGASBYKK3Q@3\windows-jdk8-m3.2.x_build\target\it\validate\build.log]
[windows-jdk8-m3.2.x_build] Finished parsing Maven Invoker results (found 56)
[windows-jdk8-m3.2.x_build] [withMaven] junitPublisher - Archive test results for Maven artifact org.apache.maven.plugins:maven-site-plugin:3.8-SNAPSHOT generated by maven-surefire-plugin:test (default-test): windows-jdk8-m3.2.x_build\target\surefire-reports\*.xml
[windows-jdk8-m3.2.x_build] Recording test results
[windows-jdk8-m3.2.x_build] [withMaven] openTasksPublisher - Scan Tasks for Maven artifact org.apache.maven.plugins:maven-site-plugin:3.8-SNAPSHOT in source directory windows-jdk8-m3.2.x_build\src\main\java
[windows-jdk8-m3.2.x_build] [TASKS] Scanning folder 'f:\jenkins\jenkins-slave\workspace\ox_maven-site-plugin_master-LZWAKOPRMO5JAZW5HRA2IQ56LLTFU3PLKDIE2JNFFXEGASBYKK3Q@3' for files matching the pattern 'windows-jdk8-m3.2.x_build\src\main\java\**\*' - excludes: null
[windows-jdk8-m3.2.x_build] [TASKS] Found 21 files to scan for tasks
[windows-jdk8-m3.2.x_build] [TASKS] Found 8 open tasks.
[windows-jdk8-m3.2.x_build] Skipping warnings blame since pipelines do not have an SCM link.%n
[windows-jdk8-m3.2.x_build] [TASKS] Computing warning deltas based on reference build #27
[Pipeline] [windows-jdk8-m3.2.x_build] // withMaven
[Pipeline] [windows-jdk8-m3.2.x_build] cleanWs
[Pipeline] [windows-jdk8-m3.3.x_build] }
[Pipeline] [windows-jdk9-m3.5.x_build] }
[Pipeline] [windows-jdk8-m3.3.x_build] // dir
[Pipeline] [windows-jdk9-m3.5.x_build] // dir
[windows-jdk8-m3.2.x_build] [WS-CLEANUP] Deleting project workspace...[WS-CLEANUP] done
[Pipeline] [windows-jdk8-m3.3.x_build] }
[windows-jdk8-m3.3.x_build] [withMaven] invokerPublisher - Archive invoker results for Maven artifact MavenArtifact{org.apache.maven.plugins:maven-site-plugin::3.8-SNAPSHOT(version: 3.8-SNAPSHOT, snapshot:false) } generated by PluginInvocation{org.apache.maven.plugins:maven-invoker-plugin:3.1.0@integration-test  integration-test}: windows-jdk8-m3.3.x_build\target\invoker-reports\*.xml
[windows-jdk8-m3.3.x_build] performing MavenInvokerRecorder, reportsFilenamePattern:'**/windows-jdk8-m3.3.x_build\target\invoker-reports/BUILD*.xml', invokerBuildDir:'**/windows-jdk8-m3.3.x_build\target\it'
[windows-jdk8-m3.3.x_build] Found reports:[f:\jenkins\jenkins-slave\workspace\ox_maven-site-plugin_master-LZWAKOPRMO5JAZW5HRA2IQ56LLTFU3PLKDIE2JNFFXEGASBYKK3Q@2@2\windows-jdk8-m3.3.x_build\target\invoker-reports\BUILD-MSITE-159.xml, f:\jenkins\jenkins-slave\workspace\ox_maven-site-plugin_master-LZWAKOPRMO5JAZW5HRA2IQ56LLTFU3PLKDIE2JNFFXEGASBYKK3Q@2@2\windows-jdk8-m3.3.x_build\target\invoker-reports\BUILD-MSITE-265.xml, f:\jenkins\jenkins-slave\workspace\ox_maven-site-plugin_master-LZWAKOPRMO5JAZW5HRA2IQ56LLTFU3PLKDIE2JNFFXEGASBYKK3Q@2@2\windows-jdk8-m3.3.x_build\target\invoker-reports\BUILD-MSITE-354.xml, f:\jenkins\jenkins-slave\workspace\ox_maven-site-plugin_master-LZWAKOPRMO5JAZW5HRA2IQ56LLTFU3PLKDIE2JNFFXEGASBYKK3Q@2@2\windows-jdk8-m3.3.x_build\target\invoker-reports\BUILD-MSITE-456.xml, f:\jenkins\jenkins-slave\workspace\ox_maven-site-plugin_master-LZWAKOPRMO5JAZW5HRA2IQ56LLTFU3PLKDIE2JNFFXEGASBYKK3Q@2@2\windows-jdk8-m3.3.x_build\target\invoker-reports\BUILD-MSITE-458.xml, f:\jenkins\jenkins-slave\workspace\ox_maven-site-plugin_master-LZWAKOPRMO5JAZW5HRA2IQ56LLTFU3PLKDIE2JNFFXEGASBYKK3Q@2@2\windows-jdk8-m3.3.x_build\target\invoker-reports\BUILD-MSITE-484.xml, f:\jenkins\jenkins-slave\workspace\ox_maven-site-plugin_master-LZWAKOPRMO5JAZW5HRA2IQ56LLTFU3PLKDIE2JNFFXEGASBYKK3Q@2@2\windows-jdk8-m3.3.x_build\target\invoker-reports\BUILD-MSITE-497.xml, f:\jenkins\jenkins-slave\workspace\ox_maven-site-plugin_master-LZWAKOPRMO5JAZW5HRA2IQ56LLTFU3PLKDIE2JNFFXEGASBYKK3Q@2@2\windows-jdk8-m3.3.x_build\target\invoker-reports\BUILD-MSITE-504.xml, f:\jenkins\jenkins-slave\workspace\ox_maven-site-plugin_master-LZWAKOPRMO5JAZW5HRA2IQ56LLTFU3PLKDIE2JNFFXEGASBYKK3Q@2@2\windows-jdk8-m3.3.x_build\target\invoker-reports\BUILD-MSITE-506.xml, f:\jenkins\jenkins-slave\workspace\ox_maven-site-plugin_master-LZWAKOPRMO5JAZW5HRA2IQ56LLTFU3PLKDIE2JNFFXEGASBYKK3Q@2@2\windows-jdk8-m3.3.x_build\target\invoker-reports\BUILD-MSITE-507.xml, f:\jenkins\jenkins-slave\workspace\ox_maven-site-plugin_master-LZWAKOPRMO5JAZW5HRA2IQ56LLTFU3PLKDIE2JNFFXEGASBYKK3Q@2@2\windows-jdk8-m3.3.x_build\target\invoker-reports\BUILD-MSITE-512.xml, f:\jenkins\jenkins-slave\workspace\ox_maven-site-plugin_master-LZWAKOPRMO5JAZW5HRA2IQ56LLTFU3PLKDIE2JNFFXEGASBYKK3Q@2@2\windows-jdk8-m3.3.x_build\target\invoker-reports\BUILD-MSITE-548.xml, f:\jenkins\jenkins-slave\workspace\ox_maven-site-plugin_master-LZWAKOPRMO5JAZW5HRA2IQ56LLTFU3PLKDIE2JNFFXEGASBYKK3Q@2@2\windows-jdk8-m3.3.x_build\target\invoker-reports\BUILD-MSITE-566.xml, f:\jenkins\jenkins-slave\workspace\ox_maven-site-plugin_master-LZWAKOPRMO5JAZW5HRA2IQ56LLTFU3PLKDIE2JNFFXEGASBYKK3Q@2@2\windows-jdk8-m3.3.x_build\target\invoker-reports\BUILD-MSITE-582.xml, f:\jenkins\jenkins-slave\workspace\ox_maven-site-plugin_master-LZWAKOPRMO5JAZW5HRA2IQ56LLTFU3PLKDIE2JNFFXEGASBYKK3Q@2@2\windows-jdk8-m3.3.x_build\target\invoker-reports\BUILD-MSITE-604.xml, f:\jenkins\jenkins-slave\workspace\ox_maven-site-plugin_master-LZWAKOPRMO5JAZW5HRA2IQ56LLTFU3PLKDIE2JNFFXEGASBYKK3Q@2@2\windows-jdk8-m3.3.x_build\target\invoker-reports\BUILD-MSITE-609.xml, f:\jenkins\jenkins-slave\workspace\ox_maven-site-plugin_master-LZWAKOPRMO5JAZW5HRA2IQ56LLTFU3PLKDIE2JNFFXEGASBYKK3Q@2@2\windows-jdk8-m3.3.x_build\target\invoker-reports\BUILD-MSITE-627.xml, f:\jenkins\jenkins-slave\workspace\ox_maven-site-plugin_master-LZWAKOPRMO5JAZW5HRA2IQ56LLTFU3PLKDIE2JNFFXEGASBYKK3Q@2@2\windows-jdk8-m3.3.x_build\target\invoker-reports\BUILD-MSITE-644.xml, f:\jenkins\jenkins-slave\workspace\ox_maven-site-plugin_master-LZWAKOPRMO5JAZW5HRA2IQ56LLTFU3PLKDIE2JNFFXEGASBYKK3Q@2@2\windows-jdk8-m3.3.x_build\target\invoker-reports\BUILD-MSITE-658.xml, f:\jenkins\jenkins-slave\workspace\ox_maven-site-plugin_master-LZWAKOPRMO5JAZW5HRA2IQ56LLTFU3PLKDIE2JNFFXEGASBYKK3Q@2@2\windows-jdk8-m3.3.x_build\target\invoker-reports\BUILD-MSITE-665.xml, f:\jenkins\jenkins-slave\workspace\ox_maven-site-plugin_master-LZWAKOPRMO5JAZW5HRA2IQ56LLTFU3PLKDIE2JNFFXEGASBYKK3Q@2@2\windows-jdk8-m3.3.x_build\target\invoker-reports\BUILD-MSITE-705-debug.xml, f:\jenkins\jenkins-slave\workspace\ox_maven-site-plugin_master-LZWAKOPRMO5JAZW5HRA2IQ56LLTFU3PLKDIE2JNFFXEGASBYKK3Q@2@2\windows-jdk8-m3.3.x_build\target\invoker-reports\BUILD-MSITE-705-no-debug.xml, f:\jenkins\jenkins-slave\workspace\ox_maven-site-plugin_master-LZWAKOPRMO5JAZW5HRA2IQ56LLTFU3PLKDIE2JNFFXEGASBYKK3Q@2@2\windows-jdk8-m3.3.x_build\target\invoker-reports\BUILD-MSITE-723.xml, f:\jenkins\jenkins-slave\workspace\ox_maven-site-plugin_master-LZWAKOPRMO5JAZW5HRA2IQ56LLTFU3PLKDIE2JNFFXEGASBYKK3Q@2@2\windows-jdk8-m3.3.x_build\target\invoker-reports\BUILD-default-reports-excluded.xml, f:\jenkins\jenkins-slave\workspace\ox_maven-site-plugin_master-LZWAKOPRMO5JAZW5HRA2IQ56LLTFU3PLKDIE2JNFFXEGASBYKK3Q@2@2\windows-jdk8-m3.3.x_build\target\invoker-reports\BUILD-default-reports.xml, f:\jenkins\jenkins-slave\workspace\ox_maven-site-plugin_master-LZWAKOPRMO5JAZW5HRA2IQ56LLTFU3PLKDIE2JNFFXEGASBYKK3Q@2@2\windows-jdk8-m3.3.x_build\target\invoker-reports\BUILD-doxia-formats.xml, f:\jenkins\jenkins-slave\workspace\ox_maven-site-plugin_master-LZWAKOPRMO5JAZW5HRA2IQ56LLTFU3PLKDIE2JNFFXEGASBYKK3Q@2@2\windows-jdk8-m3.3.x_build\target\invoker-reports\BUILD-effective-site.xml, f:\jenkins\jenkins-slave\workspace\ox_maven-site-plugin_master-LZWAKOPRMO5JAZW5HRA2IQ56LLTFU3PLKDIE2JNFFXEGASBYKK3Q@2@2\windows-jdk8-m3.3.x_build\target\invoker-reports\BUILD-emma-plugin-it.xml, f:\jenkins\jenkins-slave\workspace\ox_maven-site-plugin_master-LZWAKOPRMO5JAZW5HRA2IQ56LLTFU3PLKDIE2JNFFXEGASBYKK3Q@2@2\windows-jdk8-m3.3.x_build\target\invoker-reports\BUILD-empty-report-set.xml, f:\jenkins\jenkins-slave\workspace\ox_maven-site-plugin_master-LZWAKOPRMO5JAZW5HRA2IQ56LLTFU3PLKDIE2JNFFXEGASBYKK3Q@2@2\windows-jdk8-m3.3.x_build\target\invoker-reports\BUILD-failure.xml, f:\jenkins\jenkins-slave\workspace\ox_maven-site-plugin_master-LZWAKOPRMO5JAZW5HRA2IQ56LLTFU3PLKDIE2JNFFXEGASBYKK3Q@2@2\windows-jdk8-m3.3.x_build\target\invoker-reports\BUILD-full-reporting.xml, f:\jenkins\jenkins-slave\workspace\ox_maven-site-plugin_master-LZWAKOPRMO5JAZW5HRA2IQ56LLTFU3PLKDIE2JNFFXEGASBYKK3Q@2@2\windows-jdk8-m3.3.x_build\target\invoker-reports\BUILD-inheritance-interpolation.xml, f:\jenkins\jenkins-slave\workspace\ox_maven-site-plugin_master-LZWAKOPRMO5JAZW5HRA2IQ56LLTFU3PLKDIE2JNFFXEGASBYKK3Q@2@2\windows-jdk8-m3.3.x_build\target\invoker-reports\BUILD-inheritedMenus.xml, f:\jenkins\jenkins-slave\workspace\ox_maven-site-plugin_master-LZWAKOPRMO5JAZW5HRA2IQ56LLTFU3PLKDIE2JNFFXEGASBYKK3Q@2@2\windows-jdk8-m3.3.x_build\target\invoker-reports\BUILD-inheritedReports.xml, f:\jenkins\jenkins-slave\workspace\ox_maven-site-plugin_master-LZWAKOPRMO5JAZW5HRA2IQ56LLTFU3PLKDIE2JNFFXEGASBYKK3Q@2@2\windows-jdk8-m3.3.x_build\target\invoker-reports\BUILD-it-plugin-test.xml, f:\jenkins\jenkins-slave\workspace\ox_maven-site-plugin_master-LZWAKOPRMO5JAZW5HRA2IQ56LLTFU3PLKDIE2JNFFXEGASBYKK3Q@2@2\windows-jdk8-m3.3.x_build\target\invoker-reports\BUILD-new-configuration.xml, f:\jenkins\jenkins-slave\workspace\ox_maven-site-plugin_master-LZWAKOPRMO5JAZW5HRA2IQ56LLTFU3PLKDIE2JNFFXEGASBYKK3Q@2@2\windows-jdk8-m3.3.x_build\target\invoker-reports\BUILD-no-version.xml, f:\jenkins\jenkins-slave\workspace\ox_maven-site-plugin_master-LZWAKOPRMO5JAZW5HRA2IQ56LLTFU3PLKDIE2JNFFXEGASBYKK3Q@2@2\windows-jdk8-m3.3.x_build\target\invoker-reports\BUILD-report-changes-generation.xml, f:\jenkins\jenkins-slave\workspace\ox_maven-site-plugin_master-LZWAKOPRMO5JAZW5HRA2IQ56LLTFU3PLKDIE2JNFFXEGASBYKK3Q@2@2\windows-jdk8-m3.3.x_build\target\invoker-reports\BUILD-reportConfig.xml, f:\jenkins\jenkins-slave\workspace\ox_maven-site-plugin_master-LZWAKOPRMO5JAZW5HRA2IQ56LLTFU3PLKDIE2JNFFXEGASBYKK3Q@2@2\windows-jdk8-m3.3.x_build\target\invoker-reports\BUILD-resources.xml, f:\jenkins\jenkins-slave\workspace\ox_maven-site-plugin_master-LZWAKOPRMO5JAZW5HRA2IQ56LLTFU3PLKDIE2JNFFXEGASBYKK3Q@2@2\windows-jdk8-m3.3.x_build\target\invoker-reports\BUILD-site-attach-descriptor.xml, f:\jenkins\jenkins-slave\workspace\ox_maven-site-plugin_master-LZWAKOPRMO5JAZW5HRA2IQ56LLTFU3PLKDIE2JNFFXEGASBYKK3Q@2@2\windows-jdk8-m3.3.x_build\target\invoker-reports\BUILD-site-deploy.xml, f:\jenkins\jenkins-slave\workspace\ox_maven-site-plugin_master-LZWAKOPRMO5JAZW5HRA2IQ56LLTFU3PLKDIE2JNFFXEGASBYKK3Q@2@2\windows-jdk8-m3.3.x_build\target\invoker-reports\BUILD-site-inheritance.xml, f:\jenkins\jenkins-slave\workspace\ox_maven-site-plugin_master-LZWAKOPRMO5JAZW5HRA2IQ56LLTFU3PLKDIE2JNFFXEGASBYKK3Q@2@2\windows-jdk8-m3.3.x_build\target\invoker-reports\BUILD-site-jar.xml, f:\jenkins\jenkins-slave\workspace\ox_maven-site-plugin_master-LZWAKOPRMO5JAZW5HRA2IQ56LLTFU3PLKDIE2JNFFXEGASBYKK3Q@2@2\windows-jdk8-m3.3.x_build\target\invoker-reports\BUILD-site-sd-2.xml, f:\jenkins\jenkins-slave\workspace\ox_maven-site-plugin_master-LZWAKOPRMO5JAZW5HRA2IQ56LLTFU3PLKDIE2JNFFXEGASBYKK3Q@2@2\windows-jdk8-m3.3.x_build\target\invoker-reports\BUILD-site-sd-lang.xml, f:\jenkins\jenkins-slave\workspace\ox_maven-site-plugin_master-LZWAKOPRMO5JAZW5HRA2IQ56LLTFU3PLKDIE2JNFFXEGASBYKK3Q@2@2\windows-jdk8-m3.3.x_build\target\invoker-reports\BUILD-site-sd-stagingSiteURL.xml, f:\jenkins\jenkins-slave\workspace\ox_maven-site-plugin_master-LZWAKOPRMO5JAZW5HRA2IQ56LLTFU3PLKDIE2JNFFXEGASBYKK3Q@2@2\windows-jdk8-m3.3.x_build\target\invoker-reports\BUILD-site-sd-submodule.xml, f:\jenkins\jenkins-slave\workspace\ox_maven-site-plugin_master-LZWAKOPRMO5JAZW5HRA2IQ56LLTFU3PLKDIE2JNFFXEGASBYKK3Q@2@2\windows-jdk8-m3.3.x_build\target\invoker-reports\BUILD-site-sd-top-parent-different-site.xml, f:\jenkins\jenkins-slave\workspace\ox_maven-site-plugin_master-LZWAKOPRMO5JAZW5HRA2IQ56LLTFU3PLKDIE2JNFFXEGASBYKK3Q@2@2\windows-jdk8-m3.3.x_build\target\invoker-reports\BUILD-site-sd-top-parent-no-site.xml, f:\jenkins\jenkins-slave\workspace\ox_maven-site-plugin_master-LZWAKOPRMO5JAZW5HRA2IQ56LLTFU3PLKDIE2JNFFXEGASBYKK3Q@2@2\windows-jdk8-m3.3.x_build\target\invoker-reports\BUILD-site-sd-top-parent-same-site.xml, f:\jenkins\jenkins-slave\workspace\ox_maven-site-plugin_master-LZWAKOPRMO5JAZW5HRA2IQ56LLTFU3PLKDIE2JNFFXEGASBYKK3Q@2@2\windows-jdk8-m3.3.x_build\target\invoker-reports\BUILD-site-sd.xml, f:\jenkins\jenkins-slave\workspace\ox_maven-site-plugin_master-LZWAKOPRMO5JAZW5HRA2IQ56LLTFU3PLKDIE2JNFFXEGASBYKK3Q@2@2\windows-jdk8-m3.3.x_build\target\invoker-reports\BUILD-site-skip.xml, f:\jenkins\jenkins-slave\workspace\ox_maven-site-plugin_master-LZWAKOPRMO5JAZW5HRA2IQ56LLTFU3PLKDIE2JNFFXEGASBYKK3Q@2@2\windows-jdk8-m3.3.x_build\target\invoker-reports\BUILD-surefire-report.xml, f:\jenkins\jenkins-slave\workspace\ox_maven-site-plugin_master-LZWAKOPRMO5JAZW5HRA2IQ56LLTFU3PLKDIE2JNFFXEGASBYKK3Q@2@2\windows-jdk8-m3.3.x_build\target\invoker-reports\BUILD-template-skin.xml, f:\jenkins\jenkins-slave\workspace\ox_maven-site-plugin_master-LZWAKOPRMO5JAZW5HRA2IQ56LLTFU3PLKDIE2JNFFXEGASBYKK3Q@2@2\windows-jdk8-m3.3.x_build\target\invoker-reports\BUILD-validate.xml]
[windows-jdk8-m3.3.x_build] Found logs:[f:\jenkins\jenkins-slave\workspace\ox_maven-site-plugin_master-LZWAKOPRMO5JAZW5HRA2IQ56LLTFU3PLKDIE2JNFFXEGASBYKK3Q@2@2\windows-jdk8-m3.3.x_build\target\it\MSITE-159\build.log, f:\jenkins\jenkins-slave\workspace\ox_maven-site-plugin_master-LZWAKOPRMO5JAZW5HRA2IQ56LLTFU3PLKDIE2JNFFXEGASBYKK3Q@2@2\windows-jdk8-m3.3.x_build\target\it\MSITE-265\build.log, f:\jenkins\jenkins-slave\workspace\ox_maven-site-plugin_master-LZWAKOPRMO5JAZW5HRA2IQ56LLTFU3PLKDIE2JNFFXEGASBYKK3Q@2@2\windows-jdk8-m3.3.x_build\target\it\MSITE-354\build.log, f:\jenkins\jenkins-slave\workspace\ox_maven-site-plugin_master-LZWAKOPRMO5JAZW5HRA2IQ56LLTFU3PLKDIE2JNFFXEGASBYKK3Q@2@2\windows-jdk8-m3.3.x_build\target\it\MSITE-456\build.log, f:\jenkins\jenkins-slave\workspace\ox_maven-site-plugin_master-LZWAKOPRMO5JAZW5HRA2IQ56LLTFU3PLKDIE2JNFFXEGASBYKK3Q@2@2\windows-jdk8-m3.3.x_build\target\it\MSITE-458\build.log, f:\jenkins\jenkins-slave\workspace\ox_maven-site-plugin_master-LZWAKOPRMO5JAZW5HRA2IQ56LLTFU3PLKDIE2JNFFXEGASBYKK3Q@2@2\windows-jdk8-m3.3.x_build\target\it\MSITE-484\build.log, f:\jenkins\jenkins-slave\workspace\ox_maven-site-plugin_master-LZWAKOPRMO5JAZW5HRA2IQ56LLTFU3PLKDIE2JNFFXEGASBYKK3Q@2@2\windows-jdk8-m3.3.x_build\target\it\MSITE-497\build.log, f:\jenkins\jenkins-slave\workspace\ox_maven-site-plugin_master-LZWAKOPRMO5JAZW5HRA2IQ56LLTFU3PLKDIE2JNFFXEGASBYKK3Q@2@2\windows-jdk8-m3.3.x_build\target\it\MSITE-504\build.log, f:\jenkins\jenkins-slave\workspace\ox_maven-site-plugin_master-LZWAKOPRMO5JAZW5HRA2IQ56LLTFU3PLKDIE2JNFFXEGASBYKK3Q@2@2\windows-jdk8-m3.3.x_build\target\it\MSITE-506\build.log, f:\jenkins\jenkins-slave\workspace\ox_maven-site-plugin_master-LZWAKOPRMO5JAZW5HRA2IQ56LLTFU3PLKDIE2JNFFXEGASBYKK3Q@2@2\windows-jdk8-m3.3.x_build\target\it\MSITE-507\build.log, f:\jenkins\jenkins-slave\workspace\ox_maven-site-plugin_master-LZWAKOPRMO5JAZW5HRA2IQ56LLTFU3PLKDIE2JNFFXEGASBYKK3Q@2@2\windows-jdk8-m3.3.x_build\target\it\MSITE-512\build.log, f:\jenkins\jenkins-slave\workspace\ox_maven-site-plugin_master-LZWAKOPRMO5JAZW5HRA2IQ56LLTFU3PLKDIE2JNFFXEGASBYKK3Q@2@2\windows-jdk8-m3.3.x_build\target\it\MSITE-548\build.log, f:\jenkins\jenkins-slave\workspace\ox_maven-site-plugin_master-LZWAKOPRMO5JAZW5HRA2IQ56LLTFU3PLKDIE2JNFFXEGASBYKK3Q@2@2\windows-jdk8-m3.3.x_build\target\it\MSITE-566\build.log, f:\jenkins\jenkins-slave\workspace\ox_maven-site-plugin_master-LZWAKOPRMO5JAZW5HRA2IQ56LLTFU3PLKDIE2JNFFXEGASBYKK3Q@2@2\windows-jdk8-m3.3.x_build\target\it\MSITE-582\build.log, f:\jenkins\jenkins-slave\workspace\ox_maven-site-plugin_master-LZWAKOPRMO5JAZW5HRA2IQ56LLTFU3PLKDIE2JNFFXEGASBYKK3Q@2@2\windows-jdk8-m3.3.x_build\target\it\MSITE-604\build.log, f:\jenkins\jenkins-slave\workspace\ox_maven-site-plugin_master-LZWAKOPRMO5JAZW5HRA2IQ56LLTFU3PLKDIE2JNFFXEGASBYKK3Q@2@2\windows-jdk8-m3.3.x_build\target\it\MSITE-609\build.log, f:\jenkins\jenkins-slave\workspace\ox_maven-site-plugin_master-LZWAKOPRMO5JAZW5HRA2IQ56LLTFU3PLKDIE2JNFFXEGASBYKK3Q@2@2\windows-jdk8-m3.3.x_build\target\it\MSITE-627\build.log, f:\jenkins\jenkins-slave\workspace\ox_maven-site-plugin_master-LZWAKOPRMO5JAZW5HRA2IQ56LLTFU3PLKDIE2JNFFXEGASBYKK3Q@2@2\windows-jdk8-m3.3.x_build\target\it\MSITE-644\build.log, f:\jenkins\jenkins-slave\workspace\ox_maven-site-plugin_master-LZWAKOPRMO5JAZW5HRA2IQ56LLTFU3PLKDIE2JNFFXEGASBYKK3Q@2@2\windows-jdk8-m3.3.x_build\target\it\MSITE-658\build.log, f:\jenkins\jenkins-slave\workspace\ox_maven-site-plugin_master-LZWAKOPRMO5JAZW5HRA2IQ56LLTFU3PLKDIE2JNFFXEGASBYKK3Q@2@2\windows-jdk8-m3.3.x_build\target\it\MSITE-665\build.log, f:\jenkins\jenkins-slave\workspace\ox_maven-site-plugin_master-LZWAKOPRMO5JAZW5HRA2IQ56LLTFU3PLKDIE2JNFFXEGASBYKK3Q@2@2\windows-jdk8-m3.3.x_build\target\it\MSITE-705-debug\build.log, f:\jenkins\jenkins-slave\workspace\ox_maven-site-plugin_master-LZWAKOPRMO5JAZW5HRA2IQ56LLTFU3PLKDIE2JNFFXEGASBYKK3Q@2@2\windows-jdk8-m3.3.x_build\target\it\MSITE-705-no-debug\build.log, f:\jenkins\jenkins-slave\workspace\ox_maven-site-plugin_master-LZWAKOPRMO5JAZW5HRA2IQ56LLTFU3PLKDIE2JNFFXEGASBYKK3Q@2@2\windows-jdk8-m3.3.x_build\target\it\MSITE-723\build.log, f:\jenkins\jenkins-slave\workspace\ox_maven-site-plugin_master-LZWAKOPRMO5JAZW5HRA2IQ56LLTFU3PLKDIE2JNFFXEGASBYKK3Q@2@2\windows-jdk8-m3.3.x_build\target\it\default-reports-excluded\build.log, f:\jenkins\jenkins-slave\workspace\ox_maven-site-plugin_master-LZWAKOPRMO5JAZW5HRA2IQ56LLTFU3PLKDIE2JNFFXEGASBYKK3Q@2@2\windows-jdk8-m3.3.x_build\target\it\default-reports\build.log, f:\jenkins\jenkins-slave\workspace\ox_maven-site-plugin_master-LZWAKOPRMO5JAZW5HRA2IQ56LLTFU3PLKDIE2JNFFXEGASBYKK3Q@2@2\windows-jdk8-m3.3.x_build\target\it\doxia-formats\build.log, f:\jenkins\jenkins-slave\workspace\ox_maven-site-plugin_master-LZWAKOPRMO5JAZW5HRA2IQ56LLTFU3PLKDIE2JNFFXEGASBYKK3Q@2@2\windows-jdk8-m3.3.x_build\target\it\effective-site\build.log, f:\jenkins\jenkins-slave\workspace\ox_maven-site-plugin_master-LZWAKOPRMO5JAZW5HRA2IQ56LLTFU3PLKDIE2JNFFXEGASBYKK3Q@2@2\windows-jdk8-m3.3.x_build\target\it\emma-plugin-it\build.log, f:\jenkins\jenkins-slave\workspace\ox_maven-site-plugin_master-LZWAKOPRMO5JAZW5HRA2IQ56LLTFU3PLKDIE2JNFFXEGASBYKK3Q@2@2\windows-jdk8-m3.3.x_build\target\it\empty-report-set\build.log, f:\jenkins\jenkins-slave\workspace\ox_maven-site-plugin_master-LZWAKOPRMO5JAZW5HRA2IQ56LLTFU3PLKDIE2JNFFXEGASBYKK3Q@2@2\windows-jdk8-m3.3.x_build\target\it\failure\build.log, f:\jenkins\jenkins-slave\workspace\ox_maven-site-plugin_master-LZWAKOPRMO5JAZW5HRA2IQ56LLTFU3PLKDIE2JNFFXEGASBYKK3Q@2@2\windows-jdk8-m3.3.x_build\target\it\full-reporting\build.log, f:\jenkins\jenkins-slave\workspace\ox_maven-site-plugin_master-LZWAKOPRMO5JAZW5HRA2IQ56LLTFU3PLKDIE2JNFFXEGASBYKK3Q@2@2\windows-jdk8-m3.3.x_build\target\it\inheritance-interpolation\build.log, f:\jenkins\jenkins-slave\workspace\ox_maven-site-plugin_master-LZWAKOPRMO5JAZW5HRA2IQ56LLTFU3PLKDIE2JNFFXEGASBYKK3Q@2@2\windows-jdk8-m3.3.x_build\target\it\inheritedMenus\build.log, f:\jenkins\jenkins-slave\workspace\ox_maven-site-plugin_master-LZWAKOPRMO5JAZW5HRA2IQ56LLTFU3PLKDIE2JNFFXEGASBYKK3Q@2@2\windows-jdk8-m3.3.x_build\target\it\inheritedReports\build.log, f:\jenkins\jenkins-slave\workspace\ox_maven-site-plugin_master-LZWAKOPRMO5JAZW5HRA2IQ56LLTFU3PLKDIE2JNFFXEGASBYKK3Q@2@2\windows-jdk8-m3.3.x_build\target\it\it-plugin-test\build.log, f:\jenkins\jenkins-slave\workspace\ox_maven-site-plugin_master-LZWAKOPRMO5JAZW5HRA2IQ56LLTFU3PLKDIE2JNFFXEGASBYKK3Q@2@2\windows-jdk8-m3.3.x_build\target\it\new-configuration\build.log, f:\jenkins\jenkins-slave\workspace\ox_maven-site-plugin_master-LZWAKOPRMO5JAZW5HRA2IQ56LLTFU3PLKDIE2JNFFXEGASBYKK3Q@2@2\windows-jdk8-m3.3.x_build\target\it\no-version\build.log, f:\jenkins\jenkins-slave\workspace\ox_maven-site-plugin_master-LZWAKOPRMO5JAZW5HRA2IQ56LLTFU3PLKDIE2JNFFXEGASBYKK3Q@2@2\windows-jdk8-m3.3.x_build\target\it\report-changes-generation\build.log, f:\jenkins\jenkins-slave\workspace\ox_maven-site-plugin_master-LZWAKOPRMO5JAZW5HRA2IQ56LLTFU3PLKDIE2JNFFXEGASBYKK3Q@2@2\windows-jdk8-m3.3.x_build\target\it\reportConfig\build.log, f:\jenkins\jenkins-slave\workspace\ox_maven-site-plugin_master-LZWAKOPRMO5JAZW5HRA2IQ56LLTFU3PLKDIE2JNFFXEGASBYKK3Q@2@2\windows-jdk8-m3.3.x_build\target\it\resources\build.log, f:\jenkins\jenkins-slave\workspace\ox_maven-site-plugin_master-LZWAKOPRMO5JAZW5HRA2IQ56LLTFU3PLKDIE2JNFFXEGASBYKK3Q@2@2\windows-jdk8-m3.3.x_build\target\it\site-attach-descriptor\build.log, f:\jenkins\jenkins-slave\workspace\ox_maven-site-plugin_master-LZWAKOPRMO5JAZW5HRA2IQ56LLTFU3PLKDIE2JNFFXEGASBYKK3Q@2@2\windows-jdk8-m3.3.x_build\target\it\site-deploy\build.log, f:\jenkins\jenkins-slave\workspace\ox_maven-site-plugin_master-LZWAKOPRMO5JAZW5HRA2IQ56LLTFU3PLKDIE2JNFFXEGASBYKK3Q@2@2\windows-jdk8-m3.3.x_build\target\it\site-inheritance\build.log, f:\jenkins\jenkins-slave\workspace\ox_maven-site-plugin_master-LZWAKOPRMO5JAZW5HRA2IQ56LLTFU3PLKDIE2JNFFXEGASBYKK3Q@2@2\windows-jdk8-m3.3.x_build\target\it\site-jar\build.log, f:\jenkins\jenkins-slave\workspace\ox_maven-site-plugin_master-LZWAKOPRMO5JAZW5HRA2IQ56LLTFU3PLKDIE2JNFFXEGASBYKK3Q@2@2\windows-jdk8-m3.3.x_build\target\it\site-sd-2\build.log, f:\jenkins\jenkins-slave\workspace\ox_maven-site-plugin_master-LZWAKOPRMO5JAZW5HRA2IQ56LLTFU3PLKDIE2JNFFXEGASBYKK3Q@2@2\windows-jdk8-m3.3.x_build\target\it\site-sd-lang\build.log, f:\jenkins\jenkins-slave\workspace\ox_maven-site-plugin_master-LZWAKOPRMO5JAZW5HRA2IQ56LLTFU3PLKDIE2JNFFXEGASBYKK3Q@2@2\windows-jdk8-m3.3.x_build\target\it\site-sd-stagingSiteURL\build.log, f:\jenkins\jenkins-slave\workspace\ox_maven-site-plugin_master-LZWAKOPRMO5JAZW5HRA2IQ56LLTFU3PLKDIE2JNFFXEGASBYKK3Q@2@2\windows-jdk8-m3.3.x_build\target\it\site-sd-submodule\build.log, f:\jenkins\jenkins-slave\workspace\ox_maven-site-plugin_master-LZWAKOPRMO5JAZW5HRA2IQ56LLTFU3PLKDIE2JNFFXEGASBYKK3Q@2@2\windows-jdk8-m3.3.x_build\target\it\site-sd-top-parent-different-site\build.log, f:\jenkins\jenkins-slave\workspace\ox_maven-site-plugin_master-LZWAKOPRMO5JAZW5HRA2IQ56LLTFU3PLKDIE2JNFFXEGASBYKK3Q@2@2\windows-jdk8-m3.3.x_build\target\it\site-sd-top-parent-no-site\build.log, f:\jenkins\jenkins-slave\workspace\ox_maven-site-plugin_master-LZWAKOPRMO5JAZW5HRA2IQ56LLTFU3PLKDIE2JNFFXEGASBYKK3Q@2@2\windows-jdk8-m3.3.x_build\target\it\site-sd-top-parent-same-site\build.log, f:\jenkins\jenkins-slave\workspace\ox_maven-site-plugin_master-LZWAKOPRMO5JAZW5HRA2IQ56LLTFU3PLKDIE2JNFFXEGASBYKK3Q@2@2\windows-jdk8-m3.3.x_build\target\it\site-sd\build.log, f:\jenkins\jenkins-slave\workspace\ox_maven-site-plugin_master-LZWAKOPRMO5JAZW5HRA2IQ56LLTFU3PLKDIE2JNFFXEGASBYKK3Q@2@2\windows-jdk8-m3.3.x_build\target\it\site-skip\build.log, f:\jenkins\jenkins-slave\workspace\ox_maven-site-plugin_master-LZWAKOPRMO5JAZW5HRA2IQ56LLTFU3PLKDIE2JNFFXEGASBYKK3Q@2@2\windows-jdk8-m3.3.x_build\target\it\surefire-report\build.log, f:\jenkins\jenkins-slave\workspace\ox_maven-site-plugin_master-LZWAKOPRMO5JAZW5HRA2IQ56LLTFU3PLKDIE2JNFFXEGASBYKK3Q@2@2\windows-jdk8-m3.3.x_build\target\it\template-skin\build.log, f:\jenkins\jenkins-slave\workspace\ox_maven-site-plugin_master-LZWAKOPRMO5JAZW5HRA2IQ56LLTFU3PLKDIE2JNFFXEGASBYKK3Q@2@2\windows-jdk8-m3.3.x_build\target\it\validate\build.log]
[windows-jdk8-m3.3.x_build] Finished parsing Maven Invoker results (found 56)
[windows-jdk8-m3.3.x_build] [withMaven] junitPublisher - Archive test results for Maven artifact org.apache.maven.plugins:maven-site-plugin:3.8-SNAPSHOT generated by maven-surefire-plugin:test (default-test): windows-jdk8-m3.3.x_build\target\surefire-reports\*.xml
[windows-jdk8-m3.3.x_build] Recording test results
[windows-jdk8-m3.3.x_build] [withMaven] openTasksPublisher - Scan Tasks for Maven artifact org.apache.maven.plugins:maven-site-plugin:3.8-SNAPSHOT in source directory windows-jdk8-m3.3.x_build\src\main\java
[windows-jdk8-m3.3.x_build] [TASKS] Scanning folder 'f:\jenkins\jenkins-slave\workspace\ox_maven-site-plugin_master-LZWAKOPRMO5JAZW5HRA2IQ56LLTFU3PLKDIE2JNFFXEGASBYKK3Q@2@2' for files matching the pattern 'windows-jdk8-m3.3.x_build\src\main\java\**\*' - excludes: null
[windows-jdk8-m3.3.x_build] [TASKS] Found 21 files to scan for tasks
[windows-jdk8-m3.3.x_build] [TASKS] Found 8 open tasks.
[windows-jdk8-m3.3.x_build] Skipping warnings blame since pipelines do not have an SCM link.%n
[windows-jdk8-m3.3.x_build] [TASKS] Computing warning deltas based on reference build #27
[Pipeline] [windows-jdk9-m3.5.x_build] }
[windows-jdk9-m3.5.x_build] [withMaven] invokerPublisher - Archive invoker results for Maven artifact MavenArtifact{org.apache.maven.plugins:maven-site-plugin::3.8-SNAPSHOT(version: 3.8-SNAPSHOT, snapshot:false) } generated by PluginInvocation{org.apache.maven.plugins:maven-invoker-plugin:3.1.0@integration-test  integration-test}: windows-jdk9-m3.5.x_build\target\invoker-reports\*.xml
[windows-jdk9-m3.5.x_build] performing MavenInvokerRecorder, reportsFilenamePattern:'**/windows-jdk9-m3.5.x_build\target\invoker-reports/BUILD*.xml', invokerBuildDir:'**/windows-jdk9-m3.5.x_build\target\it'
[windows-jdk9-m3.5.x_build] Found reports:[f:\jenkins\jenkins-slave\workspace\ox_maven-site-plugin_master-LZWAKOPRMO5JAZW5HRA2IQ56LLTFU3PLKDIE2JNFFXEGASBYKK3Q@3\windows-jdk9-m3.5.x_build\target\invoker-reports\BUILD-MSITE-159.xml, f:\jenkins\jenkins-slave\workspace\ox_maven-site-plugin_master-LZWAKOPRMO5JAZW5HRA2IQ56LLTFU3PLKDIE2JNFFXEGASBYKK3Q@3\windows-jdk9-m3.5.x_build\target\invoker-reports\BUILD-MSITE-265.xml, f:\jenkins\jenkins-slave\workspace\ox_maven-site-plugin_master-LZWAKOPRMO5JAZW5HRA2IQ56LLTFU3PLKDIE2JNFFXEGASBYKK3Q@3\windows-jdk9-m3.5.x_build\target\invoker-reports\BUILD-MSITE-354.xml, f:\jenkins\jenkins-slave\workspace\ox_maven-site-plugin_master-LZWAKOPRMO5JAZW5HRA2IQ56LLTFU3PLKDIE2JNFFXEGASBYKK3Q@3\windows-jdk9-m3.5.x_build\target\invoker-reports\BUILD-MSITE-456.xml, f:\jenkins\jenkins-slave\workspace\ox_maven-site-plugin_master-LZWAKOPRMO5JAZW5HRA2IQ56LLTFU3PLKDIE2JNFFXEGASBYKK3Q@3\windows-jdk9-m3.5.x_build\target\invoker-reports\BUILD-MSITE-458.xml, f:\jenkins\jenkins-slave\workspace\ox_maven-site-plugin_master-LZWAKOPRMO5JAZW5HRA2IQ56LLTFU3PLKDIE2JNFFXEGASBYKK3Q@3\windows-jdk9-m3.5.x_build\target\invoker-reports\BUILD-MSITE-484.xml, f:\jenkins\jenkins-slave\workspace\ox_maven-site-plugin_master-LZWAKOPRMO5JAZW5HRA2IQ56LLTFU3PLKDIE2JNFFXEGASBYKK3Q@3\windows-jdk9-m3.5.x_build\target\invoker-reports\BUILD-MSITE-497.xml, f:\jenkins\jenkins-slave\workspace\ox_maven-site-plugin_master-LZWAKOPRMO5JAZW5HRA2IQ56LLTFU3PLKDIE2JNFFXEGASBYKK3Q@3\windows-jdk9-m3.5.x_build\target\invoker-reports\BUILD-MSITE-504.xml, f:\jenkins\jenkins-slave\workspace\ox_maven-site-plugin_master-LZWAKOPRMO5JAZW5HRA2IQ56LLTFU3PLKDIE2JNFFXEGASBYKK3Q@3\windows-jdk9-m3.5.x_build\target\invoker-reports\BUILD-MSITE-506.xml, f:\jenkins\jenkins-slave\workspace\ox_maven-site-plugin_master-LZWAKOPRMO5JAZW5HRA2IQ56LLTFU3PLKDIE2JNFFXEGASBYKK3Q@3\windows-jdk9-m3.5.x_build\target\invoker-reports\BUILD-MSITE-507.xml, f:\jenkins\jenkins-slave\workspace\ox_maven-site-plugin_master-LZWAKOPRMO5JAZW5HRA2IQ56LLTFU3PLKDIE2JNFFXEGASBYKK3Q@3\windows-jdk9-m3.5.x_build\target\invoker-reports\BUILD-MSITE-512.xml, f:\jenkins\jenkins-slave\workspace\ox_maven-site-plugin_master-LZWAKOPRMO5JAZW5HRA2IQ56LLTFU3PLKDIE2JNFFXEGASBYKK3Q@3\windows-jdk9-m3.5.x_build\target\invoker-reports\BUILD-MSITE-548.xml, f:\jenkins\jenkins-slave\workspace\ox_maven-site-plugin_master-LZWAKOPRMO5JAZW5HRA2IQ56LLTFU3PLKDIE2JNFFXEGASBYKK3Q@3\windows-jdk9-m3.5.x_build\target\invoker-reports\BUILD-MSITE-566.xml, f:\jenkins\jenkins-slave\workspace\ox_maven-site-plugin_master-LZWAKOPRMO5JAZW5HRA2IQ56LLTFU3PLKDIE2JNFFXEGASBYKK3Q@3\windows-jdk9-m3.5.x_build\target\invoker-reports\BUILD-MSITE-582.xml, f:\jenkins\jenkins-slave\workspace\ox_maven-site-plugin_master-LZWAKOPRMO5JAZW5HRA2IQ56LLTFU3PLKDIE2JNFFXEGASBYKK3Q@3\windows-jdk9-m3.5.x_build\target\invoker-reports\BUILD-MSITE-604.xml, f:\jenkins\jenkins-slave\workspace\ox_maven-site-plugin_master-LZWAKOPRMO5JAZW5HRA2IQ56LLTFU3PLKDIE2JNFFXEGASBYKK3Q@3\windows-jdk9-m3.5.x_build\target\invoker-reports\BUILD-MSITE-609.xml, f:\jenkins\jenkins-slave\workspace\ox_maven-site-plugin_master-LZWAKOPRMO5JAZW5HRA2IQ56LLTFU3PLKDIE2JNFFXEGASBYKK3Q@3\windows-jdk9-m3.5.x_build\target\invoker-reports\BUILD-MSITE-627.xml, f:\jenkins\jenkins-slave\workspace\ox_maven-site-plugin_master-LZWAKOPRMO5JAZW5HRA2IQ56LLTFU3PLKDIE2JNFFXEGASBYKK3Q@3\windows-jdk9-m3.5.x_build\target\invoker-reports\BUILD-MSITE-644.xml, f:\jenkins\jenkins-slave\workspace\ox_maven-site-plugin_master-LZWAKOPRMO5JAZW5HRA2IQ56LLTFU3PLKDIE2JNFFXEGASBYKK3Q@3\windows-jdk9-m3.5.x_build\target\invoker-reports\BUILD-MSITE-658.xml, f:\jenkins\jenkins-slave\workspace\ox_maven-site-plugin_master-LZWAKOPRMO5JAZW5HRA2IQ56LLTFU3PLKDIE2JNFFXEGASBYKK3Q@3\windows-jdk9-m3.5.x_build\target\invoker-reports\BUILD-MSITE-665.xml, f:\jenkins\jenkins-slave\workspace\ox_maven-site-plugin_master-LZWAKOPRMO5JAZW5HRA2IQ56LLTFU3PLKDIE2JNFFXEGASBYKK3Q@3\windows-jdk9-m3.5.x_build\target\invoker-reports\BUILD-MSITE-705-debug.xml, f:\jenkins\jenkins-slave\workspace\ox_maven-site-plugin_master-LZWAKOPRMO5JAZW5HRA2IQ56LLTFU3PLKDIE2JNFFXEGASBYKK3Q@3\windows-jdk9-m3.5.x_build\target\invoker-reports\BUILD-MSITE-705-no-debug.xml, f:\jenkins\jenkins-slave\workspace\ox_maven-site-plugin_master-LZWAKOPRMO5JAZW5HRA2IQ56LLTFU3PLKDIE2JNFFXEGASBYKK3Q@3\windows-jdk9-m3.5.x_build\target\invoker-reports\BUILD-MSITE-723.xml, f:\jenkins\jenkins-slave\workspace\ox_maven-site-plugin_master-LZWAKOPRMO5JAZW5HRA2IQ56LLTFU3PLKDIE2JNFFXEGASBYKK3Q@3\windows-jdk9-m3.5.x_build\target\invoker-reports\BUILD-default-reports-excluded.xml, f:\jenkins\jenkins-slave\workspace\ox_maven-site-plugin_master-LZWAKOPRMO5JAZW5HRA2IQ56LLTFU3PLKDIE2JNFFXEGASBYKK3Q@3\windows-jdk9-m3.5.x_build\target\invoker-reports\BUILD-default-reports.xml, f:\jenkins\jenkins-slave\workspace\ox_maven-site-plugin_master-LZWAKOPRMO5JAZW5HRA2IQ56LLTFU3PLKDIE2JNFFXEGASBYKK3Q@3\windows-jdk9-m3.5.x_build\target\invoker-reports\BUILD-doxia-formats.xml, f:\jenkins\jenkins-slave\workspace\ox_maven-site-plugin_master-LZWAKOPRMO5JAZW5HRA2IQ56LLTFU3PLKDIE2JNFFXEGASBYKK3Q@3\windows-jdk9-m3.5.x_build\target\invoker-reports\BUILD-effective-site.xml, f:\jenkins\jenkins-slave\workspace\ox_maven-site-plugin_master-LZWAKOPRMO5JAZW5HRA2IQ56LLTFU3PLKDIE2JNFFXEGASBYKK3Q@3\windows-jdk9-m3.5.x_build\target\invoker-reports\BUILD-emma-plugin-it.xml, f:\jenkins\jenkins-slave\workspace\ox_maven-site-plugin_master-LZWAKOPRMO5JAZW5HRA2IQ56LLTFU3PLKDIE2JNFFXEGASBYKK3Q@3\windows-jdk9-m3.5.x_build\target\invoker-reports\BUILD-empty-report-set.xml, f:\jenkins\jenkins-slave\workspace\ox_maven-site-plugin_master-LZWAKOPRMO5JAZW5HRA2IQ56LLTFU3PLKDIE2JNFFXEGASBYKK3Q@3\windows-jdk9-m3.5.x_build\target\invoker-reports\BUILD-failure.xml, f:\jenkins\jenkins-slave\workspace\ox_maven-site-plugin_master-LZWAKOPRMO5JAZW5HRA2IQ56LLTFU3PLKDIE2JNFFXEGASBYKK3Q@3\windows-jdk9-m3.5.x_build\target\invoker-reports\BUILD-full-reporting.xml, f:\jenkins\jenkins-slave\workspace\ox_maven-site-plugin_master-LZWAKOPRMO5JAZW5HRA2IQ56LLTFU3PLKDIE2JNFFXEGASBYKK3Q@3\windows-jdk9-m3.5.x_build\target\invoker-reports\BUILD-inheritance-interpolation.xml, f:\jenkins\jenkins-slave\workspace\ox_maven-site-plugin_master-LZWAKOPRMO5JAZW5HRA2IQ56LLTFU3PLKDIE2JNFFXEGASBYKK3Q@3\windows-jdk9-m3.5.x_build\target\invoker-reports\BUILD-inheritedMenus.xml, f:\jenkins\jenkins-slave\workspace\ox_maven-site-plugin_master-LZWAKOPRMO5JAZW5HRA2IQ56LLTFU3PLKDIE2JNFFXEGASBYKK3Q@3\windows-jdk9-m3.5.x_build\target\invoker-reports\BUILD-inheritedReports.xml, f:\jenkins\jenkins-slave\workspace\ox_maven-site-plugin_master-LZWAKOPRMO5JAZW5HRA2IQ56LLTFU3PLKDIE2JNFFXEGASBYKK3Q@3\windows-jdk9-m3.5.x_build\target\invoker-reports\BUILD-it-plugin-test.xml, f:\jenkins\jenkins-slave\workspace\ox_maven-site-plugin_master-LZWAKOPRMO5JAZW5HRA2IQ56LLTFU3PLKDIE2JNFFXEGASBYKK3Q@3\windows-jdk9-m3.5.x_build\target\invoker-reports\BUILD-new-configuration.xml, f:\jenkins\jenkins-slave\workspace\ox_maven-site-plugin_master-LZWAKOPRMO5JAZW5HRA2IQ56LLTFU3PLKDIE2JNFFXEGASBYKK3Q@3\windows-jdk9-m3.5.x_build\target\invoker-reports\BUILD-no-version.xml, f:\jenkins\jenkins-slave\workspace\ox_maven-site-plugin_master-LZWAKOPRMO5JAZW5HRA2IQ56LLTFU3PLKDIE2JNFFXEGASBYKK3Q@3\windows-jdk9-m3.5.x_build\target\invoker-reports\BUILD-report-changes-generation.xml, f:\jenkins\jenkins-slave\workspace\ox_maven-site-plugin_master-LZWAKOPRMO5JAZW5HRA2IQ56LLTFU3PLKDIE2JNFFXEGASBYKK3Q@3\windows-jdk9-m3.5.x_build\target\invoker-reports\BUILD-reportConfig.xml, f:\jenkins\jenkins-slave\workspace\ox_maven-site-plugin_master-LZWAKOPRMO5JAZW5HRA2IQ56LLTFU3PLKDIE2JNFFXEGASBYKK3Q@3\windows-jdk9-m3.5.x_build\target\invoker-reports\BUILD-resources.xml, f:\jenkins\jenkins-slave\workspace\ox_maven-site-plugin_master-LZWAKOPRMO5JAZW5HRA2IQ56LLTFU3PLKDIE2JNFFXEGASBYKK3Q@3\windows-jdk9-m3.5.x_build\target\invoker-reports\BUILD-site-attach-descriptor.xml, f:\jenkins\jenkins-slave\workspace\ox_maven-site-plugin_master-LZWAKOPRMO5JAZW5HRA2IQ56LLTFU3PLKDIE2JNFFXEGASBYKK3Q@3\windows-jdk9-m3.5.x_build\target\invoker-reports\BUILD-site-deploy.xml, f:\jenkins\jenkins-slave\workspace\ox_maven-site-plugin_master-LZWAKOPRMO5JAZW5HRA2IQ56LLTFU3PLKDIE2JNFFXEGASBYKK3Q@3\windows-jdk9-m3.5.x_build\target\invoker-reports\BUILD-site-inheritance.xml, f:\jenkins\jenkins-slave\workspace\ox_maven-site-plugin_master-LZWAKOPRMO5JAZW5HRA2IQ56LLTFU3PLKDIE2JNFFXEGASBYKK3Q@3\windows-jdk9-m3.5.x_build\target\invoker-reports\BUILD-site-jar.xml, f:\jenkins\jenkins-slave\workspace\ox_maven-site-plugin_master-LZWAKOPRMO5JAZW5HRA2IQ56LLTFU3PLKDIE2JNFFXEGASBYKK3Q@3\windows-jdk9-m3.5.x_build\target\invoker-reports\BUILD-site-sd-2.xml, f:\jenkins\jenkins-slave\workspace\ox_maven-site-plugin_master-LZWAKOPRMO5JAZW5HRA2IQ56LLTFU3PLKDIE2JNFFXEGASBYKK3Q@3\windows-jdk9-m3.5.x_build\target\invoker-reports\BUILD-site-sd-lang.xml, f:\jenkins\jenkins-slave\workspace\ox_maven-site-plugin_master-LZWAKOPRMO5JAZW5HRA2IQ56LLTFU3PLKDIE2JNFFXEGASBYKK3Q@3\windows-jdk9-m3.5.x_build\target\invoker-reports\BUILD-site-sd-stagingSiteURL.xml, f:\jenkins\jenkins-slave\workspace\ox_maven-site-plugin_master-LZWAKOPRMO5JAZW5HRA2IQ56LLTFU3PLKDIE2JNFFXEGASBYKK3Q@3\windows-jdk9-m3.5.x_build\target\invoker-reports\BUILD-site-sd-submodule.xml, f:\jenkins\jenkins-slave\workspace\ox_maven-site-plugin_master-LZWAKOPRMO5JAZW5HRA2IQ56LLTFU3PLKDIE2JNFFXEGASBYKK3Q@3\windows-jdk9-m3.5.x_build\target\invoker-reports\BUILD-site-sd-top-parent-different-site.xml, f:\jenkins\jenkins-slave\workspace\ox_maven-site-plugin_master-LZWAKOPRMO5JAZW5HRA2IQ56LLTFU3PLKDIE2JNFFXEGASBYKK3Q@3\windows-jdk9-m3.5.x_build\target\invoker-reports\BUILD-site-sd-top-parent-no-site.xml, f:\jenkins\jenkins-slave\workspace\ox_maven-site-plugin_master-LZWAKOPRMO5JAZW5HRA2IQ56LLTFU3PLKDIE2JNFFXEGASBYKK3Q@3\windows-jdk9-m3.5.x_build\target\invoker-reports\BUILD-site-sd-top-parent-same-site.xml, f:\jenkins\jenkins-slave\workspace\ox_maven-site-plugin_master-LZWAKOPRMO5JAZW5HRA2IQ56LLTFU3PLKDIE2JNFFXEGASBYKK3Q@3\windows-jdk9-m3.5.x_build\target\invoker-reports\BUILD-site-sd.xml, f:\jenkins\jenkins-slave\workspace\ox_maven-site-plugin_master-LZWAKOPRMO5JAZW5HRA2IQ56LLTFU3PLKDIE2JNFFXEGASBYKK3Q@3\windows-jdk9-m3.5.x_build\target\invoker-reports\BUILD-site-skip.xml, f:\jenkins\jenkins-slave\workspace\ox_maven-site-plugin_master-LZWAKOPRMO5JAZW5HRA2IQ56LLTFU3PLKDIE2JNFFXEGASBYKK3Q@3\windows-jdk9-m3.5.x_build\target\invoker-reports\BUILD-surefire-report.xml, f:\jenkins\jenkins-slave\workspace\ox_maven-site-plugin_master-LZWAKOPRMO5JAZW5HRA2IQ56LLTFU3PLKDIE2JNFFXEGASBYKK3Q@3\windows-jdk9-m3.5.x_build\target\invoker-reports\BUILD-template-skin.xml, f:\jenkins\jenkins-slave\workspace\ox_maven-site-plugin_master-LZWAKOPRMO5JAZW5HRA2IQ56LLTFU3PLKDIE2JNFFXEGASBYKK3Q@3\windows-jdk9-m3.5.x_build\target\invoker-reports\BUILD-validate.xml]
[windows-jdk9-m3.5.x_build] Found logs:[f:\jenkins\jenkins-slave\workspace\ox_maven-site-plugin_master-LZWAKOPRMO5JAZW5HRA2IQ56LLTFU3PLKDIE2JNFFXEGASBYKK3Q@3\windows-jdk9-m3.5.x_build\target\it\MSITE-159\build.log, f:\jenkins\jenkins-slave\workspace\ox_maven-site-plugin_master-LZWAKOPRMO5JAZW5HRA2IQ56LLTFU3PLKDIE2JNFFXEGASBYKK3Q@3\windows-jdk9-m3.5.x_build\target\it\MSITE-265\build.log, f:\jenkins\jenkins-slave\workspace\ox_maven-site-plugin_master-LZWAKOPRMO5JAZW5HRA2IQ56LLTFU3PLKDIE2JNFFXEGASBYKK3Q@3\windows-jdk9-m3.5.x_build\target\it\MSITE-354\build.log, f:\jenkins\jenkins-slave\workspace\ox_maven-site-plugin_master-LZWAKOPRMO5JAZW5HRA2IQ56LLTFU3PLKDIE2JNFFXEGASBYKK3Q@3\windows-jdk9-m3.5.x_build\target\it\MSITE-456\build.log, f:\jenkins\jenkins-slave\workspace\ox_maven-site-plugin_master-LZWAKOPRMO5JAZW5HRA2IQ56LLTFU3PLKDIE2JNFFXEGASBYKK3Q@3\windows-jdk9-m3.5.x_build\target\it\MSITE-458\build.log, f:\jenkins\jenkins-slave\workspace\ox_maven-site-plugin_master-LZWAKOPRMO5JAZW5HRA2IQ56LLTFU3PLKDIE2JNFFXEGASBYKK3Q@3\windows-jdk9-m3.5.x_build\target\it\MSITE-484\build.log, f:\jenkins\jenkins-slave\workspace\ox_maven-site-plugin_master-LZWAKOPRMO5JAZW5HRA2IQ56LLTFU3PLKDIE2JNFFXEGASBYKK3Q@3\windows-jdk9-m3.5.x_build\target\it\MSITE-497\build.log, f:\jenkins\jenkins-slave\workspace\ox_maven-site-plugin_master-LZWAKOPRMO5JAZW5HRA2IQ56LLTFU3PLKDIE2JNFFXEGASBYKK3Q@3\windows-jdk9-m3.5.x_build\target\it\MSITE-504\build.log, f:\jenkins\jenkins-slave\workspace\ox_maven-site-plugin_master-LZWAKOPRMO5JAZW5HRA2IQ56LLTFU3PLKDIE2JNFFXEGASBYKK3Q@3\windows-jdk9-m3.5.x_build\target\it\MSITE-506\build.log, f:\jenkins\jenkins-slave\workspace\ox_maven-site-plugin_master-LZWAKOPRMO5JAZW5HRA2IQ56LLTFU3PLKDIE2JNFFXEGASBYKK3Q@3\windows-jdk9-m3.5.x_build\target\it\MSITE-507\build.log, f:\jenkins\jenkins-slave\workspace\ox_maven-site-plugin_master-LZWAKOPRMO5JAZW5HRA2IQ56LLTFU3PLKDIE2JNFFXEGASBYKK3Q@3\windows-jdk9-m3.5.x_build\target\it\MSITE-512\build.log, f:\jenkins\jenkins-slave\workspace\ox_maven-site-plugin_master-LZWAKOPRMO5JAZW5HRA2IQ56LLTFU3PLKDIE2JNFFXEGASBYKK3Q@3\windows-jdk9-m3.5.x_build\target\it\MSITE-548\build.log, f:\jenkins\jenkins-slave\workspace\ox_maven-site-plugin_master-LZWAKOPRMO5JAZW5HRA2IQ56LLTFU3PLKDIE2JNFFXEGASBYKK3Q@3\windows-jdk9-m3.5.x_build\target\it\MSITE-566\build.log, f:\jenkins\jenkins-slave\workspace\ox_maven-site-plugin_master-LZWAKOPRMO5JAZW5HRA2IQ56LLTFU3PLKDIE2JNFFXEGASBYKK3Q@3\windows-jdk9-m3.5.x_build\target\it\MSITE-582\build.log, f:\jenkins\jenkins-slave\workspace\ox_maven-site-plugin_master-LZWAKOPRMO5JAZW5HRA2IQ56LLTFU3PLKDIE2JNFFXEGASBYKK3Q@3\windows-jdk9-m3.5.x_build\target\it\MSITE-604\build.log, f:\jenkins\jenkins-slave\workspace\ox_maven-site-plugin_master-LZWAKOPRMO5JAZW5HRA2IQ56LLTFU3PLKDIE2JNFFXEGASBYKK3Q@3\windows-jdk9-m3.5.x_build\target\it\MSITE-609\build.log, f:\jenkins\jenkins-slave\workspace\ox_maven-site-plugin_master-LZWAKOPRMO5JAZW5HRA2IQ56LLTFU3PLKDIE2JNFFXEGASBYKK3Q@3\windows-jdk9-m3.5.x_build\target\it\MSITE-627\build.log, f:\jenkins\jenkins-slave\workspace\ox_maven-site-plugin_master-LZWAKOPRMO5JAZW5HRA2IQ56LLTFU3PLKDIE2JNFFXEGASBYKK3Q@3\windows-jdk9-m3.5.x_build\target\it\MSITE-644\build.log, f:\jenkins\jenkins-slave\workspace\ox_maven-site-plugin_master-LZWAKOPRMO5JAZW5HRA2IQ56LLTFU3PLKDIE2JNFFXEGASBYKK3Q@3\windows-jdk9-m3.5.x_build\target\it\MSITE-658\build.log, f:\jenkins\jenkins-slave\workspace\ox_maven-site-plugin_master-LZWAKOPRMO5JAZW5HRA2IQ56LLTFU3PLKDIE2JNFFXEGASBYKK3Q@3\windows-jdk9-m3.5.x_build\target\it\MSITE-665\build.log, f:\jenkins\jenkins-slave\workspace\ox_maven-site-plugin_master-LZWAKOPRMO5JAZW5HRA2IQ56LLTFU3PLKDIE2JNFFXEGASBYKK3Q@3\windows-jdk9-m3.5.x_build\target\it\MSITE-705-debug\build.log, f:\jenkins\jenkins-slave\workspace\ox_maven-site-plugin_master-LZWAKOPRMO5JAZW5HRA2IQ56LLTFU3PLKDIE2JNFFXEGASBYKK3Q@3\windows-jdk9-m3.5.x_build\target\it\MSITE-705-no-debug\build.log, f:\jenkins\jenkins-slave\workspace\ox_maven-site-plugin_master-LZWAKOPRMO5JAZW5HRA2IQ56LLTFU3PLKDIE2JNFFXEGASBYKK3Q@3\windows-jdk9-m3.5.x_build\target\it\MSITE-723\build.log, f:\jenkins\jenkins-slave\workspace\ox_maven-site-plugin_master-LZWAKOPRMO5JAZW5HRA2IQ56LLTFU3PLKDIE2JNFFXEGASBYKK3Q@3\windows-jdk9-m3.5.x_build\target\it\default-reports-excluded\build.log, f:\jenkins\jenkins-slave\workspace\ox_maven-site-plugin_master-LZWAKOPRMO5JAZW5HRA2IQ56LLTFU3PLKDIE2JNFFXEGASBYKK3Q@3\windows-jdk9-m3.5.x_build\target\it\default-reports\build.log, f:\jenkins\jenkins-slave\workspace\ox_maven-site-plugin_master-LZWAKOPRMO5JAZW5HRA2IQ56LLTFU3PLKDIE2JNFFXEGASBYKK3Q@3\windows-jdk9-m3.5.x_build\target\it\doxia-formats\build.log, f:\jenkins\jenkins-slave\workspace\ox_maven-site-plugin_master-LZWAKOPRMO5JAZW5HRA2IQ56LLTFU3PLKDIE2JNFFXEGASBYKK3Q@3\windows-jdk9-m3.5.x_build\target\it\effective-site\build.log, f:\jenkins\jenkins-slave\workspace\ox_maven-site-plugin_master-LZWAKOPRMO5JAZW5HRA2IQ56LLTFU3PLKDIE2JNFFXEGASBYKK3Q@3\windows-jdk9-m3.5.x_build\target\it\emma-plugin-it\build.log, f:\jenkins\jenkins-slave\workspace\ox_maven-site-plugin_master-LZWAKOPRMO5JAZW5HRA2IQ56LLTFU3PLKDIE2JNFFXEGASBYKK3Q@3\windows-jdk9-m3.5.x_build\target\it\empty-report-set\build.log, f:\jenkins\jenkins-slave\workspace\ox_maven-site-plugin_master-LZWAKOPRMO5JAZW5HRA2IQ56LLTFU3PLKDIE2JNFFXEGASBYKK3Q@3\windows-jdk9-m3.5.x_build\target\it\failure\build.log, f:\jenkins\jenkins-slave\workspace\ox_maven-site-plugin_master-LZWAKOPRMO5JAZW5HRA2IQ56LLTFU3PLKDIE2JNFFXEGASBYKK3Q@3\windows-jdk9-m3.5.x_build\target\it\full-reporting\build.log, f:\jenkins\jenkins-slave\workspace\ox_maven-site-plugin_master-LZWAKOPRMO5JAZW5HRA2IQ56LLTFU3PLKDIE2JNFFXEGASBYKK3Q@3\windows-jdk9-m3.5.x_build\target\it\inheritance-interpolation\build.log, f:\jenkins\jenkins-slave\workspace\ox_maven-site-plugin_master-LZWAKOPRMO5JAZW5HRA2IQ56LLTFU3PLKDIE2JNFFXEGASBYKK3Q@3\windows-jdk9-m3.5.x_build\target\it\inheritedMenus\build.log, f:\jenkins\jenkins-slave\workspace\ox_maven-site-plugin_master-LZWAKOPRMO5JAZW5HRA2IQ56LLTFU3PLKDIE2JNFFXEGASBYKK3Q@3\windows-jdk9-m3.5.x_build\target\it\inheritedReports\build.log, f:\jenkins\jenkins-slave\workspace\ox_maven-site-plugin_master-LZWAKOPRMO5JAZW5HRA2IQ56LLTFU3PLKDIE2JNFFXEGASBYKK3Q@3\windows-jdk9-m3.5.x_build\target\it\it-plugin-test\build.log, f:\jenkins\jenkins-slave\workspace\ox_maven-site-plugin_master-LZWAKOPRMO5JAZW5HRA2IQ56LLTFU3PLKDIE2JNFFXEGASBYKK3Q@3\windows-jdk9-m3.5.x_build\target\it\new-configuration\build.log, f:\jenkins\jenkins-slave\workspace\ox_maven-site-plugin_master-LZWAKOPRMO5JAZW5HRA2IQ56LLTFU3PLKDIE2JNFFXEGASBYKK3Q@3\windows-jdk9-m3.5.x_build\target\it\no-version\build.log, f:\jenkins\jenkins-slave\workspace\ox_maven-site-plugin_master-LZWAKOPRMO5JAZW5HRA2IQ56LLTFU3PLKDIE2JNFFXEGASBYKK3Q@3\windows-jdk9-m3.5.x_build\target\it\report-changes-generation\build.log, f:\jenkins\jenkins-slave\workspace\ox_maven-site-plugin_master-LZWAKOPRMO5JAZW5HRA2IQ56LLTFU3PLKDIE2JNFFXEGASBYKK3Q@3\windows-jdk9-m3.5.x_build\target\it\reportConfig\build.log, f:\jenkins\jenkins-slave\workspace\ox_maven-site-plugin_master-LZWAKOPRMO5JAZW5HRA2IQ56LLTFU3PLKDIE2JNFFXEGASBYKK3Q@3\windows-jdk9-m3.5.x_build\target\it\resources\build.log, f:\jenkins\jenkins-slave\workspace\ox_maven-site-plugin_master-LZWAKOPRMO5JAZW5HRA2IQ56LLTFU3PLKDIE2JNFFXEGASBYKK3Q@3\windows-jdk9-m3.5.x_build\target\it\site-attach-descriptor\build.log, f:\jenkins\jenkins-slave\workspace\ox_maven-site-plugin_master-LZWAKOPRMO5JAZW5HRA2IQ56LLTFU3PLKDIE2JNFFXEGASBYKK3Q@3\windows-jdk9-m3.5.x_build\target\it\site-deploy\build.log, f:\jenkins\jenkins-slave\workspace\ox_maven-site-plugin_master-LZWAKOPRMO5JAZW5HRA2IQ56LLTFU3PLKDIE2JNFFXEGASBYKK3Q@3\windows-jdk9-m3.5.x_build\target\it\site-inheritance\build.log, f:\jenkins\jenkins-slave\workspace\ox_maven-site-plugin_master-LZWAKOPRMO5JAZW5HRA2IQ56LLTFU3PLKDIE2JNFFXEGASBYKK3Q@3\windows-jdk9-m3.5.x_build\target\it\site-jar\build.log, f:\jenkins\jenkins-slave\workspace\ox_maven-site-plugin_master-LZWAKOPRMO5JAZW5HRA2IQ56LLTFU3PLKDIE2JNFFXEGASBYKK3Q@3\windows-jdk9-m3.5.x_build\target\it\site-sd-2\build.log, f:\jenkins\jenkins-slave\workspace\ox_maven-site-plugin_master-LZWAKOPRMO5JAZW5HRA2IQ56LLTFU3PLKDIE2JNFFXEGASBYKK3Q@3\windows-jdk9-m3.5.x_build\target\it\site-sd-lang\build.log, f:\jenkins\jenkins-slave\workspace\ox_maven-site-plugin_master-LZWAKOPRMO5JAZW5HRA2IQ56LLTFU3PLKDIE2JNFFXEGASBYKK3Q@3\windows-jdk9-m3.5.x_build\target\it\site-sd-stagingSiteURL\build.log, f:\jenkins\jenkins-slave\workspace\ox_maven-site-plugin_master-LZWAKOPRMO5JAZW5HRA2IQ56LLTFU3PLKDIE2JNFFXEGASBYKK3Q@3\windows-jdk9-m3.5.x_build\target\it\site-sd-submodule\build.log, f:\jenkins\jenkins-slave\workspace\ox_maven-site-plugin_master-LZWAKOPRMO5JAZW5HRA2IQ56LLTFU3PLKDIE2JNFFXEGASBYKK3Q@3\windows-jdk9-m3.5.x_build\target\it\site-sd-top-parent-different-site\build.log, f:\jenkins\jenkins-slave\workspace\ox_maven-site-plugin_master-LZWAKOPRMO5JAZW5HRA2IQ56LLTFU3PLKDIE2JNFFXEGASBYKK3Q@3\windows-jdk9-m3.5.x_build\target\it\site-sd-top-parent-no-site\build.log, f:\jenkins\jenkins-slave\workspace\ox_maven-site-plugin_master-LZWAKOPRMO5JAZW5HRA2IQ56LLTFU3PLKDIE2JNFFXEGASBYKK3Q@3\windows-jdk9-m3.5.x_build\target\it\site-sd-top-parent-same-site\build.log, f:\jenkins\jenkins-slave\workspace\ox_maven-site-plugin_master-LZWAKOPRMO5JAZW5HRA2IQ56LLTFU3PLKDIE2JNFFXEGASBYKK3Q@3\windows-jdk9-m3.5.x_build\target\it\site-sd\build.log, f:\jenkins\jenkins-slave\workspace\ox_maven-site-plugin_master-LZWAKOPRMO5JAZW5HRA2IQ56LLTFU3PLKDIE2JNFFXEGASBYKK3Q@3\windows-jdk9-m3.5.x_build\target\it\site-skip\build.log, f:\jenkins\jenkins-slave\workspace\ox_maven-site-plugin_master-LZWAKOPRMO5JAZW5HRA2IQ56LLTFU3PLKDIE2JNFFXEGASBYKK3Q@3\windows-jdk9-m3.5.x_build\target\it\surefire-report\build.log, f:\jenkins\jenkins-slave\workspace\ox_maven-site-plugin_master-LZWAKOPRMO5JAZW5HRA2IQ56LLTFU3PLKDIE2JNFFXEGASBYKK3Q@3\windows-jdk9-m3.5.x_build\target\it\template-skin\build.log, f:\jenkins\jenkins-slave\workspace\ox_maven-site-plugin_master-LZWAKOPRMO5JAZW5HRA2IQ56LLTFU3PLKDIE2JNFFXEGASBYKK3Q@3\windows-jdk9-m3.5.x_build\target\it\validate\build.log]
[windows-jdk9-m3.5.x_build] Finished parsing Maven Invoker results (found 56)
[windows-jdk9-m3.5.x_build] [withMaven] junitPublisher - Archive test results for Maven artifact org.apache.maven.plugins:maven-site-plugin:3.8-SNAPSHOT generated by maven-surefire-plugin:test (default-test): windows-jdk9-m3.5.x_build\target\surefire-reports\*.xml
[windows-jdk9-m3.5.x_build] Recording test results
[windows-jdk9-m3.5.x_build] [withMaven] openTasksPublisher - Scan Tasks for Maven artifact org.apache.maven.plugins:maven-site-plugin:3.8-SNAPSHOT in source directory windows-jdk9-m3.5.x_build\src\main\java
[windows-jdk9-m3.5.x_build] [TASKS] Scanning folder 'f:\jenkins\jenkins-slave\workspace\ox_maven-site-plugin_master-LZWAKOPRMO5JAZW5HRA2IQ56LLTFU3PLKDIE2JNFFXEGASBYKK3Q@3' for files matching the pattern 'windows-jdk9-m3.5.x_build\src\main\java\**\*' - excludes: null
[windows-jdk9-m3.5.x_build] [TASKS] Found 21 files to scan for tasks
[windows-jdk9-m3.5.x_build] [TASKS] Found 8 open tasks.
[windows-jdk9-m3.5.x_build] Skipping warnings blame since pipelines do not have an SCM link.%n
[windows-jdk9-m3.5.x_build] [TASKS] Computing warning deltas based on reference build #27
[Pipeline] [windows-jdk8-m3.3.x_build] // withMaven
[Pipeline] [windows-jdk9-m3.5.x_build] // withMaven
[Pipeline] [windows-jdk8-m3.2.x_build] cleanWs
[Pipeline] [windows-jdk8-m3.3.x_build] cleanWs
[Pipeline] [windows-jdk9-m3.5.x_build] cleanWs
[windows-jdk8-m3.2.x_build] [WS-CLEANUP] Deleting project workspace...[WS-CLEANUP] done
[windows-jdk8-m3.3.x_build] [WS-CLEANUP] Deleting project workspace...[WS-CLEANUP] done
[windows-jdk9-m3.5.x_build] [WS-CLEANUP] Deleting project workspace...[WS-CLEANUP] done
[Pipeline] [windows-jdk8-m3.2.x_build] }
[Pipeline] [windows-jdk8-m3.2.x_build] // stage
[Pipeline] [windows-jdk8-m3.2.x_build] }
[Pipeline] [windows-jdk8-m3.3.x_build] cleanWs
[Pipeline] [windows-jdk9-m3.5.x_build] cleanWs
[Pipeline] [windows-jdk8-m3.2.x_build] // ws
[windows-jdk8-m3.3.x_build] [WS-CLEANUP] Deleting project workspace...[WS-CLEANUP] done
[windows-jdk9-m3.5.x_build] [WS-CLEANUP] Deleting project workspace...[WS-CLEANUP] done
[Pipeline] [windows-jdk8-m3.2.x_build] }
[Pipeline] [windows-jdk8-m3.2.x_build] // node
[Pipeline] [windows-jdk8-m3.2.x_build] }
[windows-jdk8-m3.2.x_build] Failed in branch windows-jdk8-m3.2.x_build
[Pipeline] [windows-jdk8-m3.3.x_build] }
[Pipeline] [windows-jdk9-m3.5.x_build] }
[Pipeline] [windows-jdk8-m3.3.x_build] // stage
[Pipeline] [windows-jdk9-m3.5.x_build] // stage
[Pipeline] [windows-jdk8-m3.3.x_build] }
[Pipeline] [windows-jdk9-m3.5.x_build] }
[Pipeline] [windows-jdk8-m3.3.x_build] // ws
[Pipeline] [windows-jdk9-m3.5.x_build] // ws
[Pipeline] [windows-jdk8-m3.3.x_build] }
[Pipeline] [windows-jdk9-m3.5.x_build] }
[Pipeline] [windows-jdk8-m3.3.x_build] // node
[Pipeline] [windows-jdk9-m3.5.x_build] // node
[Pipeline] [windows-jdk8-m3.3.x_build] }
[windows-jdk8-m3.3.x_build] Failed in branch windows-jdk8-m3.3.x_build
[Pipeline] [windows-jdk9-m3.5.x_build] }
[windows-jdk9-m3.5.x_build] Failed in branch windows-jdk9-m3.5.x_build
[Pipeline] // parallel
[Pipeline] stage
[Pipeline] { (Notifications)
[Pipeline] echo
Build result: FAILURE
[Pipeline] jiraIssueSelector
Mime
  • Unnamed multipart/mixed (inline, None, 0 bytes)
View raw message