maven-notifications mailing list archives

Site index · List index
Message view « Date » · « Thread »
Top « Date » · « Thread »
From Apache Jenkins Server <jenk...@builds.apache.org>
Subject Build unstable in Jenkins: Maven TLP » maven-plugin-testing » MPLUGINTESTING-58 #15
Date Fri, 02 Nov 2018 15:36:26 GMT
See https://builds.apache.org/job/maven-box/job/maven-plugin-testing/job/MPLUGINTESTING-58/15/

No changes.

4 tests failed.
FAILED:  org.apache.maven.shared.test.plugin.ProjectToolTest.testPackageProjectArtifact_ShouldPopulateWithCorrectArtifactAndMetadata

Error Message:
Missing target/unit/projects/basic/target/it-build-target/maven-it-plugin-test.jar

Stack Trace:
junit.framework.AssertionFailedError: Missing target/unit/projects/basic/target/it-build-target/maven-it-plugin-test.jar
	at junit.framework.Assert.fail(Assert.java:57)
	at junit.framework.Assert.assertTrue(Assert.java:22)
	at junit.framework.TestCase.assertTrue(TestCase.java:192)
	at org.apache.maven.shared.test.plugin.ProjectToolTest.testPackageProjectArtifact_ShouldPopulateWithCorrectArtifactAndMetadata(ProjectToolTest.java:99)


FAILED:  org.apache.maven.shared.test.plugin.ProjectToolTest.testPackageProjectArtifact_ShouldPopulateWithCorrectArtifactAndMetadata

Error Message:
Missing target/unit/projects/basic/target/it-build-target/maven-it-plugin-test.jar

Stack Trace:
junit.framework.AssertionFailedError: Missing target/unit/projects/basic/target/it-build-target/maven-it-plugin-test.jar
	at junit.framework.Assert.fail(Assert.java:57)
	at junit.framework.Assert.assertTrue(Assert.java:22)
	at junit.framework.TestCase.assertTrue(TestCase.java:192)
	at org.apache.maven.shared.test.plugin.ProjectToolTest.testPackageProjectArtifact_ShouldPopulateWithCorrectArtifactAndMetadata(ProjectToolTest.java:99)


FAILED:  org.apache.maven.shared.test.plugin.ProjectToolTest.testPackageProjectArtifact_ShouldPopulateWithCorrectArtifactAndMetadata

Error Message:
Missing target\unit\projects\basic\target\it-build-target\maven-it-plugin-test.jar

Stack Trace:
junit.framework.AssertionFailedError: Missing target\unit\projects\basic\target\it-build-target\maven-it-plugin-test.jar
	at junit.framework.Assert.fail(Assert.java:57)
	at junit.framework.Assert.assertTrue(Assert.java:22)
	at junit.framework.TestCase.assertTrue(TestCase.java:192)
	at org.apache.maven.shared.test.plugin.ProjectToolTest.testPackageProjectArtifact_ShouldPopulateWithCorrectArtifactAndMetadata(ProjectToolTest.java:99)


FAILED:  org.apache.maven.shared.test.plugin.ProjectToolTest.testPackageProjectArtifact_ShouldPopulateWithCorrectArtifactAndMetadata

Error Message:
Missing target\unit\projects\basic\target\it-build-target\maven-it-plugin-test.jar

Stack Trace:
junit.framework.AssertionFailedError: Missing target\unit\projects\basic\target\it-build-target\maven-it-plugin-test.jar
	at junit.framework.Assert.fail(Assert.java:57)
	at junit.framework.Assert.assertTrue(Assert.java:22)
	at junit.framework.TestCase.assertTrue(TestCase.java:192)
	at org.apache.maven.shared.test.plugin.ProjectToolTest.testPackageProjectArtifact_ShouldPopulateWithCorrectArtifactAndMetadata(ProjectToolTest.java:99)




Build log:
[...truncated 1.96 MB...]
[windows-jdk9] [INFO] Downloading from central: https://repo.maven.apache.org/maven2/org/apache/maven/maven-archiver/2.5/maven-archiver-2.5.jar
[windows-jdk9] [INFO] Downloading from central: https://repo.maven.apache.org/maven2/org/codehaus/plexus/plexus-io/2.0.2/plexus-io-2.0.2.jar
[windows-jdk9] [INFO] Downloading from central: https://repo.maven.apache.org/maven2/org/codehaus/plexus/plexus-archiver/2.1/plexus-archiver-2.1.jar
[windows-jdk9] [INFO] Downloading from central: https://repo.maven.apache.org/maven2/commons-lang/commons-lang/2.1/commons-lang-2.1.jar
[windows-jdk9] [INFO] Downloading from central: https://repo.maven.apache.org/maven2/org/codehaus/plexus/plexus-interpolation/1.15/plexus-interpolation-1.15.jar
[windows-jdk9] [INFO] Downloaded from central: https://repo.maven.apache.org/maven2/commons-lang/commons-lang/2.1/commons-lang-2.1.jar
(208 kB at 6.5 MB/s)
[windows-jdk9] [INFO] Downloaded from central: https://repo.maven.apache.org/maven2/org/codehaus/plexus/plexus-io/2.0.2/plexus-io-2.0.2.jar
(58 kB at 1.2 MB/s)
[windows-jdk9] [INFO] Downloaded from central: https://repo.maven.apache.org/maven2/org/codehaus/plexus/plexus-interpolation/1.15/plexus-interpolation-1.15.jar
(60 kB at 1.1 MB/s)
[windows-jdk9] [INFO] Downloaded from central: https://repo.maven.apache.org/maven2/org/codehaus/plexus/plexus-archiver/2.1/plexus-archiver-2.1.jar
(184 kB at 1.5 MB/s)
[windows-jdk9] [INFO] Downloaded from central: https://repo.maven.apache.org/maven2/org/apache/maven/maven-archiver/2.5/maven-archiver-2.5.jar
(22 kB at 154 kB/s)
[windows-jdk9] [INFO] Building jar: F:\jenkins\jenkins-slave\workspace\n-testing_MPLUGINTESTING-58-UONNAARVYXAHZ4RVLUBM5ODIM6A4TFB5CEC4ELRKMGU3KDYXAPIQ\m\maven-plugin-testing-harness\target\maven-plugin-testing-harness-3.3.1-SNAPSHOT.jar
[windows-jdk9] [INFO] 
[windows-jdk9] [INFO] >>> maven-source-plugin:2.2.1:jar (default) > generate-sources
@ maven-plugin-testing-harness >>>
[windows-jdk9] [INFO] 
[windows-jdk9] [INFO] --- maven-enforcer-plugin:1.3.1:enforce (enforce-bytecode-version) @
maven-plugin-testing-harness ---
[windows-jdk9] [INFO] 
[windows-jdk9] [INFO] --- maven-enforcer-plugin:1.3.1:enforce (ban-known-bad-maven-versions)
@ maven-plugin-testing-harness ---
[windows-jdk9] [INFO] 
[windows-jdk9] [INFO] <<< maven-source-plugin:2.2.1:jar (default) < generate-sources
@ maven-plugin-testing-harness <<<
[windows-jdk9] [INFO] 
[windows-jdk9] [INFO] 
[windows-jdk9] [INFO] --- maven-source-plugin:2.2.1:jar (default) @ maven-plugin-testing-harness
---
[windows-jdk9] [INFO] Downloading from central: https://repo.maven.apache.org/maven2/org/codehaus/plexus/plexus-utils/3.0.7/plexus-utils-3.0.7.pom
[windows-jdk9] [INFO] Downloaded from central: https://repo.maven.apache.org/maven2/org/codehaus/plexus/plexus-utils/3.0.7/plexus-utils-3.0.7.pom
(2.5 kB at 31 kB/s)
[windows-jdk9] [INFO] Downloading from central: https://repo.maven.apache.org/maven2/org/codehaus/plexus/plexus-utils/3.0.8/plexus-utils-3.0.8.jar
[windows-jdk9] [INFO] Downloaded from central: https://repo.maven.apache.org/maven2/org/codehaus/plexus/plexus-utils/3.0.8/plexus-utils-3.0.8.jar
(232 kB at 4.0 MB/s)
[windows-jdk9] [INFO] Building jar: F:\jenkins\jenkins-slave\workspace\n-testing_MPLUGINTESTING-58-UONNAARVYXAHZ4RVLUBM5ODIM6A4TFB5CEC4ELRKMGU3KDYXAPIQ\m\maven-plugin-testing-harness\target\maven-plugin-testing-harness-3.3.1-SNAPSHOT-sources.jar
[windows-jdk9] [INFO] 
[windows-jdk9] [INFO] ------------------------------------------------------------------------
[windows-jdk9] [INFO] Building Maven Testing Tools 3.3.1-SNAPSHOT
[windows-jdk9] [INFO] ------------------------------------------------------------------------
[windows-jdk9] [INFO] Downloading from central: https://repo.maven.apache.org/maven2/org/easymock/easymock/3.2/easymock-3.2.pom
[windows-jdk9] [INFO] Downloaded from central: https://repo.maven.apache.org/maven2/org/easymock/easymock/3.2/easymock-3.2.pom
(4.8 kB at 201 kB/s)
[windows-jdk9] [INFO] Downloading from central: https://repo.maven.apache.org/maven2/org/easymock/easymock-parent/3.2/easymock-parent-3.2.pom
[windows-jdk9] [INFO] Downloaded from central: https://repo.maven.apache.org/maven2/org/easymock/easymock-parent/3.2/easymock-parent-3.2.pom
(16 kB at 607 kB/s)
[windows-jdk9] [INFO] Downloading from central: https://repo.maven.apache.org/maven2/cglib/cglib-nodep/2.2.2/cglib-nodep-2.2.2.pom
[windows-jdk9] [INFO] Downloaded from central: https://repo.maven.apache.org/maven2/cglib/cglib-nodep/2.2.2/cglib-nodep-2.2.2.pom
(1.2 kB at 48 kB/s)
[windows-jdk9] [INFO] Downloading from central: https://repo.maven.apache.org/maven2/org/objenesis/objenesis/1.3/objenesis-1.3.pom
[windows-jdk9] [INFO] Downloaded from central: https://repo.maven.apache.org/maven2/org/objenesis/objenesis/1.3/objenesis-1.3.pom
(2.5 kB at 110 kB/s)
[windows-jdk9] [INFO] Downloading from central: https://repo.maven.apache.org/maven2/org/objenesis/objenesis-parent/1.3/objenesis-parent-1.3.pom
[windows-jdk9] [INFO] Downloaded from central: https://repo.maven.apache.org/maven2/org/objenesis/objenesis-parent/1.3/objenesis-parent-1.3.pom
(14 kB at 652 kB/s)
[windows-jdk9] [INFO] Downloading from central: https://repo.maven.apache.org/maven2/org/easymock/easymock/3.2/easymock-3.2.jar
[windows-jdk9] [INFO] Downloading from central: https://repo.maven.apache.org/maven2/org/objenesis/objenesis/1.3/objenesis-1.3.jar
[windows-jdk9] [INFO] Downloading from central: https://repo.maven.apache.org/maven2/cglib/cglib-nodep/2.2.2/cglib-nodep-2.2.2.jar
[windows-jdk9] [INFO] Downloaded from central: https://repo.maven.apache.org/maven2/org/easymock/easymock/3.2/easymock-3.2.jar
(120 kB at 1.2 MB/s)
[windows-jdk9] [INFO] Downloaded from central: https://repo.maven.apache.org/maven2/cglib/cglib-nodep/2.2.2/cglib-nodep-2.2.2.jar
(327 kB at 3.1 MB/s)
[windows-jdk9] [INFO] Downloaded from central: https://repo.maven.apache.org/maven2/org/objenesis/objenesis/1.3/objenesis-1.3.jar
(41 kB at 141 kB/s)
[windows-jdk9] [INFO] 
[windows-jdk9] [INFO] --- maven-clean-plugin:2.5:clean (default-clean) @ maven-test-tools
---
[windows-jdk9] [INFO] 
[windows-jdk9] [INFO] --- maven-enforcer-plugin:1.3.1:enforce (enforce-bytecode-version) @
maven-test-tools ---
[windows-jdk9] [INFO] 
[windows-jdk9] [INFO] --- maven-enforcer-plugin:1.3.1:enforce (ban-known-bad-maven-versions)
@ maven-test-tools ---
[windows-jdk9] [INFO] 
[windows-jdk9] [INFO] --- maven-remote-resources-plugin:1.5:process (default) @ maven-test-tools
---
[windows-jdk9] [INFO] 
[windows-jdk9] [INFO] --- maven-resources-plugin:2.6:resources (default-resources) @ maven-test-tools
---
[windows-jdk9] [INFO] Using 'UTF-8' encoding to copy filtered resources.
[windows-jdk9] [INFO] skip non existing resourceDirectory F:\jenkins\jenkins-slave\workspace\n-testing_MPLUGINTESTING-58-UONNAARVYXAHZ4RVLUBM5ODIM6A4TFB5CEC4ELRKMGU3KDYXAPIQ\m\maven-test-tools\src\main\resources
[windows-jdk9] [INFO] Copying 3 resources
[windows-jdk9] [INFO] 
[windows-jdk9] [INFO] --- maven-compiler-plugin:3.1:compile (default-compile) @ maven-test-tools
---
[windows-jdk9] [INFO] Changes detected - recompiling the module!
[windows-jdk9] [INFO] Compiling 4 source files to F:\jenkins\jenkins-slave\workspace\n-testing_MPLUGINTESTING-58-UONNAARVYXAHZ4RVLUBM5ODIM6A4TFB5CEC4ELRKMGU3KDYXAPIQ\m\maven-test-tools\target\classes
[windows-jdk9] [WARNING] /F:/jenkins/jenkins-slave/workspace/n-testing_MPLUGINTESTING-58-UONNAARVYXAHZ4RVLUBM5ODIM6A4TFB5CEC4ELRKMGU3KDYXAPIQ/m/maven-test-tools/src/main/java/org/apache/maven/shared/tools/easymock/TestFileManager.java:
Some input files use or override a deprecated API.
[windows-jdk9] [WARNING] /F:/jenkins/jenkins-slave/workspace/n-testing_MPLUGINTESTING-58-UONNAARVYXAHZ4RVLUBM5ODIM6A4TFB5CEC4ELRKMGU3KDYXAPIQ/m/maven-test-tools/src/main/java/org/apache/maven/shared/tools/easymock/TestFileManager.java:
Recompile with -Xlint:deprecation for details.
[windows-jdk9] [INFO] 
[windows-jdk9] [INFO] --- maven-resources-plugin:2.6:testResources (default-testResources)
@ maven-test-tools ---
[windows-jdk9] [INFO] Using 'UTF-8' encoding to copy filtered resources.
[windows-jdk9] [INFO] skip non existing resourceDirectory F:\jenkins\jenkins-slave\workspace\n-testing_MPLUGINTESTING-58-UONNAARVYXAHZ4RVLUBM5ODIM6A4TFB5CEC4ELRKMGU3KDYXAPIQ\m\maven-test-tools\src\test\resources
[windows-jdk9] [INFO] Copying 3 resources
[windows-jdk9] [INFO] 
[windows-jdk9] [INFO] --- maven-compiler-plugin:3.1:testCompile (default-testCompile) @ maven-test-tools
---
[windows-jdk9] [INFO] No sources to compile
[windows-jdk9] [INFO] 
[windows-jdk9] [INFO] --- maven-surefire-plugin:2.16:test (default-test) @ maven-test-tools
---
[windows-jdk9] [INFO] 
[windows-jdk9] [INFO] --- maven-jar-plugin:2.4:jar (default-jar) @ maven-test-tools ---
[windows-jdk9] [INFO] Building jar: F:\jenkins\jenkins-slave\workspace\n-testing_MPLUGINTESTING-58-UONNAARVYXAHZ4RVLUBM5ODIM6A4TFB5CEC4ELRKMGU3KDYXAPIQ\m\maven-test-tools\target\maven-test-tools-3.3.1-SNAPSHOT.jar
[windows-jdk9] [INFO] 
[windows-jdk9] [INFO] ------------------------------------------------------------------------
[windows-jdk9] [INFO] Building Maven Plugin Testing Tools 3.3.1-SNAPSHOT
[windows-jdk9] [INFO] ------------------------------------------------------------------------
[windows-jdk9] [INFO] Downloading from central: https://repo.maven.apache.org/maven2/org/codehaus/plexus/plexus-component-metadata/1.5.5/plexus-component-metadata-1.5.5.pom
[windows-jdk9] [INFO] Downloaded from central: https://repo.maven.apache.org/maven2/org/codehaus/plexus/plexus-component-metadata/1.5.5/plexus-component-metadata-1.5.5.pom
(3.9 kB at 203 kB/s)
[windows-jdk9] [INFO] Downloading from central: https://repo.maven.apache.org/maven2/org/codehaus/plexus/plexus-component-metadata/1.5.5/plexus-component-metadata-1.5.5.jar
[windows-jdk9] [INFO] Downloaded from central: https://repo.maven.apache.org/maven2/org/codehaus/plexus/plexus-component-metadata/1.5.5/plexus-component-metadata-1.5.5.jar
(110 kB at 2.5 MB/s)
[windows-jdk9] [INFO] Downloading from central: https://repo.maven.apache.org/maven2/org/apache/maven/shared/maven-invoker/2.2/maven-invoker-2.2.pom
[windows-jdk9] [INFO] Downloaded from central: https://repo.maven.apache.org/maven2/org/apache/maven/shared/maven-invoker/2.2/maven-invoker-2.2.pom
(5.9 kB at 163 kB/s)
[windows-jdk9] [INFO] Downloading from central: https://repo.maven.apache.org/maven2/org/apache/maven/shared/maven-shared-components/21/maven-shared-components-21.pom
[windows-jdk9] [INFO] Downloaded from central: https://repo.maven.apache.org/maven2/org/apache/maven/shared/maven-shared-components/21/maven-shared-components-21.pom
(5.1 kB at 189 kB/s)
[windows-jdk9] [INFO] Downloading from central: https://repo.maven.apache.org/maven2/org/apache/maven/wagon/wagon-file/2.1/wagon-file-2.1.pom
[windows-jdk9] [INFO] Downloaded from central: https://repo.maven.apache.org/maven2/org/apache/maven/wagon/wagon-file/2.1/wagon-file-2.1.pom
(1.4 kB at 58 kB/s)
[windows-jdk9] [INFO] Downloading from central: https://repo.maven.apache.org/maven2/org/apache/maven/wagon/wagon-providers/2.1/wagon-providers-2.1.pom
[windows-jdk9] [INFO] Downloaded from central: https://repo.maven.apache.org/maven2/org/apache/maven/wagon/wagon-providers/2.1/wagon-providers-2.1.pom
(2.8 kB at 99 kB/s)
[windows-jdk9] [INFO] Downloading from central: https://repo.maven.apache.org/maven2/org/apache/maven/wagon/wagon/2.1/wagon-2.1.pom
[windows-jdk9] [INFO] Downloaded from central: https://repo.maven.apache.org/maven2/org/apache/maven/wagon/wagon/2.1/wagon-2.1.pom
(16 kB at 789 kB/s)
[windows-jdk9] [INFO] Downloading from central: https://repo.maven.apache.org/maven2/org/apache/maven/wagon/wagon-provider-api/2.1/wagon-provider-api-2.1.pom
[windows-jdk9] [INFO] Downloaded from central: https://repo.maven.apache.org/maven2/org/apache/maven/wagon/wagon-provider-api/2.1/wagon-provider-api-2.1.pom
(1.7 kB at 64 kB/s)
[windows-jdk9] [INFO] Downloading from central: https://repo.maven.apache.org/maven2/org/apache/maven/shared/maven-invoker/2.2/maven-invoker-2.2.jar
[windows-jdk9] [INFO] Downloading from central: https://repo.maven.apache.org/maven2/org/apache/maven/wagon/wagon-file/2.1/wagon-file-2.1.jar
[windows-jdk9] [INFO] Downloaded from central: https://repo.maven.apache.org/maven2/org/apache/maven/wagon/wagon-file/2.1/wagon-file-2.1.jar
(11 kB at 98 kB/s)
[windows-jdk9] [INFO] Downloaded from central: https://repo.maven.apache.org/maven2/org/apache/maven/shared/maven-invoker/2.2/maven-invoker-2.2.jar
(30 kB at 162 kB/s)
[windows-jdk9] [INFO] 
[windows-jdk9] [INFO] --- maven-clean-plugin:2.5:clean (default-clean) @ maven-plugin-testing-tools
---
[windows-jdk9] [INFO] 
[windows-jdk9] [INFO] --- maven-enforcer-plugin:1.3.1:enforce (enforce-bytecode-version) @
maven-plugin-testing-tools ---
[windows-jdk9] [INFO] Downloading from central: https://repo.maven.apache.org/maven2/org/apache/maven/wagon/wagon-provider-api/2.1/wagon-provider-api-2.1.jar
[windows-jdk9] [INFO] Downloaded from central: https://repo.maven.apache.org/maven2/org/apache/maven/wagon/wagon-provider-api/2.1/wagon-provider-api-2.1.jar
(52 kB at 537 kB/s)
[windows-jdk9] [INFO] 
[windows-jdk9] [INFO] --- maven-enforcer-plugin:1.3.1:enforce (ban-known-bad-maven-versions)
@ maven-plugin-testing-tools ---
[windows-jdk9] [INFO] 
[windows-jdk9] [INFO] --- maven-remote-resources-plugin:1.5:process (default) @ maven-plugin-testing-tools
---
[windows-jdk9] [INFO] 
[windows-jdk9] [INFO] --- maven-resources-plugin:2.6:resources (default-resources) @ maven-plugin-testing-tools
---
[windows-jdk9] [INFO] Using 'UTF-8' encoding to copy filtered resources.
[windows-jdk9] [INFO] skip non existing resourceDirectory F:\jenkins\jenkins-slave\workspace\n-testing_MPLUGINTESTING-58-UONNAARVYXAHZ4RVLUBM5ODIM6A4TFB5CEC4ELRKMGU3KDYXAPIQ\m\maven-plugin-testing-tools\src\main\resources
[windows-jdk9] [INFO] Copying 3 resources
[windows-jdk9] [INFO] 
[windows-jdk9] [INFO] --- maven-compiler-plugin:3.1:compile (default-compile) @ maven-plugin-testing-tools
---
[windows-jdk9] [INFO] Changes detected - recompiling the module!
[windows-jdk9] [INFO] Compiling 6 source files to F:\jenkins\jenkins-slave\workspace\n-testing_MPLUGINTESTING-58-UONNAARVYXAHZ4RVLUBM5ODIM6A4TFB5CEC4ELRKMGU3KDYXAPIQ\m\maven-plugin-testing-tools\target\classes
[windows-jdk9] [WARNING] /F:/jenkins/jenkins-slave/workspace/n-testing_MPLUGINTESTING-58-UONNAARVYXAHZ4RVLUBM5ODIM6A4TFB5CEC4ELRKMGU3KDYXAPIQ/m/maven-plugin-testing-tools/src/main/java/org/apache/maven/shared/test/plugin/ProjectTool.java:
Some input files use or override a deprecated API.
[windows-jdk9] [WARNING] /F:/jenkins/jenkins-slave/workspace/n-testing_MPLUGINTESTING-58-UONNAARVYXAHZ4RVLUBM5ODIM6A4TFB5CEC4ELRKMGU3KDYXAPIQ/m/maven-plugin-testing-tools/src/main/java/org/apache/maven/shared/test/plugin/ProjectTool.java:
Recompile with -Xlint:deprecation for details.
[windows-jdk9] [INFO] 
[windows-jdk9] [INFO] --- plexus-component-metadata:1.5.5:generate-metadata (default) @ maven-plugin-testing-tools
---
[windows-jdk9] [INFO] Downloading from central: https://repo.maven.apache.org/maven2/com/thoughtworks/qdox/qdox/1.9.2/qdox-1.9.2.pom
[windows-jdk9] [INFO] Downloaded from central: https://repo.maven.apache.org/maven2/com/thoughtworks/qdox/qdox/1.9.2/qdox-1.9.2.pom
(17 kB at 553 kB/s)
[windows-jdk9] [INFO] Downloading from central: https://repo.maven.apache.org/maven2/jdom/jdom/1.0/jdom-1.0.pom
[windows-jdk9] [INFO] Downloaded from central: https://repo.maven.apache.org/maven2/jdom/jdom/1.0/jdom-1.0.pom
(1.2 kB at 51 kB/s)
[windows-jdk9] [INFO] Downloading from central: https://repo.maven.apache.org/maven2/org/codehaus/plexus/plexus-cli/1.2/plexus-cli-1.2.pom
[windows-jdk9] [INFO] Downloaded from central: https://repo.maven.apache.org/maven2/org/codehaus/plexus/plexus-cli/1.2/plexus-cli-1.2.pom
(1.8 kB at 69 kB/s)
[windows-jdk9] [INFO] Downloading from central: https://repo.maven.apache.org/maven2/org/codehaus/plexus/plexus-tools/1.0.8/plexus-tools-1.0.8.pom
[windows-jdk9] [INFO] Downloaded from central: https://repo.maven.apache.org/maven2/org/codehaus/plexus/plexus-tools/1.0.8/plexus-tools-1.0.8.pom
(953 B at 38 kB/s)
[windows-jdk9] [INFO] Downloading from central: https://repo.maven.apache.org/maven2/commons-lang/commons-lang/1.0/commons-lang-1.0.pom
[windows-jdk9] [INFO] Downloaded from central: https://repo.maven.apache.org/maven2/commons-lang/commons-lang/1.0/commons-lang-1.0.pom
(2.5 kB at 129 kB/s)
[windows-jdk9] [INFO] Downloading from central: https://repo.maven.apache.org/maven2/asm/asm/3.1/asm-3.1.pom
[windows-jdk9] [INFO] Downloaded from central: https://repo.maven.apache.org/maven2/asm/asm/3.1/asm-3.1.pom
(278 B at 12 kB/s)
[windows-jdk9] [INFO] Downloading from central: https://repo.maven.apache.org/maven2/asm/asm-parent/3.1/asm-parent-3.1.pom
[windows-jdk9] [INFO] Downloaded from central: https://repo.maven.apache.org/maven2/asm/asm-parent/3.1/asm-parent-3.1.pom
(4.2 kB at 181 kB/s)
[windows-jdk9] [INFO] Downloading from central: https://repo.maven.apache.org/maven2/org/codehaus/plexus/plexus-utils/1.4.5/plexus-utils-1.4.5.jar
[windows-jdk9] [INFO] Downloading from central: https://repo.maven.apache.org/maven2/com/thoughtworks/qdox/qdox/1.9.2/qdox-1.9.2.jar
[windows-jdk9] [INFO] Downloading from central: https://repo.maven.apache.org/maven2/jdom/jdom/1.0/jdom-1.0.jar
[windows-jdk9] [INFO] Downloading from central: https://repo.maven.apache.org/maven2/org/codehaus/plexus/plexus-cli/1.2/plexus-cli-1.2.jar
[windows-jdk9] [INFO] Downloading from central: https://repo.maven.apache.org/maven2/commons-logging/commons-logging/1.0/commons-logging-1.0.jar
[windows-jdk9] [INFO] Downloaded from central: https://repo.maven.apache.org/maven2/org/codehaus/plexus/plexus-utils/1.4.5/plexus-utils-1.4.5.jar
(205 kB at 5.0 MB/s)
[windows-jdk9] [INFO] Downloading from central: https://repo.maven.apache.org/maven2/commons-lang/commons-lang/1.0/commons-lang-1.0.jar
[windows-jdk9] [INFO] Downloaded from central: https://repo.maven.apache.org/maven2/com/thoughtworks/qdox/qdox/1.9.2/qdox-1.9.2.jar
(170 kB at 3.4 MB/s)
[windows-jdk9] [INFO] Downloading from central: https://repo.maven.apache.org/maven2/asm/asm/3.1/asm-3.1.jar
[windows-jdk9] [INFO] Downloaded from central: https://repo.maven.apache.org/maven2/jdom/jdom/1.0/jdom-1.0.jar
(153 kB at 2.3 MB/s)
[windows-jdk9] [INFO] Downloaded from central: https://repo.maven.apache.org/maven2/commons-lang/commons-lang/1.0/commons-lang-1.0.jar
(64 kB at 829 kB/s)
[windows-jdk9] [INFO] Downloaded from central: https://repo.maven.apache.org/maven2/asm/asm/3.1/asm-3.1.jar
(43 kB at 545 kB/s)
[windows-jdk9] [INFO] Downloaded from central: https://repo.maven.apache.org/maven2/org/codehaus/plexus/plexus-cli/1.2/plexus-cli-1.2.jar
(7.7 kB at 92 kB/s)
[windows-jdk9] [INFO] Downloaded from central: https://repo.maven.apache.org/maven2/commons-logging/commons-logging/1.0/commons-logging-1.0.jar
(22 kB at 152 kB/s)
[windows-jdk9] [INFO] Discovered 5 component descriptors(s)
[windows-jdk9] [INFO] 
[windows-jdk9] [INFO] --- maven-resources-plugin:2.6:testResources (default-testResources)
@ maven-plugin-testing-tools ---
[windows-jdk9] [INFO] Using 'UTF-8' encoding to copy filtered resources.
[windows-jdk9] [INFO] Copying 2 resources
[windows-jdk9] [INFO] Copying 3 resources
[windows-jdk9] [INFO] 
[windows-jdk9] [INFO] --- maven-compiler-plugin:3.1:testCompile (default-testCompile) @ maven-plugin-testing-tools
---
[windows-jdk9] [INFO] Changes detected - recompiling the module!
[windows-jdk9] [INFO] Compiling 2 source files to F:\jenkins\jenkins-slave\workspace\n-testing_MPLUGINTESTING-58-UONNAARVYXAHZ4RVLUBM5ODIM6A4TFB5CEC4ELRKMGU3KDYXAPIQ\m\maven-plugin-testing-tools\target\test-classes
[windows-jdk9] [WARNING] /F:/jenkins/jenkins-slave/workspace/n-testing_MPLUGINTESTING-58-UONNAARVYXAHZ4RVLUBM5ODIM6A4TFB5CEC4ELRKMGU3KDYXAPIQ/m/maven-plugin-testing-tools/src/test/java/org/apache/maven/shared/test/plugin/RepositoryToolTest.java:
Some input files use or override a deprecated API.
[windows-jdk9] [WARNING] /F:/jenkins/jenkins-slave/workspace/n-testing_MPLUGINTESTING-58-UONNAARVYXAHZ4RVLUBM5ODIM6A4TFB5CEC4ELRKMGU3KDYXAPIQ/m/maven-plugin-testing-tools/src/test/java/org/apache/maven/shared/test/plugin/RepositoryToolTest.java:
Recompile with -Xlint:deprecation for details.
[windows-jdk9] [INFO] 
[windows-jdk9] [INFO] --- maven-surefire-plugin:2.16:test (default-test) @ maven-plugin-testing-tools
---
[windows-jdk9] [INFO] Surefire report directory: F:\jenkins\jenkins-slave\workspace\n-testing_MPLUGINTESTING-58-UONNAARVYXAHZ4RVLUBM5ODIM6A4TFB5CEC4ELRKMGU3KDYXAPIQ\m\maven-plugin-testing-tools\target\surefire-reports
[windows-jdk9] 
[windows-jdk9] -------------------------------------------------------
[windows-jdk9]  T E S T S
[windows-jdk9] -------------------------------------------------------
[windows-jdk9] Picked up JAVA_TOOL_OPTIONS: -Dmaven.ext.class.path="f:\jenkins\jenkins-slave\workspace\n-testing_MPLUGINTESTING-58-UONNAARVYXAHZ4RVLUBM5ODIM6A4TFB5CEC4ELRKMGU3KDYXAPIQ@tmp\withMaven89daf713\pipeline-maven-spy.jar"
-Dorg.jenkinsci.plugins.pipeline.maven.reportsFolder="f:\jenkins\jenkins-slave\workspace\n-testing_MPLUGINTESTING-58-UONNAARVYXAHZ4RVLUBM5ODIM6A4TFB5CEC4ELRKMGU3KDYXAPIQ@tmp\withMaven89daf713"

[windows-jdk9] Running org.apache.maven.shared.test.plugin.ProjectToolTest
[windows-jdk9] Using target\it-build-target and target\it-build-target\classes to build IT
version of plugin
[windows-jdk9] Now Building test version of the plugin...
[windows-jdk9] Using staged plugin-pom: F:\jenkins\jenkins-slave\workspace\n-testing_MPLUGINTESTING-58-UONNAARVYXAHZ4RVLUBM5ODIM6A4TFB5CEC4ELRKMGU3KDYXAPIQ\m\maven-plugin-testing-tools\target\unit\projects\basic\pom-test.xml
[windows-jdk9] Using IT Plugin Jar: F:\jenkins\jenkins-slave\workspace\n-testing_MPLUGINTESTING-58-UONNAARVYXAHZ4RVLUBM5ODIM6A4TFB5CEC4ELRKMGU3KDYXAPIQ\m\maven-plugin-testing-tools\target\unit\projects\basic\target\it-build-target\maven-it-plugin-test.jar
[windows-jdk9] Using target\it-build-target and target\it-build-target\classes to build IT
version of plugin
[windows-jdk9] Now Building test version of the plugin...
[windows-jdk9] Using staged plugin-pom: F:\jenkins\jenkins-slave\workspace\n-testing_MPLUGINTESTING-58-UONNAARVYXAHZ4RVLUBM5ODIM6A4TFB5CEC4ELRKMGU3KDYXAPIQ\m\maven-plugin-testing-tools\target\unit\projects\basic\pom-test.xml
[windows-jdk9] Using IT Plugin Jar: F:\jenkins\jenkins-slave\workspace\n-testing_MPLUGINTESTING-58-UONNAARVYXAHZ4RVLUBM5ODIM6A4TFB5CEC4ELRKMGU3KDYXAPIQ\m\maven-plugin-testing-tools\target\unit\projects\basic\target\it-build-target\maven-it-plugin-test.jar
[windows-jdk9] Using target\it-build-target and target\it-build-target\classes to build IT
version of plugin
[windows-jdk9] Tests run: 3, Failures: 1, Errors: 0, Skipped: 0, Time elapsed: 17.293 sec
<<< FAILURE! - in org.apache.maven.shared.test.plugin.ProjectToolTest
[windows-jdk9] testPackageProjectArtifact_ShouldPopulateWithCorrectArtifactAndMetadata(org.apache.maven.shared.test.plugin.ProjectToolTest)
 Time elapsed: 7.19 sec  <<< FAILURE!
[windows-jdk9] junit.framework.AssertionFailedError: Missing target\unit\projects\basic\target\it-build-target\maven-it-plugin-test.jar
[windows-jdk9] 	at junit.framework.Assert.fail(Assert.java:57)
[windows-jdk9] 	at junit.framework.Assert.assertTrue(Assert.java:22)
[windows-jdk9] 	at junit.framework.TestCase.assertTrue(TestCase.java:192)
[windows-jdk9] 	at org.apache.maven.shared.test.plugin.ProjectToolTest.testPackageProjectArtifact_ShouldPopulateWithCorrectArtifactAndMetadata(ProjectToolTest.java:99)
[windows-jdk9] 
[windows-jdk9] Running org.apache.maven.shared.test.plugin.RepositoryToolTest
[windows-jdk9] Tests run: 1, Failures: 0, Errors: 0, Skipped: 0, Time elapsed: 0.272 sec -
in org.apache.maven.shared.test.plugin.RepositoryToolTest
[windows-jdk9] 
[windows-jdk9] Results :
[windows-jdk9] 
[windows-jdk9] Failed tests: 
[windows-jdk9]   ProjectToolTest.testPackageProjectArtifact_ShouldPopulateWithCorrectArtifactAndMetadata:99
Missing target\unit\projects\basic\target\it-build-target\maven-it-plugin-test.jar
[windows-jdk9] 
[windows-jdk9] Tests run: 4, Failures: 1, Errors: 0, Skipped: 0
[windows-jdk9] 
[windows-jdk9] [ERROR] There are test failures.
[windows-jdk9] 
[windows-jdk9] Please refer to F:\jenkins\jenkins-slave\workspace\n-testing_MPLUGINTESTING-58-UONNAARVYXAHZ4RVLUBM5ODIM6A4TFB5CEC4ELRKMGU3KDYXAPIQ\m\maven-plugin-testing-tools\target\surefire-reports
for the individual test results.
[windows-jdk9] [INFO] 
[windows-jdk9] [INFO] --- maven-jar-plugin:2.4:jar (default-jar) @ maven-plugin-testing-tools
---
[windows-jdk9] [INFO] Building jar: F:\jenkins\jenkins-slave\workspace\n-testing_MPLUGINTESTING-58-UONNAARVYXAHZ4RVLUBM5ODIM6A4TFB5CEC4ELRKMGU3KDYXAPIQ\m\maven-plugin-testing-tools\target\maven-plugin-testing-tools-3.3.1-SNAPSHOT.jar
[windows-jdk9] [INFO] ------------------------------------------------------------------------
[windows-jdk9] [INFO] Reactor Summary:
[windows-jdk9] [INFO] 
[windows-jdk9] [INFO] Maven Plugin Testing ............................... SUCCESS [ 26.721
s]
[windows-jdk9] [INFO] Maven Plugin Testing Mechanism ..................... SUCCESS [ 26.792
s]
[windows-jdk9] [INFO] Maven Testing Tools ................................ SUCCESS [  1.365
s]
[windows-jdk9] [INFO] Maven Plugin Testing Tools ......................... SUCCESS [ 22.478
s]
[windows-jdk9] [INFO] ------------------------------------------------------------------------
[windows-jdk9] [INFO] BUILD SUCCESS
[windows-jdk9] [INFO] ------------------------------------------------------------------------
[windows-jdk9] [INFO] Total time: 01:19 min
[windows-jdk9] [INFO] Finished at: 2018-11-02T08:36:24-07:00
[windows-jdk9] [INFO] Final Memory: 32M/106M
[windows-jdk9] [INFO] ------------------------------------------------------------------------
[windows-jdk9] [WARNING] The requested profile "run-its" could not be activated because it
does not exist.
[windows-jdk9] [INFO] [jenkins-event-spy] Generated F:\jenkins\jenkins-slave\workspace\n-testing_MPLUGINTESTING-58-UONNAARVYXAHZ4RVLUBM5ODIM6A4TFB5CEC4ELRKMGU3KDYXAPIQ@tmp\withMaven89daf713\maven-spy-20181102-083504-22016475671835173297507.log
[Pipeline] [windows-jdk9] }
[Pipeline] [windows-jdk9] // dir
[Pipeline] [windows-jdk9] }
[windows-jdk9] [withMaven] junitPublisher - Archive test results for Maven artifact org.apache.maven.plugin-testing:maven-plugin-testing-harness:3.3.1-SNAPSHOT
generated by maven-surefire-plugin:test (default-test): m\maven-plugin-testing-harness\target\surefire-reports\*.xml
[windows-jdk9] Recording test results
[windows-jdk9] [withMaven] junitPublisher - Archive test results for Maven artifact org.apache.maven.plugin-testing:maven-test-tools:3.3.1-SNAPSHOT
generated by maven-surefire-plugin:test (default-test): m\maven-test-tools\target\surefire-reports\*.xml
[windows-jdk9] Recording test results
[windows-jdk9] None of the test reports contained any result
[windows-jdk9] [withMaven] junitPublisher - Archive test results for Maven artifact org.apache.maven.plugin-testing:maven-plugin-testing-tools:3.3.1-SNAPSHOT
generated by maven-surefire-plugin:test (default-test): m\maven-plugin-testing-tools\target\surefire-reports\*.xml
[windows-jdk9] Recording test results
[Pipeline] [windows-jdk9] // withMaven
[Pipeline] [windows-jdk9] cleanWs
[windows-jdk9] [WS-CLEANUP] Deleting project workspace...[WS-CLEANUP] done
[Pipeline] [windows-jdk9] }
[Pipeline] [windows-jdk9] // stage
[Pipeline] [windows-jdk9] }
[Pipeline] [windows-jdk9] // node
[Pipeline] [windows-jdk9] }
[Pipeline] // parallel
[Pipeline] stage
[Pipeline] { (Notifications)
[Pipeline] echo
Build result: UNSTABLE
[Pipeline] jiraIssueSelector
[Pipeline] emailext
Mime
  • Unnamed multipart/mixed (inline, None, 0 bytes)
View raw message