maven-notifications mailing list archives

Site index · List index
Message view « Date » · « Thread »
Top « Date » · « Thread »
From Apache Jenkins Server <jenk...@builds.apache.org>
Subject Build unstable in Jenkins: Maven TLP » maven-plugin-tools » master #48
Date Tue, 09 Oct 2018 01:20:50 GMT
See https://builds.apache.org/job/maven-box/job/maven-plugin-tools/job/master/48/

Changes:

* Exclude H31 cause master is failing constantly.
* use  Opcodes.ASM7 to be sure getting this working with jdk11
* use  Opcodes.ASM7 to be sure getting this working with jdk11
* use  Opcodes.ASM7 to be sure getting this working with jdk11
* use  Opcodes.ASM7 to be sure getting this working with jdk11
* use  Opcodes.ASM7 to be sure getting this working with jdk11
* use  Opcodes.ASM7 to be sure getting this working with jdk11
* use  Opcodes.ASM7 to be sure getting this working with jdk11
* use  Opcodes.ASM7 to be sure getting this working with jdk11
* use  Opcodes.ASM7 to be sure getting this working with jdk11
* use  Opcodes.ASM7 to be sure getting this working with jdk11
* use  Opcodes.ASM7 to be sure getting this working with jdk11
* use  Opcodes.ASM7 to be sure getting this working with jdk11

2 tests failed.
FAILED:  org.apache.maven.tools.plugin.generator.PluginDescriptorGeneratorTest.testGenerator

Error Message:
C:\Users\jenkins\AppData\Local\Temp\1\testGenerator-outDir\plugin.xml (The system cannot find the path specified)

Stack Trace:
java.io.FileNotFoundException: C:\Users\jenkins\AppData\Local\Temp\1\testGenerator-outDir\plugin.xml (The system cannot find the path specified)
	at java.io.FileInputStream.open(Native Method)
	at java.io.FileInputStream.<init>(FileInputStream.java:146)
	at org.codehaus.plexus.util.xml.XmlReader.<init>(XmlReader.java:124)
	at org.codehaus.plexus.util.xml.XmlStreamReader.<init>(XmlStreamReader.java:67)
	at org.codehaus.plexus.util.ReaderFactory.newXmlReader(ReaderFactory.java:118)
	at org.apache.maven.tools.plugin.generator.PluginDescriptorGeneratorTest.readFile(PluginDescriptorGeneratorTest.java:83)
	at org.apache.maven.tools.plugin.generator.PluginDescriptorGeneratorTest.validate(PluginDescriptorGeneratorTest.java:50)
	at org.apache.maven.tools.plugin.generator.AbstractGeneratorTestCase.testGenerator(AbstractGeneratorTestCase.java:121)
	at sun.reflect.NativeMethodAccessorImpl.invoke0(Native Method)
	at sun.reflect.NativeMethodAccessorImpl.invoke(NativeMethodAccessorImpl.java:57)
	at sun.reflect.DelegatingMethodAccessorImpl.invoke(DelegatingMethodAccessorImpl.java:43)
	at java.lang.reflect.Method.invoke(Method.java:606)
	at junit.framework.TestCase.runTest(TestCase.java:164)
	at junit.framework.TestCase.runBare(TestCase.java:130)
	at junit.framework.TestResult$1.protect(TestResult.java:106)
	at junit.framework.TestResult.runProtected(TestResult.java:124)
	at junit.framework.TestResult.run(TestResult.java:109)
	at junit.framework.TestCase.run(TestCase.java:120)
	at junit.framework.TestSuite.runTest(TestSuite.java:230)
	at junit.framework.TestSuite.run(TestSuite.java:225)
	at sun.reflect.NativeMethodAccessorImpl.invoke0(Native Method)
	at sun.reflect.NativeMethodAccessorImpl.invoke(NativeMethodAccessorImpl.java:57)
	at sun.reflect.DelegatingMethodAccessorImpl.invoke(DelegatingMethodAccessorImpl.java:43)
	at java.lang.reflect.Method.invoke(Method.java:606)
	at org.apache.maven.surefire.junit.JUnitTestSet.execute(JUnitTestSet.java:100)
	at org.apache.maven.surefire.junit.JUnit3Provider.executeTestSet(JUnit3Provider.java:140)
	at org.apache.maven.surefire.junit.JUnit3Provider.invoke(JUnit3Provider.java:113)
	at org.apache.maven.surefire.booter.ForkedBooter.invokeProviderInSameClassLoader(ForkedBooter.java:383)
	at org.apache.maven.surefire.booter.ForkedBooter.runSuitesInProcess(ForkedBooter.java:344)
	at org.apache.maven.surefire.booter.ForkedBooter.execute(ForkedBooter.java:125)
	at org.apache.maven.surefire.booter.ForkedBooter.main(ForkedBooter.java:417)


FAILED:  org.apache.maven.tools.plugin.generator.PluginHelpGeneratorTest.testGenerator

Error Message:
C:\Users\jenkins\AppData\Local\Temp\1\testGenerator-outDir\org\apache\maven\tools\plugin does not exist

Stack Trace:
java.lang.IllegalArgumentException: C:\Users\jenkins\AppData\Local\Temp\1\testGenerator-outDir\org\apache\maven\tools\plugin does not exist
	at org.codehaus.plexus.util.FileUtils.cleanDirectory(FileUtils.java:1650)
	at org.codehaus.plexus.util.FileUtils.deleteDirectory(FileUtils.java:1618)
	at org.codehaus.plexus.util.FileUtils.forceDelete(FileUtils.java:1402)
	at org.codehaus.plexus.util.FileUtils.cleanDirectory(FileUtils.java:1672)
	at org.codehaus.plexus.util.FileUtils.deleteDirectory(FileUtils.java:1618)
	at org.codehaus.plexus.util.FileUtils.forceDelete(FileUtils.java:1402)
	at org.codehaus.plexus.util.FileUtils.cleanDirectory(FileUtils.java:1672)
	at org.codehaus.plexus.util.FileUtils.deleteDirectory(FileUtils.java:1618)
	at org.codehaus.plexus.util.FileUtils.forceDelete(FileUtils.java:1402)
	at org.codehaus.plexus.util.FileUtils.cleanDirectory(FileUtils.java:1672)
	at org.codehaus.plexus.util.FileUtils.deleteDirectory(FileUtils.java:1618)
	at org.codehaus.plexus.util.FileUtils.forceDelete(FileUtils.java:1402)
	at org.codehaus.plexus.util.FileUtils.cleanDirectory(FileUtils.java:1672)
	at org.codehaus.plexus.util.FileUtils.deleteDirectory(FileUtils.java:1618)
	at org.codehaus.plexus.util.FileUtils.forceDelete(FileUtils.java:1402)
	at org.codehaus.plexus.util.FileUtils.cleanDirectory(FileUtils.java:1672)
	at org.codehaus.plexus.util.FileUtils.deleteDirectory(FileUtils.java:1618)
	at org.apache.maven.tools.plugin.generator.AbstractGeneratorTestCase.testGenerator(AbstractGeneratorTestCase.java:123)
	at sun.reflect.NativeMethodAccessorImpl.invoke0(Native Method)
	at sun.reflect.NativeMethodAccessorImpl.invoke(NativeMethodAccessorImpl.java:57)
	at sun.reflect.DelegatingMethodAccessorImpl.invoke(DelegatingMethodAccessorImpl.java:43)
	at java.lang.reflect.Method.invoke(Method.java:606)
	at junit.framework.TestCase.runTest(TestCase.java:164)
	at junit.framework.TestCase.runBare(TestCase.java:130)
	at junit.framework.TestResult$1.protect(TestResult.java:106)
	at junit.framework.TestResult.runProtected(TestResult.java:124)
	at junit.framework.TestResult.run(TestResult.java:109)
	at junit.framework.TestCase.run(TestCase.java:120)
	at junit.framework.TestSuite.runTest(TestSuite.java:230)
	at junit.framework.TestSuite.run(TestSuite.java:225)
	at sun.reflect.NativeMethodAccessorImpl.invoke0(Native Method)
	at sun.reflect.NativeMethodAccessorImpl.invoke(NativeMethodAccessorImpl.java:57)
	at sun.reflect.DelegatingMethodAccessorImpl.invoke(DelegatingMethodAccessorImpl.java:43)
	at java.lang.reflect.Method.invoke(Method.java:606)
	at org.apache.maven.surefire.junit.JUnitTestSet.execute(JUnitTestSet.java:100)
	at org.apache.maven.surefire.junit.JUnit3Provider.executeTestSet(JUnit3Provider.java:140)
	at org.apache.maven.surefire.junit.JUnit3Provider.invoke(JUnit3Provider.java:113)
	at org.apache.maven.surefire.booter.ForkedBooter.invokeProviderInSameClassLoader(ForkedBooter.java:383)
	at org.apache.maven.surefire.booter.ForkedBooter.runSuitesInProcess(ForkedBooter.java:344)
	at org.apache.maven.surefire.booter.ForkedBooter.execute(ForkedBooter.java:125)
	at org.apache.maven.surefire.booter.ForkedBooter.main(ForkedBooter.java:417)




Build log:
[...truncated 7.42 MB...]
[windows-jdk7-m3.5.x_build] [INFO] Maven Plugin Plugin ................................ SUCCESS [22:23 min]
[windows-jdk7-m3.5.x_build] [INFO] ------------------------------------------------------------------------
[windows-jdk7-m3.5.x_build] [INFO] BUILD SUCCESS
[windows-jdk7-m3.5.x_build] [INFO] ------------------------------------------------------------------------
[windows-jdk7-m3.5.x_build] [INFO] Total time: 27:40 min
[windows-jdk7-m3.5.x_build] [INFO] Finished at: 2018-10-09T01:15:36Z
[windows-jdk7-m3.5.x_build] [INFO] Final Memory: 86M/1483M
[windows-jdk7-m3.5.x_build] [INFO] ------------------------------------------------------------------------
[windows-jdk7-m3.5.x_build] [INFO] [jenkins-event-spy] Generated F:\jenkins\jenkins-slave\workspace\x_maven-plugin-tools_master-XKS4EHY3PSXHGP4DHIXUDAAM6TMAKT3YNFP2XDSSXFM24ZMKWIXQ@3@tmp\withMaven88ddbaca\maven-spy-20181009-004754-192689471904683308277.log
[windows-jdk7-m3.5.x_build] Picked up JAVA_TOOL_OPTIONS: -Dmaven.ext.class.path="f:\jenkins\jenkins-slave\workspace\x_maven-plugin-tools_master-XKS4EHY3PSXHGP4DHIXUDAAM6TMAKT3YNFP2XDSSXFM24ZMKWIXQ@3@tmp\withMaven88ddbaca\pipeline-maven-spy.jar" -Dorg.jenkinsci.plugins.pipeline.maven.reportsFolder="f:\jenkins\jenkins-slave\workspace\x_maven-plugin-tools_master-XKS4EHY3PSXHGP4DHIXUDAAM6TMAKT3YNFP2XDSSXFM24ZMKWIXQ@3@tmp\withMaven88ddbaca" 
[Pipeline] [windows-jdk7-m3.5.x_build] }
[Pipeline] [windows-jdk7-m3.5.x_build] // dir
[windows-jdk11-m3.5.x_build] [INFO]           mplugin-324_javadoc\pom.xml ...................... SUCCESS (23.2 s)
[windows-jdk11-m3.5.x_build] [INFO] Building: packaging-jar\pom.xml
[windows-jdk11-m3.5.x_build] [INFO] run post-build script verify.groovy
[windows-jdk11-m3.5.x_build] [INFO]           packaging-jar\pom.xml ............................ SUCCESS (6.3 s)
[windows-jdk11-m3.5.x_build] [INFO] Building: plugin-info-jdk\pom.xml
[Pipeline] [windows-jdk7-m3.5.x_build] }
[windows-jdk7-m3.5.x_build] [withMaven] artifactsPublisher - Archive artifact windows-jdk7-m3.5.x_build\pom.xml under org\apache\maven\plugin-tools\maven-plugin-tools\3.6.0-SNAPSHOT\maven-plugin-tools-3.6.0-SNAPSHOT.pom
[windows-jdk7-m3.5.x_build] [withMaven] artifactsPublisher - Archive artifact windows-jdk7-m3.5.x_build\target\maven-plugin-tools-3.6.0-SNAPSHOT-site.xml under org\apache\maven\plugin-tools\maven-plugin-tools\3.6.0-SNAPSHOT\maven-plugin-tools-3.6.0-SNAPSHOT-site.xml
[windows-jdk7-m3.5.x_build] [withMaven] artifactsPublisher - Archive artifact windows-jdk7-m3.5.x_build\maven-plugin-tools-api\pom.xml under org\apache\maven\plugin-tools\maven-plugin-tools-api\3.6.0-SNAPSHOT\maven-plugin-tools-api-3.6.0-SNAPSHOT.pom
[windows-jdk7-m3.5.x_build] [withMaven] artifactsPublisher - Archive artifact windows-jdk7-m3.5.x_build\maven-plugin-tools-api\target\maven-plugin-tools-api-3.6.0-SNAPSHOT.jar under org\apache\maven\plugin-tools\maven-plugin-tools-api\3.6.0-SNAPSHOT\maven-plugin-tools-api-3.6.0-SNAPSHOT.jar
[windows-jdk7-m3.5.x_build] [withMaven] artifactsPublisher - Archive artifact windows-jdk7-m3.5.x_build\maven-plugin-tools-generators\pom.xml under org\apache\maven\plugin-tools\maven-plugin-tools-generators\3.6.0-SNAPSHOT\maven-plugin-tools-generators-3.6.0-SNAPSHOT.pom
[windows-jdk7-m3.5.x_build] [withMaven] artifactsPublisher - Archive artifact windows-jdk7-m3.5.x_build\maven-plugin-tools-generators\target\maven-plugin-tools-generators-3.6.0-SNAPSHOT.jar under org\apache\maven\plugin-tools\maven-plugin-tools-generators\3.6.0-SNAPSHOT\maven-plugin-tools-generators-3.6.0-SNAPSHOT.jar
[windows-jdk7-m3.5.x_build] [withMaven] artifactsPublisher - Archive artifact windows-jdk7-m3.5.x_build\maven-plugin-tools-java\pom.xml under org\apache\maven\plugin-tools\maven-plugin-tools-java\3.6.0-SNAPSHOT\maven-plugin-tools-java-3.6.0-SNAPSHOT.pom
[windows-jdk7-m3.5.x_build] [withMaven] artifactsPublisher - Archive artifact windows-jdk7-m3.5.x_build\maven-plugin-tools-java\target\maven-plugin-tools-java-3.6.0-SNAPSHOT.jar under org\apache\maven\plugin-tools\maven-plugin-tools-java\3.6.0-SNAPSHOT\maven-plugin-tools-java-3.6.0-SNAPSHOT.jar
[windows-jdk7-m3.5.x_build] [withMaven] artifactsPublisher - Archive artifact windows-jdk7-m3.5.x_build\maven-plugin-annotations\pom.xml under org\apache\maven\plugin-tools\maven-plugin-annotations\3.6.0-SNAPSHOT\maven-plugin-annotations-3.6.0-SNAPSHOT.pom
[windows-jdk7-m3.5.x_build] [withMaven] artifactsPublisher - Archive artifact windows-jdk7-m3.5.x_build\maven-plugin-annotations\target\maven-plugin-annotations-3.6.0-SNAPSHOT.jar under org\apache\maven\plugin-tools\maven-plugin-annotations\3.6.0-SNAPSHOT\maven-plugin-annotations-3.6.0-SNAPSHOT.jar
[windows-jdk7-m3.5.x_build] [withMaven] artifactsPublisher - Archive artifact windows-jdk7-m3.5.x_build\maven-plugin-tools-annotations\pom.xml under org\apache\maven\plugin-tools\maven-plugin-tools-annotations\3.6.0-SNAPSHOT\maven-plugin-tools-annotations-3.6.0-SNAPSHOT.pom
[windows-jdk7-m3.5.x_build] [withMaven] artifactsPublisher - Archive artifact windows-jdk7-m3.5.x_build\maven-plugin-tools-annotations\target\maven-plugin-tools-annotations-3.6.0-SNAPSHOT.jar under org\apache\maven\plugin-tools\maven-plugin-tools-annotations\3.6.0-SNAPSHOT\maven-plugin-tools-annotations-3.6.0-SNAPSHOT.jar
[windows-jdk7-m3.5.x_build] [withMaven] artifactsPublisher - Archive artifact windows-jdk7-m3.5.x_build\maven-plugin-tools-annotations\target\maven-plugin-tools-annotations-3.6.0-SNAPSHOT-tests.jar under org\apache\maven\plugin-tools\maven-plugin-tools-annotations\3.6.0-SNAPSHOT\maven-plugin-tools-annotations-3.6.0-SNAPSHOT-tests.jar
[windows-jdk7-m3.5.x_build] [withMaven] artifactsPublisher - Archive artifact windows-jdk7-m3.5.x_build\maven-plugin-tools-annotations\target\maven-plugin-tools-annotations-3.6.0-SNAPSHOT-test-sources.jar under org\apache\maven\plugin-tools\maven-plugin-tools-annotations\3.6.0-SNAPSHOT\maven-plugin-tools-annotations-3.6.0-SNAPSHOT-test-sources.jar
[windows-jdk7-m3.5.x_build] [withMaven] artifactsPublisher - Archive artifact windows-jdk7-m3.5.x_build\maven-script\pom.xml under org\apache\maven\plugin-tools\maven-script\3.6.0-SNAPSHOT\maven-script-3.6.0-SNAPSHOT.pom
[windows-jdk7-m3.5.x_build] [withMaven] artifactsPublisher - Archive artifact windows-jdk7-m3.5.x_build\maven-script\target\maven-script-3.6.0-SNAPSHOT-site.xml under org\apache\maven\plugin-tools\maven-script\3.6.0-SNAPSHOT\maven-script-3.6.0-SNAPSHOT-site.xml
[windows-jdk7-m3.5.x_build] [withMaven] artifactsPublisher - Archive artifact windows-jdk7-m3.5.x_build\maven-script\maven-plugin-tools-model\pom.xml under org\apache\maven\plugin-tools\maven-plugin-tools-model\3.6.0-SNAPSHOT\maven-plugin-tools-model-3.6.0-SNAPSHOT.pom
[windows-jdk7-m3.5.x_build] [withMaven] artifactsPublisher - Archive artifact windows-jdk7-m3.5.x_build\maven-script\maven-plugin-tools-model\target\maven-plugin-tools-model-3.6.0-SNAPSHOT.jar under org\apache\maven\plugin-tools\maven-plugin-tools-model\3.6.0-SNAPSHOT\maven-plugin-tools-model-3.6.0-SNAPSHOT.jar
[windows-jdk7-m3.5.x_build] [withMaven] artifactsPublisher - Archive artifact windows-jdk7-m3.5.x_build\maven-script\maven-plugin-tools-ant\pom.xml under org\apache\maven\plugin-tools\maven-plugin-tools-ant\3.6.0-SNAPSHOT\maven-plugin-tools-ant-3.6.0-SNAPSHOT.pom
[windows-jdk7-m3.5.x_build] [withMaven] artifactsPublisher - Archive artifact windows-jdk7-m3.5.x_build\maven-script\maven-plugin-tools-ant\target\maven-plugin-tools-ant-3.6.0-SNAPSHOT.jar under org\apache\maven\plugin-tools\maven-plugin-tools-ant\3.6.0-SNAPSHOT\maven-plugin-tools-ant-3.6.0-SNAPSHOT.jar
[windows-jdk7-m3.5.x_build] [withMaven] artifactsPublisher - Archive artifact windows-jdk7-m3.5.x_build\maven-script\maven-script-ant\pom.xml under org\apache\maven\plugin-tools\maven-script-ant\3.6.0-SNAPSHOT\maven-script-ant-3.6.0-SNAPSHOT.pom
[windows-jdk7-m3.5.x_build] [withMaven] artifactsPublisher - Archive artifact windows-jdk7-m3.5.x_build\maven-script\maven-script-ant\target\maven-script-ant-3.6.0-SNAPSHOT.jar under org\apache\maven\plugin-tools\maven-script-ant\3.6.0-SNAPSHOT\maven-script-ant-3.6.0-SNAPSHOT.jar
[windows-jdk7-m3.5.x_build] [withMaven] artifactsPublisher - Archive artifact windows-jdk7-m3.5.x_build\maven-script\maven-plugin-tools-beanshell\pom.xml under org\apache\maven\plugin-tools\maven-plugin-tools-beanshell\3.6.0-SNAPSHOT\maven-plugin-tools-beanshell-3.6.0-SNAPSHOT.pom
[windows-jdk7-m3.5.x_build] [withMaven] artifactsPublisher - Archive artifact windows-jdk7-m3.5.x_build\maven-script\maven-plugin-tools-beanshell\target\maven-plugin-tools-beanshell-3.6.0-SNAPSHOT.jar under org\apache\maven\plugin-tools\maven-plugin-tools-beanshell\3.6.0-SNAPSHOT\maven-plugin-tools-beanshell-3.6.0-SNAPSHOT.jar
[windows-jdk7-m3.5.x_build] [withMaven] artifactsPublisher - Archive artifact windows-jdk7-m3.5.x_build\maven-script\maven-script-beanshell\pom.xml under org\apache\maven\plugin-tools\maven-script-beanshell\3.6.0-SNAPSHOT\maven-script-beanshell-3.6.0-SNAPSHOT.pom
[windows-jdk7-m3.5.x_build] [withMaven] artifactsPublisher - Archive artifact windows-jdk7-m3.5.x_build\maven-script\maven-script-beanshell\target\maven-script-beanshell-3.6.0-SNAPSHOT.jar under org\apache\maven\plugin-tools\maven-script-beanshell\3.6.0-SNAPSHOT\maven-script-beanshell-3.6.0-SNAPSHOT.jar
[windows-jdk7-m3.5.x_build] [withMaven] artifactsPublisher - Archive artifact windows-jdk7-m3.5.x_build\maven-plugin-plugin\pom.xml under org\apache\maven\plugins\maven-plugin-plugin\3.6.0-SNAPSHOT\maven-plugin-plugin-3.6.0-SNAPSHOT.pom
[windows-jdk7-m3.5.x_build] [withMaven] artifactsPublisher - Archive artifact windows-jdk7-m3.5.x_build\maven-plugin-plugin\target\maven-plugin-plugin-3.6.0-SNAPSHOT.jar under org\apache\maven\plugins\maven-plugin-plugin\3.6.0-SNAPSHOT\maven-plugin-plugin-3.6.0-SNAPSHOT.jar
[windows-jdk7-m3.5.x_build] [withMaven] invokerPublisher - Archive invoker results for Maven artifact MavenArtifact{org.apache.maven.plugins:maven-plugin-plugin::3.6.0-SNAPSHOT(version: 3.6.0-SNAPSHOT, snapshot:false) } generated by PluginInvocation{org.apache.maven.plugins:maven-invoker-plugin:3.0.1@run  integration-test}: windows-jdk7-m3.5.x_build\maven-plugin-plugin\target\invoker-reports\*.xml
[windows-jdk7-m3.5.x_build] performing MavenInvokerRecorder, reportsFilenamePattern:'**/windows-jdk7-m3.5.x_build\maven-plugin-plugin\target\invoker-reports/BUILD*.xml', invokerBuildDir:'**/windows-jdk7-m3.5.x_build\maven-plugin-plugin\target\it'
[windows-jdk7-m3.5.x_build] Found reports:[f:\jenkins\jenkins-slave\workspace\x_maven-plugin-tools_master-XKS4EHY3PSXHGP4DHIXUDAAM6TMAKT3YNFP2XDSSXFM24ZMKWIXQ@3\windows-jdk7-m3.5.x_build\maven-plugin-plugin\target\invoker-reports\BUILD-annotation-with-inheritance-from-deps.xml, f:\jenkins\jenkins-slave\workspace\x_maven-plugin-tools_master-XKS4EHY3PSXHGP4DHIXUDAAM6TMAKT3YNFP2XDSSXFM24ZMKWIXQ@3\windows-jdk7-m3.5.x_build\maven-plugin-plugin\target\invoker-reports\BUILD-annotation-with-inheritance-reactor.xml, f:\jenkins\jenkins-slave\workspace\x_maven-plugin-tools_master-XKS4EHY3PSXHGP4DHIXUDAAM6TMAKT3YNFP2XDSSXFM24ZMKWIXQ@3\windows-jdk7-m3.5.x_build\maven-plugin-plugin\target\invoker-reports\BUILD-annotation-with-inheritance.xml, f:\jenkins\jenkins-slave\workspace\x_maven-plugin-tools_master-XKS4EHY3PSXHGP4DHIXUDAAM6TMAKT3YNFP2XDSSXFM24ZMKWIXQ@3\windows-jdk7-m3.5.x_build\maven-plugin-plugin\target\invoker-reports\BUILD-ant-basic.xml, f:\jenkins\jenkins-slave\workspace\x_maven-plugin-tools_master-XKS4EHY3PSXHGP4DHIXUDAAM6TMAKT3YNFP2XDSSXFM24ZMKWIXQ@3\windows-jdk7-m3.5.x_build\maven-plugin-plugin\target\invoker-reports\BUILD-ant-reference-parameter.xml, f:\jenkins\jenkins-slave\workspace\x_maven-plugin-tools_master-XKS4EHY3PSXHGP4DHIXUDAAM6TMAKT3YNFP2XDSSXFM24ZMKWIXQ@3\windows-jdk7-m3.5.x_build\maven-plugin-plugin\target\invoker-reports\BUILD-ant-simple-usage.xml, f:\jenkins\jenkins-slave\workspace\x_maven-plugin-tools_master-XKS4EHY3PSXHGP4DHIXUDAAM6TMAKT3YNFP2XDSSXFM24ZMKWIXQ@3\windows-jdk7-m3.5.x_build\maven-plugin-plugin\target\invoker-reports\BUILD-ant-since-maven-plugin.xml, f:\jenkins\jenkins-slave\workspace\x_maven-plugin-tools_master-XKS4EHY3PSXHGP4DHIXUDAAM6TMAKT3YNFP2XDSSXFM24ZMKWIXQ@3\windows-jdk7-m3.5.x_build\maven-plugin-plugin\target\invoker-reports\BUILD-asm-failure.xml, f:\jenkins\jenkins-slave\workspace\x_maven-plugin-tools_master-XKS4EHY3PSXHGP4DHIXUDAAM6TMAKT3YNFP2XDSSXFM24ZMKWIXQ@3\windows-jdk7-m3.5.x_build\maven-plugin-plugin\target\invoker-reports\BUILD-beanshell-simple.xml, f:\jenkins\jenkins-slave\workspace\x_maven-plugin-tools_master-XKS4EHY3PSXHGP4DHIXUDAAM6TMAKT3YNFP2XDSSXFM24ZMKWIXQ@3\windows-jdk7-m3.5.x_build\maven-plugin-plugin\target\invoker-reports\BUILD-fix-maven-since-3.x.xml, f:\jenkins\jenkins-slave\workspace\x_maven-plugin-tools_master-XKS4EHY3PSXHGP4DHIXUDAAM6TMAKT3YNFP2XDSSXFM24ZMKWIXQ@3\windows-jdk7-m3.5.x_build\maven-plugin-plugin\target\invoker-reports\BUILD-help-basic-jdk11.xml, f:\jenkins\jenkins-slave\workspace\x_maven-plugin-tools_master-XKS4EHY3PSXHGP4DHIXUDAAM6TMAKT3YNFP2XDSSXFM24ZMKWIXQ@3\windows-jdk7-m3.5.x_build\maven-plugin-plugin\target\invoker-reports\BUILD-help-basic.xml, f:\jenkins\jenkins-slave\workspace\x_maven-plugin-tools_master-XKS4EHY3PSXHGP4DHIXUDAAM6TMAKT3YNFP2XDSSXFM24ZMKWIXQ@3\windows-jdk7-m3.5.x_build\maven-plugin-plugin\target\invoker-reports\BUILD-help-package.xml, f:\jenkins\jenkins-slave\workspace\x_maven-plugin-tools_master-XKS4EHY3PSXHGP4DHIXUDAAM6TMAKT3YNFP2XDSSXFM24ZMKWIXQ@3\windows-jdk7-m3.5.x_build\maven-plugin-plugin\target\invoker-reports\BUILD-ignore-plugin-class-realm.xml, f:\jenkins\jenkins-slave\workspace\x_maven-plugin-tools_master-XKS4EHY3PSXHGP4DHIXUDAAM6TMAKT3YNFP2XDSSXFM24ZMKWIXQ@3\windows-jdk7-m3.5.x_build\maven-plugin-plugin\target\invoker-reports\BUILD-java-basic-annotations-jdk11.xml, f:\jenkins\jenkins-slave\workspace\x_maven-plugin-tools_master-XKS4EHY3PSXHGP4DHIXUDAAM6TMAKT3YNFP2XDSSXFM24ZMKWIXQ@3\windows-jdk7-m3.5.x_build\maven-plugin-plugin\target\invoker-reports\BUILD-java-basic-annotations-jdk8.xml, f:\jenkins\jenkins-slave\workspace\x_maven-plugin-tools_master-XKS4EHY3PSXHGP4DHIXUDAAM6TMAKT3YNFP2XDSSXFM24ZMKWIXQ@3\windows-jdk7-m3.5.x_build\maven-plugin-plugin\target\invoker-reports\BUILD-java-basic-annotations.xml, f:\jenkins\jenkins-slave\workspace\x_maven-plugin-tools_master-XKS4EHY3PSXHGP4DHIXUDAAM6TMAKT3YNFP2XDSSXFM24ZMKWIXQ@3\windows-jdk7-m3.5.x_build\maven-plugin-plugin\target\invoker-reports\BUILD-java-basic.xml, f:\jenkins\jenkins-slave\workspace\x_maven-plugin-tools_master-XKS4EHY3PSXHGP4DHIXUDAAM6TMAKT3YNFP2XDSSXFM24ZMKWIXQ@3\windows-jdk7-m3.5.x_build\maven-plugin-plugin\target\invoker-reports\BUILD-mplugin-187.xml, f:\jenkins\jenkins-slave\workspace\x_maven-plugin-tools_master-XKS4EHY3PSXHGP4DHIXUDAAM6TMAKT3YNFP2XDSSXFM24ZMKWIXQ@3\windows-jdk7-m3.5.x_build\maven-plugin-plugin\target\invoker-reports\BUILD-mplugin-191.xml, f:\jenkins\jenkins-slave\workspace\x_maven-plugin-tools_master-XKS4EHY3PSXHGP4DHIXUDAAM6TMAKT3YNFP2XDSSXFM24ZMKWIXQ@3\windows-jdk7-m3.5.x_build\maven-plugin-plugin\target\invoker-reports\BUILD-mplugin-223.xml, f:\jenkins\jenkins-slave\workspace\x_maven-plugin-tools_master-XKS4EHY3PSXHGP4DHIXUDAAM6TMAKT3YNFP2XDSSXFM24ZMKWIXQ@3\windows-jdk7-m3.5.x_build\maven-plugin-plugin\target\invoker-reports\BUILD-mplugin-272_java8.xml, f:\jenkins\jenkins-slave\workspace\x_maven-plugin-tools_master-XKS4EHY3PSXHGP4DHIXUDAAM6TMAKT3YNFP2XDSSXFM24ZMKWIXQ@3\windows-jdk7-m3.5.x_build\maven-plugin-plugin\target\invoker-reports\BUILD-mplugin-299_no-configuration.xml, f:\jenkins\jenkins-slave\workspace\x_maven-plugin-tools_master-XKS4EHY3PSXHGP4DHIXUDAAM6TMAKT3YNFP2XDSSXFM24ZMKWIXQ@3\windows-jdk7-m3.5.x_build\maven-plugin-plugin\target\invoker-reports\BUILD-mplugin-305_defaultMojoDependencies.xml, f:\jenkins\jenkins-slave\workspace\x_maven-plugin-tools_master-XKS4EHY3PSXHGP4DHIXUDAAM6TMAKT3YNFP2XDSSXFM24ZMKWIXQ@3\windows-jdk7-m3.5.x_build\maven-plugin-plugin\target\invoker-reports\BUILD-mplugin-305_emptyMojoDependencies.xml, f:\jenkins\jenkins-slave\workspace\x_maven-plugin-tools_master-XKS4EHY3PSXHGP4DHIXUDAAM6TMAKT3YNFP2XDSSXFM24ZMKWIXQ@3\windows-jdk7-m3.5.x_build\maven-plugin-plugin\target\invoker-reports\BUILD-mplugin-305_singleMojoDependencies.xml, f:\jenkins\jenkins-slave\workspace\x_maven-plugin-tools_master-XKS4EHY3PSXHGP4DHIXUDAAM6TMAKT3YNFP2XDSSXFM24ZMKWIXQ@3\windows-jdk7-m3.5.x_build\maven-plugin-plugin\target\invoker-reports\BUILD-mplugin-319_report-since.xml, f:\jenkins\jenkins-slave\workspace\x_maven-plugin-tools_master-XKS4EHY3PSXHGP4DHIXUDAAM6TMAKT3YNFP2XDSSXFM24ZMKWIXQ@3\windows-jdk7-m3.5.x_build\maven-plugin-plugin\target\invoker-reports\BUILD-mplugin-324_javadoc.xml, f:\jenkins\jenkins-slave\workspace\x_maven-plugin-tools_master-XKS4EHY3PSXHGP4DHIXUDAAM6TMAKT3YNFP2XDSSXFM24ZMKWIXQ@3\windows-jdk7-m3.5.x_build\maven-plugin-plugin\target\invoker-reports\BUILD-packaging-jar.xml, f:\jenkins\jenkins-slave\workspace\x_maven-plugin-tools_master-XKS4EHY3PSXHGP4DHIXUDAAM6TMAKT3YNFP2XDSSXFM24ZMKWIXQ@3\windows-jdk7-m3.5.x_build\maven-plugin-plugin\target\invoker-reports\BUILD-plugin-info-jdk-default-version.xml, f:\jenkins\jenkins-slave\workspace\x_maven-plugin-tools_master-XKS4EHY3PSXHGP4DHIXUDAAM6TMAKT3YNFP2XDSSXFM24ZMKWIXQ@3\windows-jdk7-m3.5.x_build\maven-plugin-plugin\target\invoker-reports\BUILD-plugin-info-jdk.xml, f:\jenkins\jenkins-slave\workspace\x_maven-plugin-tools_master-XKS4EHY3PSXHGP4DHIXUDAAM6TMAKT3YNFP2XDSSXFM24ZMKWIXQ@3\windows-jdk7-m3.5.x_build\maven-plugin-plugin\target\invoker-reports\BUILD-plugin-report-annotations.xml, f:\jenkins\jenkins-slave\workspace\x_maven-plugin-tools_master-XKS4EHY3PSXHGP4DHIXUDAAM6TMAKT3YNFP2XDSSXFM24ZMKWIXQ@3\windows-jdk7-m3.5.x_build\maven-plugin-plugin\target\invoker-reports\BUILD-plugin-report.xml, f:\jenkins\jenkins-slave\workspace\x_maven-plugin-tools_master-XKS4EHY3PSXHGP4DHIXUDAAM6TMAKT3YNFP2XDSSXFM24ZMKWIXQ@3\windows-jdk7-m3.5.x_build\maven-plugin-plugin\target\invoker-reports\BUILD-skip.xml, f:\jenkins\jenkins-slave\workspace\x_maven-plugin-tools_master-XKS4EHY3PSXHGP4DHIXUDAAM6TMAKT3YNFP2XDSSXFM24ZMKWIXQ@3\windows-jdk7-m3.5.x_build\maven-plugin-plugin\target\invoker-reports\BUILD-source-encoding.xml]
[windows-jdk7-m3.5.x_build] Found logs:[f:\jenkins\jenkins-slave\workspace\x_maven-plugin-tools_master-XKS4EHY3PSXHGP4DHIXUDAAM6TMAKT3YNFP2XDSSXFM24ZMKWIXQ@3\windows-jdk7-m3.5.x_build\maven-plugin-plugin\target\it\annotation-with-inheritance-from-deps\build.log, f:\jenkins\jenkins-slave\workspace\x_maven-plugin-tools_master-XKS4EHY3PSXHGP4DHIXUDAAM6TMAKT3YNFP2XDSSXFM24ZMKWIXQ@3\windows-jdk7-m3.5.x_build\maven-plugin-plugin\target\it\annotation-with-inheritance-reactor\build.log, f:\jenkins\jenkins-slave\workspace\x_maven-plugin-tools_master-XKS4EHY3PSXHGP4DHIXUDAAM6TMAKT3YNFP2XDSSXFM24ZMKWIXQ@3\windows-jdk7-m3.5.x_build\maven-plugin-plugin\target\it\annotation-with-inheritance\build.log, f:\jenkins\jenkins-slave\workspace\x_maven-plugin-tools_master-XKS4EHY3PSXHGP4DHIXUDAAM6TMAKT3YNFP2XDSSXFM24ZMKWIXQ@3\windows-jdk7-m3.5.x_build\maven-plugin-plugin\target\it\ant-basic\build.log, f:\jenkins\jenkins-slave\workspace\x_maven-plugin-tools_master-XKS4EHY3PSXHGP4DHIXUDAAM6TMAKT3YNFP2XDSSXFM24ZMKWIXQ@3\windows-jdk7-m3.5.x_build\maven-plugin-plugin\target\it\ant-reference-parameter\build.log, f:\jenkins\jenkins-slave\workspace\x_maven-plugin-tools_master-XKS4EHY3PSXHGP4DHIXUDAAM6TMAKT3YNFP2XDSSXFM24ZMKWIXQ@3\windows-jdk7-m3.5.x_build\maven-plugin-plugin\target\it\ant-simple-usage\build.log, f:\jenkins\jenkins-slave\workspace\x_maven-plugin-tools_master-XKS4EHY3PSXHGP4DHIXUDAAM6TMAKT3YNFP2XDSSXFM24ZMKWIXQ@3\windows-jdk7-m3.5.x_build\maven-plugin-plugin\target\it\ant-since-maven-plugin\build.log, f:\jenkins\jenkins-slave\workspace\x_maven-plugin-tools_master-XKS4EHY3PSXHGP4DHIXUDAAM6TMAKT3YNFP2XDSSXFM24ZMKWIXQ@3\windows-jdk7-m3.5.x_build\maven-plugin-plugin\target\it\asm-failure\build.log, f:\jenkins\jenkins-slave\workspace\x_maven-plugin-tools_master-XKS4EHY3PSXHGP4DHIXUDAAM6TMAKT3YNFP2XDSSXFM24ZMKWIXQ@3\windows-jdk7-m3.5.x_build\maven-plugin-plugin\target\it\beanshell-simple\build.log, f:\jenkins\jenkins-slave\workspace\x_maven-plugin-tools_master-XKS4EHY3PSXHGP4DHIXUDAAM6TMAKT3YNFP2XDSSXFM24ZMKWIXQ@3\windows-jdk7-m3.5.x_build\maven-plugin-plugin\target\it\fix-maven-since-3.x\build.log, f:\jenkins\jenkins-slave\workspace\x_maven-plugin-tools_master-XKS4EHY3PSXHGP4DHIXUDAAM6TMAKT3YNFP2XDSSXFM24ZMKWIXQ@3\windows-jdk7-m3.5.x_build\maven-plugin-plugin\target\it\help-basic\build.log, f:\jenkins\jenkins-slave\workspace\x_maven-plugin-tools_master-XKS4EHY3PSXHGP4DHIXUDAAM6TMAKT3YNFP2XDSSXFM24ZMKWIXQ@3\windows-jdk7-m3.5.x_build\maven-plugin-plugin\target\it\help-package\build.log, f:\jenkins\jenkins-slave\workspace\x_maven-plugin-tools_master-XKS4EHY3PSXHGP4DHIXUDAAM6TMAKT3YNFP2XDSSXFM24ZMKWIXQ@3\windows-jdk7-m3.5.x_build\maven-plugin-plugin\target\it\ignore-plugin-class-realm\build.log, f:\jenkins\jenkins-slave\workspace\x_maven-plugin-tools_master-XKS4EHY3PSXHGP4DHIXUDAAM6TMAKT3YNFP2XDSSXFM24ZMKWIXQ@3\windows-jdk7-m3.5.x_build\maven-plugin-plugin\target\it\java-basic-annotations\build.log, f:\jenkins\jenkins-slave\workspace\x_maven-plugin-tools_master-XKS4EHY3PSXHGP4DHIXUDAAM6TMAKT3YNFP2XDSSXFM24ZMKWIXQ@3\windows-jdk7-m3.5.x_build\maven-plugin-plugin\target\it\java-basic\build.log, f:\jenkins\jenkins-slave\workspace\x_maven-plugin-tools_master-XKS4EHY3PSXHGP4DHIXUDAAM6TMAKT3YNFP2XDSSXFM24ZMKWIXQ@3\windows-jdk7-m3.5.x_build\maven-plugin-plugin\target\it\mplugin-187\build.log, f:\jenkins\jenkins-slave\workspace\x_maven-plugin-tools_master-XKS4EHY3PSXHGP4DHIXUDAAM6TMAKT3YNFP2XDSSXFM24ZMKWIXQ@3\windows-jdk7-m3.5.x_build\maven-plugin-plugin\target\it\mplugin-191\build.log, f:\jenkins\jenkins-slave\workspace\x_maven-plugin-tools_master-XKS4EHY3PSXHGP4DHIXUDAAM6TMAKT3YNFP2XDSSXFM24ZMKWIXQ@3\windows-jdk7-m3.5.x_build\maven-plugin-plugin\target\it\mplugin-223\build.log, f:\jenkins\jenkins-slave\workspace\x_maven-plugin-tools_master-XKS4EHY3PSXHGP4DHIXUDAAM6TMAKT3YNFP2XDSSXFM24ZMKWIXQ@3\windows-jdk7-m3.5.x_build\maven-plugin-plugin\target\it\mplugin-299_no-configuration\build.log, f:\jenkins\jenkins-slave\workspace\x_maven-plugin-tools_master-XKS4EHY3PSXHGP4DHIXUDAAM6TMAKT3YNFP2XDSSXFM24ZMKWIXQ@3\windows-jdk7-m3.5.x_build\maven-plugin-plugin\target\it\mplugin-305_defaultMojoDependencies\build.log, f:\jenkins\jenkins-slave\workspace\x_maven-plugin-tools_master-XKS4EHY3PSXHGP4DHIXUDAAM6TMAKT3YNFP2XDSSXFM24ZMKWIXQ@3\windows-jdk7-m3.5.x_build\maven-plugin-plugin\target\it\mplugin-305_emptyMojoDependencies\build.log, f:\jenkins\jenkins-slave\workspace\x_maven-plugin-tools_master-XKS4EHY3PSXHGP4DHIXUDAAM6TMAKT3YNFP2XDSSXFM24ZMKWIXQ@3\windows-jdk7-m3.5.x_build\maven-plugin-plugin\target\it\mplugin-305_singleMojoDependencies\build.log, f:\jenkins\jenkins-slave\workspace\x_maven-plugin-tools_master-XKS4EHY3PSXHGP4DHIXUDAAM6TMAKT3YNFP2XDSSXFM24ZMKWIXQ@3\windows-jdk7-m3.5.x_build\maven-plugin-plugin\target\it\mplugin-319_report-since\build.log, f:\jenkins\jenkins-slave\workspace\x_maven-plugin-tools_master-XKS4EHY3PSXHGP4DHIXUDAAM6TMAKT3YNFP2XDSSXFM24ZMKWIXQ@3\windows-jdk7-m3.5.x_build\maven-plugin-plugin\target\it\mplugin-324_javadoc\build.log, f:\jenkins\jenkins-slave\workspace\x_maven-plugin-tools_master-XKS4EHY3PSXHGP4DHIXUDAAM6TMAKT3YNFP2XDSSXFM24ZMKWIXQ@3\windows-jdk7-m3.5.x_build\maven-plugin-plugin\target\it\packaging-jar\build.log, f:\jenkins\jenkins-slave\workspace\x_maven-plugin-tools_master-XKS4EHY3PSXHGP4DHIXUDAAM6TMAKT3YNFP2XDSSXFM24ZMKWIXQ@3\windows-jdk7-m3.5.x_build\maven-plugin-plugin\target\it\plugin-info-jdk-default-version\build.log, f:\jenkins\jenkins-slave\workspace\x_maven-plugin-tools_master-XKS4EHY3PSXHGP4DHIXUDAAM6TMAKT3YNFP2XDSSXFM24ZMKWIXQ@3\windows-jdk7-m3.5.x_build\maven-plugin-plugin\target\it\plugin-info-jdk\build.log, f:\jenkins\jenkins-slave\workspace\x_maven-plugin-tools_master-XKS4EHY3PSXHGP4DHIXUDAAM6TMAKT3YNFP2XDSSXFM24ZMKWIXQ@3\windows-jdk7-m3.5.x_build\maven-plugin-plugin\target\it\plugin-report-annotations\build.log, f:\jenkins\jenkins-slave\workspace\x_maven-plugin-tools_master-XKS4EHY3PSXHGP4DHIXUDAAM6TMAKT3YNFP2XDSSXFM24ZMKWIXQ@3\windows-jdk7-m3.5.x_build\maven-plugin-plugin\target\it\plugin-report\build.log, f:\jenkins\jenkins-slave\workspace\x_maven-plugin-tools_master-XKS4EHY3PSXHGP4DHIXUDAAM6TMAKT3YNFP2XDSSXFM24ZMKWIXQ@3\windows-jdk7-m3.5.x_build\maven-plugin-plugin\target\it\skip\build.log, f:\jenkins\jenkins-slave\workspace\x_maven-plugin-tools_master-XKS4EHY3PSXHGP4DHIXUDAAM6TMAKT3YNFP2XDSSXFM24ZMKWIXQ@3\windows-jdk7-m3.5.x_build\maven-plugin-plugin\target\it\source-encoding\build.log]
[windows-jdk7-m3.5.x_build] Finished parsing Maven Invoker results (found 35)
[windows-jdk7-m3.5.x_build] [withMaven] junitPublisher - Archive test results for Maven artifact org.apache.maven.plugin-tools:maven-plugin-tools-api:3.6.0-SNAPSHOT generated by maven-surefire-plugin:test (default-test): windows-jdk7-m3.5.x_build\maven-plugin-tools-api\target\surefire-reports\*.xml
[windows-jdk7-m3.5.x_build] Recording test results
[windows-jdk7-m3.5.x_build] [withMaven] junitPublisher - Archive test results for Maven artifact org.apache.maven.plugin-tools:maven-plugin-tools-generators:3.6.0-SNAPSHOT generated by maven-surefire-plugin:test (default-test): windows-jdk7-m3.5.x_build\maven-plugin-tools-generators\target\surefire-reports\*.xml
[windows-jdk7-m3.5.x_build] Recording test results
[windows-jdk7-m3.5.x_build] [withMaven] junitPublisher - Archive test results for Maven artifact org.apache.maven.plugin-tools:maven-plugin-tools-java:3.6.0-SNAPSHOT generated by maven-surefire-plugin:test (default-test): windows-jdk7-m3.5.x_build\maven-plugin-tools-java\target\surefire-reports\*.xml
[windows-jdk7-m3.5.x_build] Recording test results
[windows-jdk7-m3.5.x_build] [withMaven] junitPublisher - Archive test results for Maven artifact org.apache.maven.plugin-tools:maven-plugin-annotations:3.6.0-SNAPSHOT generated by maven-surefire-plugin:test (default-test): windows-jdk7-m3.5.x_build\maven-plugin-annotations\target\surefire-reports\*.xml
[windows-jdk7-m3.5.x_build] Recording test results
[windows-jdk7-m3.5.x_build] None of the test reports contained any result
[windows-jdk7-m3.5.x_build] [withMaven] junitPublisher - Archive test results for Maven artifact org.apache.maven.plugin-tools:maven-plugin-tools-annotations:3.6.0-SNAPSHOT generated by maven-surefire-plugin:test (default-test): windows-jdk7-m3.5.x_build\maven-plugin-tools-annotations\target\surefire-reports\*.xml
[windows-jdk7-m3.5.x_build] Recording test results
[windows-jdk7-m3.5.x_build] [withMaven] junitPublisher - Archive test results for Maven artifact org.apache.maven.plugin-tools:maven-plugin-tools-model:3.6.0-SNAPSHOT generated by maven-surefire-plugin:test (default-test): windows-jdk7-m3.5.x_build\maven-script\maven-plugin-tools-model\target\surefire-reports\*.xml
[windows-jdk7-m3.5.x_build] Recording test results
[windows-jdk7-m3.5.x_build] [withMaven] junitPublisher - Archive test results for Maven artifact org.apache.maven.plugin-tools:maven-plugin-tools-ant:3.6.0-SNAPSHOT generated by maven-surefire-plugin:test (default-test): windows-jdk7-m3.5.x_build\maven-script\maven-plugin-tools-ant\target\surefire-reports\*.xml
[windows-jdk7-m3.5.x_build] Recording test results
[windows-jdk7-m3.5.x_build] [withMaven] junitPublisher - Archive test results for Maven artifact org.apache.maven.plugin-tools:maven-script-ant:3.6.0-SNAPSHOT generated by maven-surefire-plugin:test (default-test): windows-jdk7-m3.5.x_build\maven-script\maven-script-ant\target\surefire-reports\*.xml
[windows-jdk7-m3.5.x_build] Recording test results
[windows-jdk7-m3.5.x_build] [withMaven] junitPublisher - Archive test results for Maven artifact org.apache.maven.plugin-tools:maven-plugin-tools-beanshell:3.6.0-SNAPSHOT generated by maven-surefire-plugin:test (default-test): windows-jdk7-m3.5.x_build\maven-script\maven-plugin-tools-beanshell\target\surefire-reports\*.xml
[windows-jdk7-m3.5.x_build] Recording test results
[windows-jdk7-m3.5.x_build] None of the test reports contained any result
[windows-jdk7-m3.5.x_build] [withMaven] junitPublisher - Archive test results for Maven artifact org.apache.maven.plugin-tools:maven-script-beanshell:3.6.0-SNAPSHOT generated by maven-surefire-plugin:test (default-test): windows-jdk7-m3.5.x_build\maven-script\maven-script-beanshell\target\surefire-reports\*.xml
[windows-jdk7-m3.5.x_build] Recording test results
[windows-jdk7-m3.5.x_build] None of the test reports contained any result
[windows-jdk7-m3.5.x_build] [withMaven] junitPublisher - Archive test results for Maven artifact org.apache.maven.plugins:maven-plugin-plugin:3.6.0-SNAPSHOT generated by maven-surefire-plugin:test (default-test): windows-jdk7-m3.5.x_build\maven-plugin-plugin\target\surefire-reports\*.xml
[windows-jdk7-m3.5.x_build] Recording test results
[windows-jdk7-m3.5.x_build] None of the test reports contained any result
[windows-jdk7-m3.5.x_build] [withMaven] openTasksPublisher - Scan Tasks for Maven artifact org.apache.maven.plugin-tools:maven-plugin-tools-api:3.6.0-SNAPSHOT in source directory windows-jdk7-m3.5.x_build\maven-plugin-tools-api\src\main\java
[windows-jdk7-m3.5.x_build] [withMaven] openTasksPublisher - Scan Tasks for Maven artifact org.apache.maven.plugin-tools:maven-plugin-tools-generators:3.6.0-SNAPSHOT in source directory windows-jdk7-m3.5.x_build\maven-plugin-tools-generators\src\main\java
[windows-jdk7-m3.5.x_build] [withMaven] openTasksPublisher - Scan Tasks for Maven artifact org.apache.maven.plugin-tools:maven-plugin-tools-java:3.6.0-SNAPSHOT in source directory windows-jdk7-m3.5.x_build\maven-plugin-tools-java\src\main\java
[windows-jdk7-m3.5.x_build] [withMaven] openTasksPublisher - Scan Tasks for Maven artifact org.apache.maven.plugin-tools:maven-plugin-annotations:3.6.0-SNAPSHOT in source directory windows-jdk7-m3.5.x_build\maven-plugin-annotations\src\main\java
[windows-jdk7-m3.5.x_build] [withMaven] openTasksPublisher - Scan Tasks for Maven artifact org.apache.maven.plugin-tools:maven-plugin-tools-annotations:3.6.0-SNAPSHOT in source directory windows-jdk7-m3.5.x_build\maven-plugin-tools-annotations\src\main\java
[windows-jdk7-m3.5.x_build] [withMaven] openTasksPublisher - Scan Tasks for Maven artifact org.apache.maven.plugin-tools:maven-plugin-tools-model:3.6.0-SNAPSHOT in source directory windows-jdk7-m3.5.x_build\maven-script\maven-plugin-tools-model\src\main\java
[windows-jdk7-m3.5.x_build] [withMaven] openTasksPublisher - Scan Tasks for Maven artifact org.apache.maven.plugin-tools:maven-plugin-tools-ant:3.6.0-SNAPSHOT in source directory windows-jdk7-m3.5.x_build\maven-script\maven-plugin-tools-ant\src\main\java
[windows-jdk7-m3.5.x_build] [withMaven] openTasksPublisher - Scan Tasks for Maven artifact org.apache.maven.plugin-tools:maven-script-ant:3.6.0-SNAPSHOT in source directory windows-jdk7-m3.5.x_build\maven-script\maven-script-ant\src\main\java
[windows-jdk7-m3.5.x_build] [withMaven] openTasksPublisher - Scan Tasks for Maven artifact org.apache.maven.plugin-tools:maven-plugin-tools-beanshell:3.6.0-SNAPSHOT in source directory windows-jdk7-m3.5.x_build\maven-script\maven-plugin-tools-beanshell\src\main\java
[windows-jdk7-m3.5.x_build] [withMaven] openTasksPublisher - Scan Tasks for Maven artifact org.apache.maven.plugin-tools:maven-script-beanshell:3.6.0-SNAPSHOT in source directory windows-jdk7-m3.5.x_build\maven-script\maven-script-beanshell\src\main\java
[windows-jdk7-m3.5.x_build] [withMaven] openTasksPublisher - Scan Tasks for Maven artifact org.apache.maven.plugins:maven-plugin-plugin:3.6.0-SNAPSHOT in source directory windows-jdk7-m3.5.x_build\maven-plugin-plugin\src\main\java
[windows-jdk7-m3.5.x_build] [TASKS] Scanning folder 'f:\jenkins\jenkins-slave\workspace\x_maven-plugin-tools_master-XKS4EHY3PSXHGP4DHIXUDAAM6TMAKT3YNFP2XDSSXFM24ZMKWIXQ@3' for files matching the pattern 'windows-jdk7-m3.5.x_build\maven-plugin-tools-api\src\main\java\**\*,windows-jdk7-m3.5.x_build\maven-plugin-tools-generators\src\main\java\**\*,windows-jdk7-m3.5.x_build\maven-plugin-tools-java\src\main\java\**\*,windows-jdk7-m3.5.x_build\maven-plugin-annotations\src\main\java\**\*,windows-jdk7-m3.5.x_build\maven-plugin-tools-annotations\src\main\java\**\*,windows-jdk7-m3.5.x_build\maven-script\maven-plugin-tools-model\src\main\java\**\*,windows-jdk7-m3.5.x_build\maven-script\maven-plugin-tools-ant\src\main\java\**\*,windows-jdk7-m3.5.x_build\maven-script\maven-script-ant\src\main\java\**\*,windows-jdk7-m3.5.x_build\maven-script\maven-plugin-tools-beanshell\src\main\java\**\*,windows-jdk7-m3.5.x_build\maven-script\maven-script-beanshell\src\main\java\**\*,windows-jdk7-m3.5.x_build\maven-plugin-plugin\src\main\java\**\*' - excludes: null
[windows-jdk7-m3.5.x_build] [TASKS] Found 52 files to scan for tasks
[windows-jdk7-m3.5.x_build] [TASKS] Found 11 open tasks.
[windows-jdk7-m3.5.x_build] Skipping warnings blame since pipelines do not have an SCM link.%n
[windows-jdk7-m3.5.x_build] [TASKS] Computing warning deltas based on reference build #47
[Pipeline] [windows-jdk7-m3.5.x_build] // withMaven
[Pipeline] [windows-jdk7-m3.5.x_build] cleanWs
[windows-jdk7-m3.5.x_build] [WS-CLEANUP] Deleting project workspace...[WS-CLEANUP] done
[Pipeline] [windows-jdk7-m3.5.x_build] }
[Pipeline] [windows-jdk7-m3.5.x_build] // stage
[Pipeline] [windows-jdk7-m3.5.x_build] }
[Pipeline] [windows-jdk7-m3.5.x_build] // ws
[Pipeline] [windows-jdk7-m3.5.x_build] }
[Pipeline] [windows-jdk7-m3.5.x_build] // node
[Pipeline] [windows-jdk7-m3.5.x_build] }
[windows-jdk11-m3.5.x_build] [INFO] run post-build script verify.groovy
[windows-jdk11-m3.5.x_build] [INFO]           plugin-info-jdk\pom.xml .......................... SUCCESS (110.5 s)
[windows-jdk11-m3.5.x_build] [INFO] Building: plugin-info-jdk-default-version\pom.xml
[windows-jdk11-m3.5.x_build] [INFO] run post-build script verify.groovy
[windows-jdk11-m3.5.x_build] [INFO]           plugin-info-jdk-default-version\pom.xml .......... SUCCESS (34.1 s)
[windows-jdk11-m3.5.x_build] [INFO] Building: plugin-report\pom.xml
[windows-jdk11-m3.5.x_build] [INFO] run post-build script verify.bsh
[windows-jdk11-m3.5.x_build] [INFO]           plugin-report\pom.xml ............................ SUCCESS (98.5 s)
[windows-jdk11-m3.5.x_build] [INFO] Building: plugin-report-annotations\pom.xml
[windows-jdk11-m3.5.x_build] [INFO] run post-build script verify.bsh
[windows-jdk11-m3.5.x_build] [INFO]           plugin-report-annotations\pom.xml ................ SUCCESS (15.8 s)
[windows-jdk11-m3.5.x_build] [INFO] Building: skip\pom.xml
[windows-jdk11-m3.5.x_build] [INFO] run post-build script verify.groovy
[windows-jdk11-m3.5.x_build] [INFO]           skip\pom.xml ..................................... SUCCESS (4.2 s)
[windows-jdk11-m3.5.x_build] [INFO] Building: source-encoding\pom.xml
[windows-jdk11-m3.5.x_build] [INFO] run post-build script verify.groovy
[windows-jdk11-m3.5.x_build] [INFO]           source-encoding\pom.xml .......................... SUCCESS (4.3 s)
[windows-jdk11-m3.5.x_build] [INFO] -------------------------------------------------
[windows-jdk11-m3.5.x_build] [INFO] Build Summary:
[windows-jdk11-m3.5.x_build] [INFO]   Passed: 34, Failed: 1, Errors: 0, Skipped: 0
[windows-jdk11-m3.5.x_build] [INFO] -------------------------------------------------
[windows-jdk11-m3.5.x_build] [WARNING] The following builds failed:
[windows-jdk11-m3.5.x_build] [WARNING] *  asm-failure\pom.xml
[windows-jdk11-m3.5.x_build] [INFO] -------------------------------------------------
[windows-jdk11-m3.5.x_build] [WARNING] Ignoring that 1 build failed.
[windows-jdk11-m3.5.x_build] [INFO] 
[windows-jdk11-m3.5.x_build] [INFO] --- maven-checkstyle-plugin:3.0.0:check (checkstyle-check) @ maven-plugin-plugin ---
[windows-jdk11-m3.5.x_build] [INFO] ------------------------------------------------------------------------
[windows-jdk11-m3.5.x_build] [INFO] Reactor Summary:
[windows-jdk11-m3.5.x_build] [INFO] 
[windows-jdk11-m3.5.x_build] [INFO] Maven Plugin Tools ................................. SUCCESS [02:38 min]
[windows-jdk11-m3.5.x_build] [INFO] Maven Plugin Tools Extractor API ................... SUCCESS [ 11.968 s]
[windows-jdk11-m3.5.x_build] [INFO] Maven Plugin Tools Generators ...................... SUCCESS [  8.461 s]
[windows-jdk11-m3.5.x_build] [INFO] Maven Plugin Tool for Java with Javadoc Tags ....... SUCCESS [  7.018 s]
[windows-jdk11-m3.5.x_build] [INFO] Maven Plugin Tools Java Annotations ................ SUCCESS [  0.944 s]
[windows-jdk11-m3.5.x_build] [INFO] Maven Plugin Tool for Java with Annotations ........ SUCCESS [  6.072 s]
[windows-jdk11-m3.5.x_build] [INFO] Maven Script Mojo Support .......................... SUCCESS [  0.357 s]
[windows-jdk11-m3.5.x_build] [INFO] Maven Plugin Metadata Model ........................ SUCCESS [  5.915 s]
[windows-jdk11-m3.5.x_build] [INFO] Maven Plugin Tool for Ant .......................... SUCCESS [ 12.334 s]
[windows-jdk11-m3.5.x_build] [INFO] Maven Ant Mojo Support ............................. SUCCESS [ 50.832 s]
[windows-jdk11-m3.5.x_build] [INFO] Maven Plugin Tool for Beanshell .................... SUCCESS [  9.739 s]
[windows-jdk11-m3.5.x_build] [INFO] Maven Beanshell Mojo Support ....................... SUCCESS [  8.406 s]
[windows-jdk11-m3.5.x_build] [INFO] Maven Plugin Plugin ................................ SUCCESS [28:07 min]
[windows-jdk11-m3.5.x_build] [INFO] ------------------------------------------------------------------------
[windows-jdk11-m3.5.x_build] [INFO] BUILD SUCCESS
[windows-jdk11-m3.5.x_build] [INFO] ------------------------------------------------------------------------
[windows-jdk11-m3.5.x_build] [INFO] Total time: 32:50 min
[windows-jdk11-m3.5.x_build] [INFO] Finished at: 2018-10-09T01:20:20Z
[windows-jdk11-m3.5.x_build] [INFO] Final Memory: 56M/197M
[windows-jdk11-m3.5.x_build] [INFO] ------------------------------------------------------------------------
[windows-jdk11-m3.5.x_build] [INFO] [jenkins-event-spy] Generated F:\jenkins\jenkins-slave\workspace\x_maven-plugin-tools_master-XKS4EHY3PSXHGP4DHIXUDAAM6TMAKT3YNFP2XDSSXFM24ZMKWIXQ@2@2@tmp\withMaven46eff65e\maven-spy-20181009-004730-551344821856867170525.log
[Pipeline] [windows-jdk11-m3.5.x_build] }
[Pipeline] [windows-jdk11-m3.5.x_build] // dir
[Pipeline] [windows-jdk11-m3.5.x_build] }
[windows-jdk11-m3.5.x_build] [withMaven] artifactsPublisher - Archive artifact windows-jdk11-m3.5.x_build\pom.xml under org\apache\maven\plugin-tools\maven-plugin-tools\3.6.0-SNAPSHOT\maven-plugin-tools-3.6.0-SNAPSHOT.pom
[windows-jdk11-m3.5.x_build] [withMaven] artifactsPublisher - Archive artifact windows-jdk11-m3.5.x_build\target\maven-plugin-tools-3.6.0-SNAPSHOT-site.xml under org\apache\maven\plugin-tools\maven-plugin-tools\3.6.0-SNAPSHOT\maven-plugin-tools-3.6.0-SNAPSHOT-site.xml
[windows-jdk11-m3.5.x_build] [withMaven] artifactsPublisher - Archive artifact windows-jdk11-m3.5.x_build\maven-plugin-tools-api\pom.xml under org\apache\maven\plugin-tools\maven-plugin-tools-api\3.6.0-SNAPSHOT\maven-plugin-tools-api-3.6.0-SNAPSHOT.pom
[windows-jdk11-m3.5.x_build] [withMaven] artifactsPublisher - Archive artifact windows-jdk11-m3.5.x_build\maven-plugin-tools-api\target\maven-plugin-tools-api-3.6.0-SNAPSHOT.jar under org\apache\maven\plugin-tools\maven-plugin-tools-api\3.6.0-SNAPSHOT\maven-plugin-tools-api-3.6.0-SNAPSHOT.jar
[windows-jdk11-m3.5.x_build] [withMaven] artifactsPublisher - Archive artifact windows-jdk11-m3.5.x_build\maven-plugin-tools-generators\pom.xml under org\apache\maven\plugin-tools\maven-plugin-tools-generators\3.6.0-SNAPSHOT\maven-plugin-tools-generators-3.6.0-SNAPSHOT.pom
[windows-jdk11-m3.5.x_build] [withMaven] artifactsPublisher - Archive artifact windows-jdk11-m3.5.x_build\maven-plugin-tools-generators\target\maven-plugin-tools-generators-3.6.0-SNAPSHOT.jar under org\apache\maven\plugin-tools\maven-plugin-tools-generators\3.6.0-SNAPSHOT\maven-plugin-tools-generators-3.6.0-SNAPSHOT.jar
[windows-jdk11-m3.5.x_build] [withMaven] artifactsPublisher - Archive artifact windows-jdk11-m3.5.x_build\maven-plugin-tools-java\pom.xml under org\apache\maven\plugin-tools\maven-plugin-tools-java\3.6.0-SNAPSHOT\maven-plugin-tools-java-3.6.0-SNAPSHOT.pom
[windows-jdk11-m3.5.x_build] [withMaven] artifactsPublisher - Archive artifact windows-jdk11-m3.5.x_build\maven-plugin-tools-java\target\maven-plugin-tools-java-3.6.0-SNAPSHOT.jar under org\apache\maven\plugin-tools\maven-plugin-tools-java\3.6.0-SNAPSHOT\maven-plugin-tools-java-3.6.0-SNAPSHOT.jar
[windows-jdk11-m3.5.x_build] [withMaven] artifactsPublisher - Archive artifact windows-jdk11-m3.5.x_build\maven-plugin-annotations\pom.xml under org\apache\maven\plugin-tools\maven-plugin-annotations\3.6.0-SNAPSHOT\maven-plugin-annotations-3.6.0-SNAPSHOT.pom
[windows-jdk11-m3.5.x_build] [withMaven] artifactsPublisher - Archive artifact windows-jdk11-m3.5.x_build\maven-plugin-annotations\target\maven-plugin-annotations-3.6.0-SNAPSHOT.jar under org\apache\maven\plugin-tools\maven-plugin-annotations\3.6.0-SNAPSHOT\maven-plugin-annotations-3.6.0-SNAPSHOT.jar
[windows-jdk11-m3.5.x_build] [withMaven] artifactsPublisher - Archive artifact windows-jdk11-m3.5.x_build\maven-plugin-tools-annotations\pom.xml under org\apache\maven\plugin-tools\maven-plugin-tools-annotations\3.6.0-SNAPSHOT\maven-plugin-tools-annotations-3.6.0-SNAPSHOT.pom
[windows-jdk11-m3.5.x_build] [withMaven] artifactsPublisher - Archive artifact windows-jdk11-m3.5.x_build\maven-plugin-tools-annotations\target\maven-plugin-tools-annotations-3.6.0-SNAPSHOT.jar under org\apache\maven\plugin-tools\maven-plugin-tools-annotations\3.6.0-SNAPSHOT\maven-plugin-tools-annotations-3.6.0-SNAPSHOT.jar
[windows-jdk11-m3.5.x_build] [withMaven] artifactsPublisher - Archive artifact windows-jdk11-m3.5.x_build\maven-plugin-tools-annotations\target\maven-plugin-tools-annotations-3.6.0-SNAPSHOT-tests.jar under org\apache\maven\plugin-tools\maven-plugin-tools-annotations\3.6.0-SNAPSHOT\maven-plugin-tools-annotations-3.6.0-SNAPSHOT-tests.jar
[windows-jdk11-m3.5.x_build] [withMaven] artifactsPublisher - Archive artifact windows-jdk11-m3.5.x_build\maven-plugin-tools-annotations\target\maven-plugin-tools-annotations-3.6.0-SNAPSHOT-test-sources.jar under org\apache\maven\plugin-tools\maven-plugin-tools-annotations\3.6.0-SNAPSHOT\maven-plugin-tools-annotations-3.6.0-SNAPSHOT-test-sources.jar
[windows-jdk11-m3.5.x_build] [withMaven] artifactsPublisher - Archive artifact windows-jdk11-m3.5.x_build\maven-script\pom.xml under org\apache\maven\plugin-tools\maven-script\3.6.0-SNAPSHOT\maven-script-3.6.0-SNAPSHOT.pom
[windows-jdk11-m3.5.x_build] [withMaven] artifactsPublisher - Archive artifact windows-jdk11-m3.5.x_build\maven-script\target\maven-script-3.6.0-SNAPSHOT-site.xml under org\apache\maven\plugin-tools\maven-script\3.6.0-SNAPSHOT\maven-script-3.6.0-SNAPSHOT-site.xml
[windows-jdk11-m3.5.x_build] [withMaven] artifactsPublisher - Archive artifact windows-jdk11-m3.5.x_build\maven-script\maven-plugin-tools-model\pom.xml under org\apache\maven\plugin-tools\maven-plugin-tools-model\3.6.0-SNAPSHOT\maven-plugin-tools-model-3.6.0-SNAPSHOT.pom
[windows-jdk11-m3.5.x_build] [withMaven] artifactsPublisher - Archive artifact windows-jdk11-m3.5.x_build\maven-script\maven-plugin-tools-model\target\maven-plugin-tools-model-3.6.0-SNAPSHOT.jar under org\apache\maven\plugin-tools\maven-plugin-tools-model\3.6.0-SNAPSHOT\maven-plugin-tools-model-3.6.0-SNAPSHOT.jar
[windows-jdk11-m3.5.x_build] [withMaven] artifactsPublisher - Archive artifact windows-jdk11-m3.5.x_build\maven-script\maven-plugin-tools-ant\pom.xml under org\apache\maven\plugin-tools\maven-plugin-tools-ant\3.6.0-SNAPSHOT\maven-plugin-tools-ant-3.6.0-SNAPSHOT.pom
[windows-jdk11-m3.5.x_build] [withMaven] artifactsPublisher - Archive artifact windows-jdk11-m3.5.x_build\maven-script\maven-plugin-tools-ant\target\maven-plugin-tools-ant-3.6.0-SNAPSHOT.jar under org\apache\maven\plugin-tools\maven-plugin-tools-ant\3.6.0-SNAPSHOT\maven-plugin-tools-ant-3.6.0-SNAPSHOT.jar
[windows-jdk11-m3.5.x_build] [withMaven] artifactsPublisher - Archive artifact windows-jdk11-m3.5.x_build\maven-script\maven-script-ant\pom.xml under org\apache\maven\plugin-tools\maven-script-ant\3.6.0-SNAPSHOT\maven-script-ant-3.6.0-SNAPSHOT.pom
[windows-jdk11-m3.5.x_build] [withMaven] artifactsPublisher - Archive artifact windows-jdk11-m3.5.x_build\maven-script\maven-script-ant\target\maven-script-ant-3.6.0-SNAPSHOT.jar under org\apache\maven\plugin-tools\maven-script-ant\3.6.0-SNAPSHOT\maven-script-ant-3.6.0-SNAPSHOT.jar
[windows-jdk11-m3.5.x_build] [withMaven] artifactsPublisher - Archive artifact windows-jdk11-m3.5.x_build\maven-script\maven-plugin-tools-beanshell\pom.xml under org\apache\maven\plugin-tools\maven-plugin-tools-beanshell\3.6.0-SNAPSHOT\maven-plugin-tools-beanshell-3.6.0-SNAPSHOT.pom
[windows-jdk11-m3.5.x_build] [withMaven] artifactsPublisher - Archive artifact windows-jdk11-m3.5.x_build\maven-script\maven-plugin-tools-beanshell\target\maven-plugin-tools-beanshell-3.6.0-SNAPSHOT.jar under org\apache\maven\plugin-tools\maven-plugin-tools-beanshell\3.6.0-SNAPSHOT\maven-plugin-tools-beanshell-3.6.0-SNAPSHOT.jar
[windows-jdk11-m3.5.x_build] [withMaven] artifactsPublisher - Archive artifact windows-jdk11-m3.5.x_build\maven-script\maven-script-beanshell\pom.xml under org\apache\maven\plugin-tools\maven-script-beanshell\3.6.0-SNAPSHOT\maven-script-beanshell-3.6.0-SNAPSHOT.pom
[windows-jdk11-m3.5.x_build] [withMaven] artifactsPublisher - Archive artifact windows-jdk11-m3.5.x_build\maven-script\maven-script-beanshell\target\maven-script-beanshell-3.6.0-SNAPSHOT.jar under org\apache\maven\plugin-tools\maven-script-beanshell\3.6.0-SNAPSHOT\maven-script-beanshell-3.6.0-SNAPSHOT.jar
[windows-jdk11-m3.5.x_build] [withMaven] artifactsPublisher - Archive artifact windows-jdk11-m3.5.x_build\maven-plugin-plugin\pom.xml under org\apache\maven\plugins\maven-plugin-plugin\3.6.0-SNAPSHOT\maven-plugin-plugin-3.6.0-SNAPSHOT.pom
[windows-jdk11-m3.5.x_build] [withMaven] artifactsPublisher - Archive artifact windows-jdk11-m3.5.x_build\maven-plugin-plugin\target\maven-plugin-plugin-3.6.0-SNAPSHOT.jar under org\apache\maven\plugins\maven-plugin-plugin\3.6.0-SNAPSHOT\maven-plugin-plugin-3.6.0-SNAPSHOT.jar
[windows-jdk11-m3.5.x_build] [withMaven] invokerPublisher - Archive invoker results for Maven artifact MavenArtifact{org.apache.maven.plugins:maven-plugin-plugin::3.6.0-SNAPSHOT(version: 3.6.0-SNAPSHOT, snapshot:false) } generated by PluginInvocation{org.apache.maven.plugins:maven-invoker-plugin:3.0.1@run  integration-test}: windows-jdk11-m3.5.x_build\maven-plugin-plugin\target\invoker-reports\*.xml
[windows-jdk11-m3.5.x_build] performing MavenInvokerRecorder, reportsFilenamePattern:'**/windows-jdk11-m3.5.x_build\maven-plugin-plugin\target\invoker-reports/BUILD*.xml', invokerBuildDir:'**/windows-jdk11-m3.5.x_build\maven-plugin-plugin\target\it'
[windows-jdk11-m3.5.x_build] Found reports:[f:\jenkins\jenkins-slave\workspace\x_maven-plugin-tools_master-XKS4EHY3PSXHGP4DHIXUDAAM6TMAKT3YNFP2XDSSXFM24ZMKWIXQ@2@2\windows-jdk11-m3.5.x_build\maven-plugin-plugin\target\invoker-reports\BUILD-annotation-with-inheritance-from-deps.xml, f:\jenkins\jenkins-slave\workspace\x_maven-plugin-tools_master-XKS4EHY3PSXHGP4DHIXUDAAM6TMAKT3YNFP2XDSSXFM24ZMKWIXQ@2@2\windows-jdk11-m3.5.x_build\maven-plugin-plugin\target\invoker-reports\BUILD-annotation-with-inheritance-reactor.xml, f:\jenkins\jenkins-slave\workspace\x_maven-plugin-tools_master-XKS4EHY3PSXHGP4DHIXUDAAM6TMAKT3YNFP2XDSSXFM24ZMKWIXQ@2@2\windows-jdk11-m3.5.x_build\maven-plugin-plugin\target\invoker-reports\BUILD-annotation-with-inheritance.xml, f:\jenkins\jenkins-slave\workspace\x_maven-plugin-tools_master-XKS4EHY3PSXHGP4DHIXUDAAM6TMAKT3YNFP2XDSSXFM24ZMKWIXQ@2@2\windows-jdk11-m3.5.x_build\maven-plugin-plugin\target\invoker-reports\BUILD-ant-basic.xml, f:\jenkins\jenkins-slave\workspace\x_maven-plugin-tools_master-XKS4EHY3PSXHGP4DHIXUDAAM6TMAKT3YNFP2XDSSXFM24ZMKWIXQ@2@2\windows-jdk11-m3.5.x_build\maven-plugin-plugin\target\invoker-reports\BUILD-ant-reference-parameter.xml, f:\jenkins\jenkins-slave\workspace\x_maven-plugin-tools_master-XKS4EHY3PSXHGP4DHIXUDAAM6TMAKT3YNFP2XDSSXFM24ZMKWIXQ@2@2\windows-jdk11-m3.5.x_build\maven-plugin-plugin\target\invoker-reports\BUILD-ant-simple-usage.xml, f:\jenkins\jenkins-slave\workspace\x_maven-plugin-tools_master-XKS4EHY3PSXHGP4DHIXUDAAM6TMAKT3YNFP2XDSSXFM24ZMKWIXQ@2@2\windows-jdk11-m3.5.x_build\maven-plugin-plugin\target\invoker-reports\BUILD-ant-since-maven-plugin.xml, f:\jenkins\jenkins-slave\workspace\x_maven-plugin-tools_master-XKS4EHY3PSXHGP4DHIXUDAAM6TMAKT3YNFP2XDSSXFM24ZMKWIXQ@2@2\windows-jdk11-m3.5.x_build\maven-plugin-plugin\target\invoker-reports\BUILD-asm-failure.xml, f:\jenkins\jenkins-slave\workspace\x_maven-plugin-tools_master-XKS4EHY3PSXHGP4DHIXUDAAM6TMAKT3YNFP2XDSSXFM24ZMKWIXQ@2@2\windows-jdk11-m3.5.x_build\maven-plugin-plugin\target\invoker-reports\BUILD-beanshell-simple.xml, f:\jenkins\jenkins-slave\workspace\x_maven-plugin-tools_master-XKS4EHY3PSXHGP4DHIXUDAAM6TMAKT3YNFP2XDSSXFM24ZMKWIXQ@2@2\windows-jdk11-m3.5.x_build\maven-plugin-plugin\target\invoker-reports\BUILD-fix-maven-since-3.x.xml, f:\jenkins\jenkins-slave\workspace\x_maven-plugin-tools_master-XKS4EHY3PSXHGP4DHIXUDAAM6TMAKT3YNFP2XDSSXFM24ZMKWIXQ@2@2\windows-jdk11-m3.5.x_build\maven-plugin-plugin\target\invoker-reports\BUILD-help-basic-jdk11.xml, f:\jenkins\jenkins-slave\workspace\x_maven-plugin-tools_master-XKS4EHY3PSXHGP4DHIXUDAAM6TMAKT3YNFP2XDSSXFM24ZMKWIXQ@2@2\windows-jdk11-m3.5.x_build\maven-plugin-plugin\target\invoker-reports\BUILD-help-basic.xml, f:\jenkins\jenkins-slave\workspace\x_maven-plugin-tools_master-XKS4EHY3PSXHGP4DHIXUDAAM6TMAKT3YNFP2XDSSXFM24ZMKWIXQ@2@2\windows-jdk11-m3.5.x_build\maven-plugin-plugin\target\invoker-reports\BUILD-help-package.xml, f:\jenkins\jenkins-slave\workspace\x_maven-plugin-tools_master-XKS4EHY3PSXHGP4DHIXUDAAM6TMAKT3YNFP2XDSSXFM24ZMKWIXQ@2@2\windows-jdk11-m3.5.x_build\maven-plugin-plugin\target\invoker-reports\BUILD-ignore-plugin-class-realm.xml, f:\jenkins\jenkins-slave\workspace\x_maven-plugin-tools_master-XKS4EHY3PSXHGP4DHIXUDAAM6TMAKT3YNFP2XDSSXFM24ZMKWIXQ@2@2\windows-jdk11-m3.5.x_build\maven-plugin-plugin\target\invoker-reports\BUILD-java-basic-annotations-jdk11.xml, f:\jenkins\jenkins-slave\workspace\x_maven-plugin-tools_master-XKS4EHY3PSXHGP4DHIXUDAAM6TMAKT3YNFP2XDSSXFM24ZMKWIXQ@2@2\windows-jdk11-m3.5.x_build\maven-plugin-plugin\target\invoker-reports\BUILD-java-basic-annotations-jdk8.xml, f:\jenkins\jenkins-slave\workspace\x_maven-plugin-tools_master-XKS4EHY3PSXHGP4DHIXUDAAM6TMAKT3YNFP2XDSSXFM24ZMKWIXQ@2@2\windows-jdk11-m3.5.x_build\maven-plugin-plugin\target\invoker-reports\BUILD-java-basic-annotations.xml, f:\jenkins\jenkins-slave\workspace\x_maven-plugin-tools_master-XKS4EHY3PSXHGP4DHIXUDAAM6TMAKT3YNFP2XDSSXFM24ZMKWIXQ@2@2\windows-jdk11-m3.5.x_build\maven-plugin-plugin\target\invoker-reports\BUILD-java-basic.xml, f:\jenkins\jenkins-slave\workspace\x_maven-plugin-tools_master-XKS4EHY3PSXHGP4DHIXUDAAM6TMAKT3YNFP2XDSSXFM24ZMKWIXQ@2@2\windows-jdk11-m3.5.x_build\maven-plugin-plugin\target\invoker-reports\BUILD-mplugin-187.xml, f:\jenkins\jenkins-slave\workspace\x_maven-plugin-tools_master-XKS4EHY3PSXHGP4DHIXUDAAM6TMAKT3YNFP2XDSSXFM24ZMKWIXQ@2@2\windows-jdk11-m3.5.x_build\maven-plugin-plugin\target\invoker-reports\BUILD-mplugin-191.xml, f:\jenkins\jenkins-slave\workspace\x_maven-plugin-tools_master-XKS4EHY3PSXHGP4DHIXUDAAM6TMAKT3YNFP2XDSSXFM24ZMKWIXQ@2@2\windows-jdk11-m3.5.x_build\maven-plugin-plugin\target\invoker-reports\BUILD-mplugin-223.xml, f:\jenkins\jenkins-slave\workspace\x_maven-plugin-tools_master-XKS4EHY3PSXHGP4DHIXUDAAM6TMAKT3YNFP2XDSSXFM24ZMKWIXQ@2@2\windows-jdk11-m3.5.x_build\maven-plugin-plugin\target\invoker-reports\BUILD-mplugin-272_java8.xml, f:\jenkins\jenkins-slave\workspace\x_maven-plugin-tools_master-XKS4EHY3PSXHGP4DHIXUDAAM6TMAKT3YNFP2XDSSXFM24ZMKWIXQ@2@2\windows-jdk11-m3.5.x_build\maven-plugin-plugin\target\invoker-reports\BUILD-mplugin-299_no-configuration.xml, f:\jenkins\jenkins-slave\workspace\x_maven-plugin-tools_master-XKS4EHY3PSXHGP4DHIXUDAAM6TMAKT3YNFP2XDSSXFM24ZMKWIXQ@2@2\windows-jdk11-m3.5.x_build\maven-plugin-plugin\target\invoker-reports\BUILD-mplugin-305_defaultMojoDependencies.xml, f:\jenkins\jenkins-slave\workspace\x_maven-plugin-tools_master-XKS4EHY3PSXHGP4DHIXUDAAM6TMAKT3YNFP2XDSSXFM24ZMKWIXQ@2@2\windows-jdk11-m3.5.x_build\maven-plugin-plugin\target\invoker-reports\BUILD-mplugin-305_emptyMojoDependencies.xml, f:\jenkins\jenkins-slave\workspace\x_maven-plugin-tools_master-XKS4EHY3PSXHGP4DHIXUDAAM6TMAKT3YNFP2XDSSXFM24ZMKWIXQ@2@2\windows-jdk11-m3.5.x_build\maven-plugin-plugin\target\invoker-reports\BUILD-mplugin-305_singleMojoDependencies.xml, f:\jenkins\jenkins-slave\workspace\x_maven-plugin-tools_master-XKS4EHY3PSXHGP4DHIXUDAAM6TMAKT3YNFP2XDSSXFM24ZMKWIXQ@2@2\windows-jdk11-m3.5.x_build\maven-plugin-plugin\target\invoker-reports\BUILD-mplugin-319_report-since.xml, f:\jenkins\jenkins-slave\workspace\x_maven-plugin-tools_master-XKS4EHY3PSXHGP4DHIXUDAAM6TMAKT3YNFP2XDSSXFM24ZMKWIXQ@2@2\windows-jdk11-m3.5.x_build\maven-plugin-plugin\target\invoker-reports\BUILD-mplugin-324_javadoc.xml, f:\jenkins\jenkins-slave\workspace\x_maven-plugin-tools_master-XKS4EHY3PSXHGP4DHIXUDAAM6TMAKT3YNFP2XDSSXFM24ZMKWIXQ@2@2\windows-jdk11-m3.5.x_build\maven-plugin-plugin\target\invoker-reports\BUILD-packaging-jar.xml, f:\jenkins\jenkins-slave\workspace\x_maven-plugin-tools_master-XKS4EHY3PSXHGP4DHIXUDAAM6TMAKT3YNFP2XDSSXFM24ZMKWIXQ@2@2\windows-jdk11-m3.5.x_build\maven-plugin-plugin\target\invoker-reports\BUILD-plugin-info-jdk-default-version.xml, f:\jenkins\jenkins-slave\workspace\x_maven-plugin-tools_master-XKS4EHY3PSXHGP4DHIXUDAAM6TMAKT3YNFP2XDSSXFM24ZMKWIXQ@2@2\windows-jdk11-m3.5.x_build\maven-plugin-plugin\target\invoker-reports\BUILD-plugin-info-jdk.xml, f:\jenkins\jenkins-slave\workspace\x_maven-plugin-tools_master-XKS4EHY3PSXHGP4DHIXUDAAM6TMAKT3YNFP2XDSSXFM24ZMKWIXQ@2@2\windows-jdk11-m3.5.x_build\maven-plugin-plugin\target\invoker-reports\BUILD-plugin-report-annotations.xml, f:\jenkins\jenkins-slave\workspace\x_maven-plugin-tools_master-XKS4EHY3PSXHGP4DHIXUDAAM6TMAKT3YNFP2XDSSXFM24ZMKWIXQ@2@2\windows-jdk11-m3.5.x_build\maven-plugin-plugin\target\invoker-reports\BUILD-plugin-report.xml, f:\jenkins\jenkins-slave\workspace\x_maven-plugin-tools_master-XKS4EHY3PSXHGP4DHIXUDAAM6TMAKT3YNFP2XDSSXFM24ZMKWIXQ@2@2\windows-jdk11-m3.5.x_build\maven-plugin-plugin\target\invoker-reports\BUILD-skip.xml, f:\jenkins\jenkins-slave\workspace\x_maven-plugin-tools_master-XKS4EHY3PSXHGP4DHIXUDAAM6TMAKT3YNFP2XDSSXFM24ZMKWIXQ@2@2\windows-jdk11-m3.5.x_build\maven-plugin-plugin\target\invoker-reports\BUILD-source-encoding.xml]
[windows-jdk11-m3.5.x_build] Found logs:[f:\jenkins\jenkins-slave\workspace\x_maven-plugin-tools_master-XKS4EHY3PSXHGP4DHIXUDAAM6TMAKT3YNFP2XDSSXFM24ZMKWIXQ@2@2\windows-jdk11-m3.5.x_build\maven-plugin-plugin\target\it\annotation-with-inheritance-from-deps\build.log, f:\jenkins\jenkins-slave\workspace\x_maven-plugin-tools_master-XKS4EHY3PSXHGP4DHIXUDAAM6TMAKT3YNFP2XDSSXFM24ZMKWIXQ@2@2\windows-jdk11-m3.5.x_build\maven-plugin-plugin\target\it\annotation-with-inheritance-reactor\build.log, f:\jenkins\jenkins-slave\workspace\x_maven-plugin-tools_master-XKS4EHY3PSXHGP4DHIXUDAAM6TMAKT3YNFP2XDSSXFM24ZMKWIXQ@2@2\windows-jdk11-m3.5.x_build\maven-plugin-plugin\target\it\annotation-with-inheritance\build.log, f:\jenkins\jenkins-slave\workspace\x_maven-plugin-tools_master-XKS4EHY3PSXHGP4DHIXUDAAM6TMAKT3YNFP2XDSSXFM24ZMKWIXQ@2@2\windows-jdk11-m3.5.x_build\maven-plugin-plugin\target\it\ant-basic\build.log, f:\jenkins\jenkins-slave\workspace\x_maven-plugin-tools_master-XKS4EHY3PSXHGP4DHIXUDAAM6TMAKT3YNFP2XDSSXFM24ZMKWIXQ@2@2\windows-jdk11-m3.5.x_build\maven-plugin-plugin\target\it\ant-reference-parameter\build.log, f:\jenkins\jenkins-slave\workspace\x_maven-plugin-tools_master-XKS4EHY3PSXHGP4DHIXUDAAM6TMAKT3YNFP2XDSSXFM24ZMKWIXQ@2@2\windows-jdk11-m3.5.x_build\maven-plugin-plugin\target\it\ant-simple-usage\build.log, f:\jenkins\jenkins-slave\workspace\x_maven-plugin-tools_master-XKS4EHY3PSXHGP4DHIXUDAAM6TMAKT3YNFP2XDSSXFM24ZMKWIXQ@2@2\windows-jdk11-m3.5.x_build\maven-plugin-plugin\target\it\ant-since-maven-plugin\build.log, f:\jenkins\jenkins-slave\workspace\x_maven-plugin-tools_master-XKS4EHY3PSXHGP4DHIXUDAAM6TMAKT3YNFP2XDSSXFM24ZMKWIXQ@2@2\windows-jdk11-m3.5.x_build\maven-plugin-plugin\target\it\asm-failure\build.log, f:\jenkins\jenkins-slave\workspace\x_maven-plugin-tools_master-XKS4EHY3PSXHGP4DHIXUDAAM6TMAKT3YNFP2XDSSXFM24ZMKWIXQ@2@2\windows-jdk11-m3.5.x_build\maven-plugin-plugin\target\it\beanshell-simple\build.log, f:\jenkins\jenkins-slave\workspace\x_maven-plugin-tools_master-XKS4EHY3PSXHGP4DHIXUDAAM6TMAKT3YNFP2XDSSXFM24ZMKWIXQ@2@2\windows-jdk11-m3.5.x_build\maven-plugin-plugin\target\it\fix-maven-since-3.x\build.log, f:\jenkins\jenkins-slave\workspace\x_maven-plugin-tools_master-XKS4EHY3PSXHGP4DHIXUDAAM6TMAKT3YNFP2XDSSXFM24ZMKWIXQ@2@2\windows-jdk11-m3.5.x_build\maven-plugin-plugin\target\it\help-basic-jdk11\build.log, f:\jenkins\jenkins-slave\workspace\x_maven-plugin-tools_master-XKS4EHY3PSXHGP4DHIXUDAAM6TMAKT3YNFP2XDSSXFM24ZMKWIXQ@2@2\windows-jdk11-m3.5.x_build\maven-plugin-plugin\target\it\help-basic\build.log, f:\jenkins\jenkins-slave\workspace\x_maven-plugin-tools_master-XKS4EHY3PSXHGP4DHIXUDAAM6TMAKT3YNFP2XDSSXFM24ZMKWIXQ@2@2\windows-jdk11-m3.5.x_build\maven-plugin-plugin\target\it\help-package\build.log, f:\jenkins\jenkins-slave\workspace\x_maven-plugin-tools_master-XKS4EHY3PSXHGP4DHIXUDAAM6TMAKT3YNFP2XDSSXFM24ZMKWIXQ@2@2\windows-jdk11-m3.5.x_build\maven-plugin-plugin\target\it\ignore-plugin-class-realm\build.log, f:\jenkins\jenkins-slave\workspace\x_maven-plugin-tools_master-XKS4EHY3PSXHGP4DHIXUDAAM6TMAKT3YNFP2XDSSXFM24ZMKWIXQ@2@2\windows-jdk11-m3.5.x_build\maven-plugin-plugin\target\it\java-basic-annotations-jdk11\build.log, f:\jenkins\jenkins-slave\workspace\x_maven-plugin-tools_master-XKS4EHY3PSXHGP4DHIXUDAAM6TMAKT3YNFP2XDSSXFM24ZMKWIXQ@2@2\windows-jdk11-m3.5.x_build\maven-plugin-plugin\target\it\java-basic-annotations-jdk8\build.log, f:\jenkins\jenkins-slave\workspace\x_maven-plugin-tools_master-XKS4EHY3PSXHGP4DHIXUDAAM6TMAKT3YNFP2XDSSXFM24ZMKWIXQ@2@2\windows-jdk11-m3.5.x_build\maven-plugin-plugin\target\it\java-basic-annotations\build.log, f:\jenkins\jenkins-slave\workspace\x_maven-plugin-tools_master-XKS4EHY3PSXHGP4DHIXUDAAM6TMAKT3YNFP2XDSSXFM24ZMKWIXQ@2@2\windows-jdk11-m3.5.x_build\maven-plugin-plugin\target\it\java-basic\build.log, f:\jenkins\jenkins-slave\workspace\x_maven-plugin-tools_master-XKS4EHY3PSXHGP4DHIXUDAAM6TMAKT3YNFP2XDSSXFM24ZMKWIXQ@2@2\windows-jdk11-m3.5.x_build\maven-plugin-plugin\target\it\mplugin-187\build.log, f:\jenkins\jenkins-slave\workspace\x_maven-plugin-tools_master-XKS4EHY3PSXHGP4DHIXUDAAM6TMAKT3YNFP2XDSSXFM24ZMKWIXQ@2@2\windows-jdk11-m3.5.x_build\maven-plugin-plugin\target\it\mplugin-191\build.log, f:\jenkins\jenkins-slave\workspace\x_maven-plugin-tools_master-XKS4EHY3PSXHGP4DHIXUDAAM6TMAKT3YNFP2XDSSXFM24ZMKWIXQ@2@2\windows-jdk11-m3.5.x_build\maven-plugin-plugin\target\it\mplugin-223\build.log, f:\jenkins\jenkins-slave\workspace\x_maven-plugin-tools_master-XKS4EHY3PSXHGP4DHIXUDAAM6TMAKT3YNFP2XDSSXFM24ZMKWIXQ@2@2\windows-jdk11-m3.5.x_build\maven-plugin-plugin\target\it\mplugin-272_java8\build.log, f:\jenkins\jenkins-slave\workspace\x_maven-plugin-tools_master-XKS4EHY3PSXHGP4DHIXUDAAM6TMAKT3YNFP2XDSSXFM24ZMKWIXQ@2@2\windows-jdk11-m3.5.x_build\maven-plugin-plugin\target\it\mplugin-299_no-configuration\build.log, f:\jenkins\jenkins-slave\workspace\x_maven-plugin-tools_master-XKS4EHY3PSXHGP4DHIXUDAAM6TMAKT3YNFP2XDSSXFM24ZMKWIXQ@2@2\windows-jdk11-m3.5.x_build\maven-plugin-plugin\target\it\mplugin-305_defaultMojoDependencies\build.log, f:\jenkins\jenkins-slave\workspace\x_maven-plugin-tools_master-XKS4EHY3PSXHGP4DHIXUDAAM6TMAKT3YNFP2XDSSXFM24ZMKWIXQ@2@2\windows-jdk11-m3.5.x_build\maven-plugin-plugin\target\it\mplugin-305_emptyMojoDependencies\build.log, f:\jenkins\jenkins-slave\workspace\x_maven-plugin-tools_master-XKS4EHY3PSXHGP4DHIXUDAAM6TMAKT3YNFP2XDSSXFM24ZMKWIXQ@2@2\windows-jdk11-m3.5.x_build\maven-plugin-plugin\target\it\mplugin-305_singleMojoDependencies\build.log, f:\jenkins\jenkins-slave\workspace\x_maven-plugin-tools_master-XKS4EHY3PSXHGP4DHIXUDAAM6TMAKT3YNFP2XDSSXFM24ZMKWIXQ@2@2\windows-jdk11-m3.5.x_build\maven-plugin-plugin\target\it\mplugin-319_report-since\build.log, f:\jenkins\jenkins-slave\workspace\x_maven-plugin-tools_master-XKS4EHY3PSXHGP4DHIXUDAAM6TMAKT3YNFP2XDSSXFM24ZMKWIXQ@2@2\windows-jdk11-m3.5.x_build\maven-plugin-plugin\target\it\mplugin-324_javadoc\build.log, f:\jenkins\jenkins-slave\workspace\x_maven-plugin-tools_master-XKS4EHY3PSXHGP4DHIXUDAAM6TMAKT3YNFP2XDSSXFM24ZMKWIXQ@2@2\windows-jdk11-m3.5.x_build\maven-plugin-plugin\target\it\packaging-jar\build.log, f:\jenkins\jenkins-slave\workspace\x_maven-plugin-tools_master-XKS4EHY3PSXHGP4DHIXUDAAM6TMAKT3YNFP2XDSSXFM24ZMKWIXQ@2@2\windows-jdk11-m3.5.x_build\maven-plugin-plugin\target\it\plugin-info-jdk-default-version\build.log, f:\jenkins\jenkins-slave\workspace\x_maven-plugin-tools_master-XKS4EHY3PSXHGP4DHIXUDAAM6TMAKT3YNFP2XDSSXFM24ZMKWIXQ@2@2\windows-jdk11-m3.5.x_build\maven-plugin-plugin\target\it\plugin-info-jdk\build.log, f:\jenkins\jenkins-slave\workspace\x_maven-plugin-tools_master-XKS4EHY3PSXHGP4DHIXUDAAM6TMAKT3YNFP2XDSSXFM24ZMKWIXQ@2@2\windows-jdk11-m3.5.x_build\maven-plugin-plugin\target\it\plugin-report-annotations\build.log, f:\jenkins\jenkins-slave\workspace\x_maven-plugin-tools_master-XKS4EHY3PSXHGP4DHIXUDAAM6TMAKT3YNFP2XDSSXFM24ZMKWIXQ@2@2\windows-jdk11-m3.5.x_build\maven-plugin-plugin\target\it\plugin-report\build.log, f:\jenkins\jenkins-slave\workspace\x_maven-plugin-tools_master-XKS4EHY3PSXHGP4DHIXUDAAM6TMAKT3YNFP2XDSSXFM24ZMKWIXQ@2@2\windows-jdk11-m3.5.x_build\maven-plugin-plugin\target\it\skip\build.log, f:\jenkins\jenkins-slave\workspace\x_maven-plugin-tools_master-XKS4EHY3PSXHGP4DHIXUDAAM6TMAKT3YNFP2XDSSXFM24ZMKWIXQ@2@2\windows-jdk11-m3.5.x_build\maven-plugin-plugin\target\it\source-encoding\build.log]
[windows-jdk11-m3.5.x_build] Finished parsing Maven Invoker results (found 35)
[windows-jdk11-m3.5.x_build] [withMaven] junitPublisher - Archive test results for Maven artifact org.apache.maven.plugin-tools:maven-plugin-tools-api:3.6.0-SNAPSHOT generated by maven-surefire-plugin:test (default-test): windows-jdk11-m3.5.x_build\maven-plugin-tools-api\target\surefire-reports\*.xml
[windows-jdk11-m3.5.x_build] Recording test results
[windows-jdk11-m3.5.x_build] [withMaven] junitPublisher - Archive test results for Maven artifact org.apache.maven.plugin-tools:maven-plugin-tools-generators:3.6.0-SNAPSHOT generated by maven-surefire-plugin:test (default-test): windows-jdk11-m3.5.x_build\maven-plugin-tools-generators\target\surefire-reports\*.xml
[windows-jdk11-m3.5.x_build] Recording test results
[windows-jdk11-m3.5.x_build] [withMaven] junitPublisher - Archive test results for Maven artifact org.apache.maven.plugin-tools:maven-plugin-tools-java:3.6.0-SNAPSHOT generated by maven-surefire-plugin:test (default-test): windows-jdk11-m3.5.x_build\maven-plugin-tools-java\target\surefire-reports\*.xml
[windows-jdk11-m3.5.x_build] Recording test results
[windows-jdk11-m3.5.x_build] [withMaven] junitPublisher - Archive test results for Maven artifact org.apache.maven.plugin-tools:maven-plugin-annotations:3.6.0-SNAPSHOT generated by maven-surefire-plugin:test (default-test): windows-jdk11-m3.5.x_build\maven-plugin-annotations\target\surefire-reports\*.xml
[windows-jdk11-m3.5.x_build] Recording test results
[windows-jdk11-m3.5.x_build] None of the test reports contained any result
[windows-jdk11-m3.5.x_build] [withMaven] junitPublisher - Archive test results for Maven artifact org.apache.maven.plugin-tools:maven-plugin-tools-annotations:3.6.0-SNAPSHOT generated by maven-surefire-plugin:test (default-test): windows-jdk11-m3.5.x_build\maven-plugin-tools-annotations\target\surefire-reports\*.xml
[windows-jdk11-m3.5.x_build] Recording test results
[windows-jdk11-m3.5.x_build] [withMaven] junitPublisher - Archive test results for Maven artifact org.apache.maven.plugin-tools:maven-plugin-tools-model:3.6.0-SNAPSHOT generated by maven-surefire-plugin:test (default-test): windows-jdk11-m3.5.x_build\maven-script\maven-plugin-tools-model\target\surefire-reports\*.xml
[windows-jdk11-m3.5.x_build] Recording test results
[windows-jdk11-m3.5.x_build] [withMaven] junitPublisher - Archive test results for Maven artifact org.apache.maven.plugin-tools:maven-plugin-tools-ant:3.6.0-SNAPSHOT generated by maven-surefire-plugin:test (default-test): windows-jdk11-m3.5.x_build\maven-script\maven-plugin-tools-ant\target\surefire-reports\*.xml
[windows-jdk11-m3.5.x_build] Recording test results
[windows-jdk11-m3.5.x_build] [withMaven] junitPublisher - Archive test results for Maven artifact org.apache.maven.plugin-tools:maven-script-ant:3.6.0-SNAPSHOT generated by maven-surefire-plugin:test (default-test): windows-jdk11-m3.5.x_build\maven-script\maven-script-ant\target\surefire-reports\*.xml
[windows-jdk11-m3.5.x_build] Recording test results
[windows-jdk11-m3.5.x_build] [withMaven] junitPublisher - Archive test results for Maven artifact org.apache.maven.plugin-tools:maven-plugin-tools-beanshell:3.6.0-SNAPSHOT generated by maven-surefire-plugin:test (default-test): windows-jdk11-m3.5.x_build\maven-script\maven-plugin-tools-beanshell\target\surefire-reports\*.xml
[windows-jdk11-m3.5.x_build] Recording test results
[windows-jdk11-m3.5.x_build] None of the test reports contained any result
[windows-jdk11-m3.5.x_build] [withMaven] junitPublisher - Archive test results for Maven artifact org.apache.maven.plugin-tools:maven-script-beanshell:3.6.0-SNAPSHOT generated by maven-surefire-plugin:test (default-test): windows-jdk11-m3.5.x_build\maven-script\maven-script-beanshell\target\surefire-reports\*.xml
[windows-jdk11-m3.5.x_build] Recording test results
[windows-jdk11-m3.5.x_build] None of the test reports contained any result
[windows-jdk11-m3.5.x_build] [withMaven] junitPublisher - Archive test results for Maven artifact org.apache.maven.plugins:maven-plugin-plugin:3.6.0-SNAPSHOT generated by maven-surefire-plugin:test (default-test): windows-jdk11-m3.5.x_build\maven-plugin-plugin\target\surefire-reports\*.xml
[windows-jdk11-m3.5.x_build] Recording test results
[windows-jdk11-m3.5.x_build] None of the test reports contained any result
[windows-jdk11-m3.5.x_build] [withMaven] openTasksPublisher - Scan Tasks for Maven artifact org.apache.maven.plugin-tools:maven-plugin-tools-api:3.6.0-SNAPSHOT in source directory windows-jdk11-m3.5.x_build\maven-plugin-tools-api\src\main\java
[windows-jdk11-m3.5.x_build] [withMaven] openTasksPublisher - Scan Tasks for Maven artifact org.apache.maven.plugin-tools:maven-plugin-tools-generators:3.6.0-SNAPSHOT in source directory windows-jdk11-m3.5.x_build\maven-plugin-tools-generators\src\main\java
[windows-jdk11-m3.5.x_build] [withMaven] openTasksPublisher - Scan Tasks for Maven artifact org.apache.maven.plugin-tools:maven-plugin-tools-java:3.6.0-SNAPSHOT in source directory windows-jdk11-m3.5.x_build\maven-plugin-tools-java\src\main\java
[windows-jdk11-m3.5.x_build] [withMaven] openTasksPublisher - Scan Tasks for Maven artifact org.apache.maven.plugin-tools:maven-plugin-annotations:3.6.0-SNAPSHOT in source directory windows-jdk11-m3.5.x_build\maven-plugin-annotations\src\main\java
[windows-jdk11-m3.5.x_build] [withMaven] openTasksPublisher - Scan Tasks for Maven artifact org.apache.maven.plugin-tools:maven-plugin-tools-annotations:3.6.0-SNAPSHOT in source directory windows-jdk11-m3.5.x_build\maven-plugin-tools-annotations\src\main\java
[windows-jdk11-m3.5.x_build] [withMaven] openTasksPublisher - Scan Tasks for Maven artifact org.apache.maven.plugin-tools:maven-plugin-tools-model:3.6.0-SNAPSHOT in source directory windows-jdk11-m3.5.x_build\maven-script\maven-plugin-tools-model\src\main\java
[windows-jdk11-m3.5.x_build] [withMaven] openTasksPublisher - Scan Tasks for Maven artifact org.apache.maven.plugin-tools:maven-plugin-tools-ant:3.6.0-SNAPSHOT in source directory windows-jdk11-m3.5.x_build\maven-script\maven-plugin-tools-ant\src\main\java
[windows-jdk11-m3.5.x_build] [withMaven] openTasksPublisher - Scan Tasks for Maven artifact org.apache.maven.plugin-tools:maven-script-ant:3.6.0-SNAPSHOT in source directory windows-jdk11-m3.5.x_build\maven-script\maven-script-ant\src\main\java
[windows-jdk11-m3.5.x_build] [withMaven] openTasksPublisher - Scan Tasks for Maven artifact org.apache.maven.plugin-tools:maven-plugin-tools-beanshell:3.6.0-SNAPSHOT in source directory windows-jdk11-m3.5.x_build\maven-script\maven-plugin-tools-beanshell\src\main\java
[windows-jdk11-m3.5.x_build] [withMaven] openTasksPublisher - Scan Tasks for Maven artifact org.apache.maven.plugin-tools:maven-script-beanshell:3.6.0-SNAPSHOT in source directory windows-jdk11-m3.5.x_build\maven-script\maven-script-beanshell\src\main\java
[windows-jdk11-m3.5.x_build] [withMaven] openTasksPublisher - Scan Tasks for Maven artifact org.apache.maven.plugins:maven-plugin-plugin:3.6.0-SNAPSHOT in source directory windows-jdk11-m3.5.x_build\maven-plugin-plugin\src\main\java
[windows-jdk11-m3.5.x_build] [TASKS] Scanning folder 'f:\jenkins\jenkins-slave\workspace\x_maven-plugin-tools_master-XKS4EHY3PSXHGP4DHIXUDAAM6TMAKT3YNFP2XDSSXFM24ZMKWIXQ@2@2' for files matching the pattern 'windows-jdk11-m3.5.x_build\maven-plugin-tools-api\src\main\java\**\*,windows-jdk11-m3.5.x_build\maven-plugin-tools-generators\src\main\java\**\*,windows-jdk11-m3.5.x_build\maven-plugin-tools-java\src\main\java\**\*,windows-jdk11-m3.5.x_build\maven-plugin-annotations\src\main\java\**\*,windows-jdk11-m3.5.x_build\maven-plugin-tools-annotations\src\main\java\**\*,windows-jdk11-m3.5.x_build\maven-script\maven-plugin-tools-model\src\main\java\**\*,windows-jdk11-m3.5.x_build\maven-script\maven-plugin-tools-ant\src\main\java\**\*,windows-jdk11-m3.5.x_build\maven-script\maven-script-ant\src\main\java\**\*,windows-jdk11-m3.5.x_build\maven-script\maven-plugin-tools-beanshell\src\main\java\**\*,windows-jdk11-m3.5.x_build\maven-script\maven-script-beanshell\src\main\java\**\*,windows-jdk11-m3.5.x_build\maven-plugin-plugin\src\main\java\**\*' - excludes: null
[windows-jdk11-m3.5.x_build] [TASKS] Found 52 files to scan for tasks
[windows-jdk11-m3.5.x_build] [TASKS] Found 11 open tasks.
[windows-jdk11-m3.5.x_build] Skipping warnings blame since pipelines do not have an SCM link.%n
[windows-jdk11-m3.5.x_build] [TASKS] Computing warning deltas based on reference build #47
[Pipeline] [windows-jdk11-m3.5.x_build] // withMaven
[Pipeline] [windows-jdk11-m3.5.x_build] cleanWs
[windows-jdk11-m3.5.x_build] [WS-CLEANUP] Deleting project workspace...[WS-CLEANUP] done
[Pipeline] [windows-jdk11-m3.5.x_build] }
[Pipeline] [windows-jdk11-m3.5.x_build] // stage
[Pipeline] [windows-jdk11-m3.5.x_build] }
[Pipeline] [windows-jdk11-m3.5.x_build] // ws
[Pipeline] [windows-jdk11-m3.5.x_build] }
[Pipeline] [windows-jdk11-m3.5.x_build] // node
[Pipeline] [windows-jdk11-m3.5.x_build] }
[Pipeline] // parallel
[Pipeline] stage
[Pipeline] { (Notifications)
[Pipeline] echo
Build result: UNSTABLE
[Pipeline] jiraIssueSelector
[Pipeline] emailext
Mime
  • Unnamed multipart/mixed (inline, None, 0 bytes)
View raw message