maven-notifications mailing list archives

Site index · List index
Message view « Date » · « Thread »
Top « Date » · « Thread »
From Apache Jenkins Server <jenk...@builds.apache.org>
Subject Build failed in Jenkins: Maven TLP » maven-surefire » 3.0.0-M1 #14
Date Tue, 30 Oct 2018 01:57:48 GMT
See https://builds.apache.org/job/maven-box/job/maven-surefire/job/3.0.0-M1/14/

No changes.

11 tests failed.
FAILED:  org.apache.maven.plugins.surefire.report.Surefire1183Test.testCustomTitleAndDescriptionReport

Error Message:
Could not initialize class org.apache.commons.lang.SystemUtils

Stack Trace:
java.lang.NoClassDefFoundError: Could not initialize class org.apache.commons.lang.SystemUtils
	at org.apache.maven.doxia.siterenderer.DefaultSiteRenderer.generateDocument(DefaultSiteRenderer.java:732)
	at org.apache.maven.reporting.AbstractMavenReport.execute(AbstractMavenReport.java:154)
	at org.apache.maven.plugins.surefire.report.Surefire1183Test.testCustomTitleAndDescriptionReport(Surefire1183Test.java:112)
	at java.base/jdk.internal.reflect.NativeMethodAccessorImpl.invoke0(Native Method)
	at java.base/jdk.internal.reflect.NativeMethodAccessorImpl.invoke(NativeMethodAccessorImpl.java:62)
	at java.base/jdk.internal.reflect.DelegatingMethodAccessorImpl.invoke(DelegatingMethodAccessorImpl.java:43)
	at java.base/java.lang.reflect.Method.invoke(Method.java:566)
	at junit.framework.TestCase.runTest(TestCase.java:176)
	at junit.framework.TestCase.runBare(TestCase.java:141)
	at junit.framework.TestResult$1.protect(TestResult.java:122)
	at junit.framework.TestResult.runProtected(TestResult.java:142)
	at junit.framework.TestResult.run(TestResult.java:125)
	at junit.framework.TestCase.run(TestCase.java:129)
	at junit.framework.TestSuite.runTest(TestSuite.java:252)
	at junit.framework.TestSuite.run(TestSuite.java:247)
	at org.junit.internal.runners.JUnit38ClassRunner.run(JUnit38ClassRunner.java:86)
	at org.apache.maven.surefire.junit4.JUnit4Provider.execute(JUnit4Provider.java:252)
	at org.apache.maven.surefire.junit4.JUnit4Provider.executeTestSet(JUnit4Provider.java:141)
	at org.apache.maven.surefire.junit4.JUnit4Provider.invoke(JUnit4Provider.java:112)
	at java.base/jdk.internal.reflect.NativeMethodAccessorImpl.invoke0(Native Method)
	at java.base/jdk.internal.reflect.NativeMethodAccessorImpl.invoke(NativeMethodAccessorImpl.java:62)
	at java.base/jdk.internal.reflect.DelegatingMethodAccessorImpl.invoke(DelegatingMethodAccessorImpl.java:43)
	at java.base/java.lang.reflect.Method.invoke(Method.java:566)
	at org.apache.maven.surefire.util.ReflectionUtils.invokeMethodWithArray(ReflectionUtils.java:189)
	at org.apache.maven.surefire.booter.ProviderFactory$ProviderProxy.invoke(ProviderFactory.java:165)
	at org.apache.maven.surefire.booter.ProviderFactory.invokeProvider(ProviderFactory.java:85)
	at org.apache.maven.surefire.booter.ForkedBooter.runSuitesInProcess(ForkedBooter.java:115)
	at org.apache.maven.surefire.booter.ForkedBooter.main(ForkedBooter.java:75)


FAILED:  org.apache.maven.plugins.surefire.report.SurefireReportMojoTest.testSurefireReportEnclosedTrimStackTrace

Error Message:
null

Stack Trace:
java.lang.ExceptionInInitializerError
	at org.apache.maven.doxia.siterenderer.DefaultSiteRenderer.generateDocument(DefaultSiteRenderer.java:732)
	at org.apache.maven.reporting.AbstractMavenReport.execute(AbstractMavenReport.java:154)
	at org.apache.maven.plugins.surefire.report.SurefireReportMojoTest.testSurefireReportEnclosedTrimStackTrace(SurefireReportMojoTest.java:471)
	at java.base/jdk.internal.reflect.NativeMethodAccessorImpl.invoke0(Native Method)
	at java.base/jdk.internal.reflect.NativeMethodAccessorImpl.invoke(NativeMethodAccessorImpl.java:62)
	at java.base/jdk.internal.reflect.DelegatingMethodAccessorImpl.invoke(DelegatingMethodAccessorImpl.java:43)
	at java.base/java.lang.reflect.Method.invoke(Method.java:566)
	at junit.framework.TestCase.runTest(TestCase.java:176)
	at junit.framework.TestCase.runBare(TestCase.java:141)
	at junit.framework.TestResult$1.protect(TestResult.java:122)
	at junit.framework.TestResult.runProtected(TestResult.java:142)
	at junit.framework.TestResult.run(TestResult.java:125)
	at junit.framework.TestCase.run(TestCase.java:129)
	at junit.framework.TestSuite.runTest(TestSuite.java:252)
	at junit.framework.TestSuite.run(TestSuite.java:247)
	at org.junit.internal.runners.JUnit38ClassRunner.run(JUnit38ClassRunner.java:86)
	at org.apache.maven.surefire.junit4.JUnit4Provider.execute(JUnit4Provider.java:252)
	at org.apache.maven.surefire.junit4.JUnit4Provider.executeTestSet(JUnit4Provider.java:141)
	at org.apache.maven.surefire.junit4.JUnit4Provider.invoke(JUnit4Provider.java:112)
	at java.base/jdk.internal.reflect.NativeMethodAccessorImpl.invoke0(Native Method)
	at java.base/jdk.internal.reflect.NativeMethodAccessorImpl.invoke(NativeMethodAccessorImpl.java:62)
	at java.base/jdk.internal.reflect.DelegatingMethodAccessorImpl.invoke(DelegatingMethodAccessorImpl.java:43)
	at java.base/java.lang.reflect.Method.invoke(Method.java:566)
	at org.apache.maven.surefire.util.ReflectionUtils.invokeMethodWithArray(ReflectionUtils.java:189)
	at org.apache.maven.surefire.booter.ProviderFactory$ProviderProxy.invoke(ProviderFactory.java:165)
	at org.apache.maven.surefire.booter.ProviderFactory.invokeProvider(ProviderFactory.java:85)
	at org.apache.maven.surefire.booter.ForkedBooter.runSuitesInProcess(ForkedBooter.java:115)
	at org.apache.maven.surefire.booter.ForkedBooter.main(ForkedBooter.java:75)
Caused by: java.lang.StringIndexOutOfBoundsException: begin 0, end 3, length 2
	at java.base/java.lang.String.checkBoundsBeginEnd(String.java:3319)
	at java.base/java.lang.String.substring(String.java:1874)
	at org.apache.commons.lang.SystemUtils.getJavaVersionAsFloat(SystemUtils.java:1133)
	at org.apache.commons.lang.SystemUtils.<clinit>(SystemUtils.java:818)
	... 28 more


FAILED:  org.apache.maven.plugins.surefire.report.SurefireReportMojoTest.testBasicSurefireReportIfLinkXrefIsFalse

Error Message:
Could not initialize class org.apache.commons.lang.SystemUtils

Stack Trace:
java.lang.NoClassDefFoundError: Could not initialize class org.apache.commons.lang.SystemUtils
	at org.apache.maven.doxia.siterenderer.DefaultSiteRenderer.generateDocument(DefaultSiteRenderer.java:732)
	at org.apache.maven.reporting.AbstractMavenReport.execute(AbstractMavenReport.java:154)
	at org.apache.maven.plugins.surefire.report.SurefireReportMojoTest.testBasicSurefireReportIfLinkXrefIsFalse(SurefireReportMojoTest.java:161)
	at java.base/jdk.internal.reflect.NativeMethodAccessorImpl.invoke0(Native Method)
	at java.base/jdk.internal.reflect.NativeMethodAccessorImpl.invoke(NativeMethodAccessorImpl.java:62)
	at java.base/jdk.internal.reflect.DelegatingMethodAccessorImpl.invoke(DelegatingMethodAccessorImpl.java:43)
	at java.base/java.lang.reflect.Method.invoke(Method.java:566)
	at junit.framework.TestCase.runTest(TestCase.java:176)
	at junit.framework.TestCase.runBare(TestCase.java:141)
	at junit.framework.TestResult$1.protect(TestResult.java:122)
	at junit.framework.TestResult.runProtected(TestResult.java:142)
	at junit.framework.TestResult.run(TestResult.java:125)
	at junit.framework.TestCase.run(TestCase.java:129)
	at junit.framework.TestSuite.runTest(TestSuite.java:252)
	at junit.framework.TestSuite.run(TestSuite.java:247)
	at org.junit.internal.runners.JUnit38ClassRunner.run(JUnit38ClassRunner.java:86)
	at org.apache.maven.surefire.junit4.JUnit4Provider.execute(JUnit4Provider.java:252)
	at org.apache.maven.surefire.junit4.JUnit4Provider.executeTestSet(JUnit4Provider.java:141)
	at org.apache.maven.surefire.junit4.JUnit4Provider.invoke(JUnit4Provider.java:112)
	at java.base/jdk.internal.reflect.NativeMethodAccessorImpl.invoke0(Native Method)
	at java.base/jdk.internal.reflect.NativeMethodAccessorImpl.invoke(NativeMethodAccessorImpl.java:62)
	at java.base/jdk.internal.reflect.DelegatingMethodAccessorImpl.invoke(DelegatingMethodAccessorImpl.java:43)
	at java.base/java.lang.reflect.Method.invoke(Method.java:566)
	at org.apache.maven.surefire.util.ReflectionUtils.invokeMethodWithArray(ReflectionUtils.java:189)
	at org.apache.maven.surefire.booter.ProviderFactory$ProviderProxy.invoke(ProviderFactory.java:165)
	at org.apache.maven.surefire.booter.ProviderFactory.invokeProvider(ProviderFactory.java:85)
	at org.apache.maven.surefire.booter.ForkedBooter.runSuitesInProcess(ForkedBooter.java:115)
	at org.apache.maven.surefire.booter.ForkedBooter.main(ForkedBooter.java:75)


FAILED:  org.apache.maven.plugins.surefire.report.SurefireReportMojoTest.testSurefireReportEnclosed

Error Message:
Could not initialize class org.apache.commons.lang.SystemUtils

Stack Trace:
java.lang.NoClassDefFoundError: Could not initialize class org.apache.commons.lang.SystemUtils
	at org.apache.maven.doxia.siterenderer.DefaultSiteRenderer.generateDocument(DefaultSiteRenderer.java:732)
	at org.apache.maven.reporting.AbstractMavenReport.execute(AbstractMavenReport.java:154)
	at org.apache.maven.plugins.surefire.report.SurefireReportMojoTest.testSurefireReportEnclosed(SurefireReportMojoTest.java:533)
	at java.base/jdk.internal.reflect.NativeMethodAccessorImpl.invoke0(Native Method)
	at java.base/jdk.internal.reflect.NativeMethodAccessorImpl.invoke(NativeMethodAccessorImpl.java:62)
	at java.base/jdk.internal.reflect.DelegatingMethodAccessorImpl.invoke(DelegatingMethodAccessorImpl.java:43)
	at java.base/java.lang.reflect.Method.invoke(Method.java:566)
	at junit.framework.TestCase.runTest(TestCase.java:176)
	at junit.framework.TestCase.runBare(TestCase.java:141)
	at junit.framework.TestResult$1.protect(TestResult.java:122)
	at junit.framework.TestResult.runProtected(TestResult.java:142)
	at junit.framework.TestResult.run(TestResult.java:125)
	at junit.framework.TestCase.run(TestCase.java:129)
	at junit.framework.TestSuite.runTest(TestSuite.java:252)
	at junit.framework.TestSuite.run(TestSuite.java:247)
	at org.junit.internal.runners.JUnit38ClassRunner.run(JUnit38ClassRunner.java:86)
	at org.apache.maven.surefire.junit4.JUnit4Provider.execute(JUnit4Provider.java:252)
	at org.apache.maven.surefire.junit4.JUnit4Provider.executeTestSet(JUnit4Provider.java:141)
	at org.apache.maven.surefire.junit4.JUnit4Provider.invoke(JUnit4Provider.java:112)
	at java.base/jdk.internal.reflect.NativeMethodAccessorImpl.invoke0(Native Method)
	at java.base/jdk.internal.reflect.NativeMethodAccessorImpl.invoke(NativeMethodAccessorImpl.java:62)
	at java.base/jdk.internal.reflect.DelegatingMethodAccessorImpl.invoke(DelegatingMethodAccessorImpl.java:43)
	at java.base/java.lang.reflect.Method.invoke(Method.java:566)
	at org.apache.maven.surefire.util.ReflectionUtils.invokeMethodWithArray(ReflectionUtils.java:189)
	at org.apache.maven.surefire.booter.ProviderFactory$ProviderProxy.invoke(ProviderFactory.java:165)
	at org.apache.maven.surefire.booter.ProviderFactory.invokeProvider(ProviderFactory.java:85)
	at org.apache.maven.surefire.booter.ForkedBooter.runSuitesInProcess(ForkedBooter.java:115)
	at org.apache.maven.surefire.booter.ForkedBooter.main(ForkedBooter.java:75)


FAILED:  org.apache.maven.plugins.surefire.report.SurefireReportMojoTest.testBasicSurefireReport

Error Message:
Could not initialize class org.apache.commons.lang.SystemUtils

Stack Trace:
java.lang.NoClassDefFoundError: Could not initialize class org.apache.commons.lang.SystemUtils
	at org.apache.maven.doxia.siterenderer.DefaultSiteRenderer.generateDocument(DefaultSiteRenderer.java:732)
	at org.apache.maven.reporting.AbstractMavenReport.execute(AbstractMavenReport.java:154)
	at org.apache.maven.plugins.surefire.report.SurefireReportMojoTest.testBasicSurefireReport(SurefireReportMojoTest.java:96)
	at java.base/jdk.internal.reflect.NativeMethodAccessorImpl.invoke0(Native Method)
	at java.base/jdk.internal.reflect.NativeMethodAccessorImpl.invoke(NativeMethodAccessorImpl.java:62)
	at java.base/jdk.internal.reflect.DelegatingMethodAccessorImpl.invoke(DelegatingMethodAccessorImpl.java:43)
	at java.base/java.lang.reflect.Method.invoke(Method.java:566)
	at junit.framework.TestCase.runTest(TestCase.java:176)
	at junit.framework.TestCase.runBare(TestCase.java:141)
	at junit.framework.TestResult$1.protect(TestResult.java:122)
	at junit.framework.TestResult.runProtected(TestResult.java:142)
	at junit.framework.TestResult.run(TestResult.java:125)
	at junit.framework.TestCase.run(TestCase.java:129)
	at junit.framework.TestSuite.runTest(TestSuite.java:252)
	at junit.framework.TestSuite.run(TestSuite.java:247)
	at org.junit.internal.runners.JUnit38ClassRunner.run(JUnit38ClassRunner.java:86)
	at org.apache.maven.surefire.junit4.JUnit4Provider.execute(JUnit4Provider.java:252)
	at org.apache.maven.surefire.junit4.JUnit4Provider.executeTestSet(JUnit4Provider.java:141)
	at org.apache.maven.surefire.junit4.JUnit4Provider.invoke(JUnit4Provider.java:112)
	at java.base/jdk.internal.reflect.NativeMethodAccessorImpl.invoke0(Native Method)
	at java.base/jdk.internal.reflect.NativeMethodAccessorImpl.invoke(NativeMethodAccessorImpl.java:62)
	at java.base/jdk.internal.reflect.DelegatingMethodAccessorImpl.invoke(DelegatingMethodAccessorImpl.java:43)
	at java.base/java.lang.reflect.Method.invoke(Method.java:566)
	at org.apache.maven.surefire.util.ReflectionUtils.invokeMethodWithArray(ReflectionUtils.java:189)
	at org.apache.maven.surefire.booter.ProviderFactory$ProviderProxy.invoke(ProviderFactory.java:165)
	at org.apache.maven.surefire.booter.ProviderFactory.invokeProvider(ProviderFactory.java:85)
	at org.apache.maven.surefire.booter.ForkedBooter.runSuitesInProcess(ForkedBooter.java:115)
	at org.apache.maven.surefire.booter.ForkedBooter.main(ForkedBooter.java:75)


FAILED:  org.apache.maven.plugins.surefire.report.SurefireReportMojoTest.testBasicSurefireReportIfReportingIsNull

Error Message:
Could not initialize class org.apache.commons.lang.SystemUtils

Stack Trace:
java.lang.NoClassDefFoundError: Could not initialize class org.apache.commons.lang.SystemUtils
	at org.apache.maven.doxia.siterenderer.DefaultSiteRenderer.generateDocument(DefaultSiteRenderer.java:732)
	at org.apache.maven.reporting.AbstractMavenReport.execute(AbstractMavenReport.java:154)
	at org.apache.maven.plugins.surefire.report.SurefireReportMojoTest.testBasicSurefireReportIfReportingIsNull(SurefireReportMojoTest.java:186)
	at java.base/jdk.internal.reflect.NativeMethodAccessorImpl.invoke0(Native Method)
	at java.base/jdk.internal.reflect.NativeMethodAccessorImpl.invoke(NativeMethodAccessorImpl.java:62)
	at java.base/jdk.internal.reflect.DelegatingMethodAccessorImpl.invoke(DelegatingMethodAccessorImpl.java:43)
	at java.base/java.lang.reflect.Method.invoke(Method.java:566)
	at junit.framework.TestCase.runTest(TestCase.java:176)
	at junit.framework.TestCase.runBare(TestCase.java:141)
	at junit.framework.TestResult$1.protect(TestResult.java:122)
	at junit.framework.TestResult.runProtected(TestResult.java:142)
	at junit.framework.TestResult.run(TestResult.java:125)
	at junit.framework.TestCase.run(TestCase.java:129)
	at junit.framework.TestSuite.runTest(TestSuite.java:252)
	at junit.framework.TestSuite.run(TestSuite.java:247)
	at org.junit.internal.runners.JUnit38ClassRunner.run(JUnit38ClassRunner.java:86)
	at org.apache.maven.surefire.junit4.JUnit4Provider.execute(JUnit4Provider.java:252)
	at org.apache.maven.surefire.junit4.JUnit4Provider.executeTestSet(JUnit4Provider.java:141)
	at org.apache.maven.surefire.junit4.JUnit4Provider.invoke(JUnit4Provider.java:112)
	at java.base/jdk.internal.reflect.NativeMethodAccessorImpl.invoke0(Native Method)
	at java.base/jdk.internal.reflect.NativeMethodAccessorImpl.invoke(NativeMethodAccessorImpl.java:62)
	at java.base/jdk.internal.reflect.DelegatingMethodAccessorImpl.invoke(DelegatingMethodAccessorImpl.java:43)
	at java.base/java.lang.reflect.Method.invoke(Method.java:566)
	at org.apache.maven.surefire.util.ReflectionUtils.invokeMethodWithArray(ReflectionUtils.java:189)
	at org.apache.maven.surefire.booter.ProviderFactory$ProviderProxy.invoke(ProviderFactory.java:165)
	at org.apache.maven.surefire.booter.ProviderFactory.invokeProvider(ProviderFactory.java:85)
	at org.apache.maven.surefire.booter.ForkedBooter.runSuitesInProcess(ForkedBooter.java:115)
	at org.apache.maven.surefire.booter.ForkedBooter.main(ForkedBooter.java:75)


FAILED:  org.apache.maven.plugins.surefire.report.SurefireReportMojoTest.testSurefireReportNestedClassTrimStackTrace

Error Message:
Could not initialize class org.apache.commons.lang.SystemUtils

Stack Trace:
java.lang.NoClassDefFoundError: Could not initialize class org.apache.commons.lang.SystemUtils
	at org.apache.maven.doxia.siterenderer.DefaultSiteRenderer.generateDocument(DefaultSiteRenderer.java:732)
	at org.apache.maven.reporting.AbstractMavenReport.execute(AbstractMavenReport.java:154)
	at org.apache.maven.plugins.surefire.report.SurefireReportMojoTest.testSurefireReportNestedClassTrimStackTrace(SurefireReportMojoTest.java:321)
	at java.base/jdk.internal.reflect.NativeMethodAccessorImpl.invoke0(Native Method)
	at java.base/jdk.internal.reflect.NativeMethodAccessorImpl.invoke(NativeMethodAccessorImpl.java:62)
	at java.base/jdk.internal.reflect.DelegatingMethodAccessorImpl.invoke(DelegatingMethodAccessorImpl.java:43)
	at java.base/java.lang.reflect.Method.invoke(Method.java:566)
	at junit.framework.TestCase.runTest(TestCase.java:176)
	at junit.framework.TestCase.runBare(TestCase.java:141)
	at junit.framework.TestResult$1.protect(TestResult.java:122)
	at junit.framework.TestResult.runProtected(TestResult.java:142)
	at junit.framework.TestResult.run(TestResult.java:125)
	at junit.framework.TestCase.run(TestCase.java:129)
	at junit.framework.TestSuite.runTest(TestSuite.java:252)
	at junit.framework.TestSuite.run(TestSuite.java:247)
	at org.junit.internal.runners.JUnit38ClassRunner.run(JUnit38ClassRunner.java:86)
	at org.apache.maven.surefire.junit4.JUnit4Provider.execute(JUnit4Provider.java:252)
	at org.apache.maven.surefire.junit4.JUnit4Provider.executeTestSet(JUnit4Provider.java:141)
	at org.apache.maven.surefire.junit4.JUnit4Provider.invoke(JUnit4Provider.java:112)
	at java.base/jdk.internal.reflect.NativeMethodAccessorImpl.invoke0(Native Method)
	at java.base/jdk.internal.reflect.NativeMethodAccessorImpl.invoke(NativeMethodAccessorImpl.java:62)
	at java.base/jdk.internal.reflect.DelegatingMethodAccessorImpl.invoke(DelegatingMethodAccessorImpl.java:43)
	at java.base/java.lang.reflect.Method.invoke(Method.java:566)
	at org.apache.maven.surefire.util.ReflectionUtils.invokeMethodWithArray(ReflectionUtils.java:189)
	at org.apache.maven.surefire.booter.ProviderFactory$ProviderProxy.invoke(ProviderFactory.java:165)
	at org.apache.maven.surefire.booter.ProviderFactory.invokeProvider(ProviderFactory.java:85)
	at org.apache.maven.surefire.booter.ForkedBooter.runSuitesInProcess(ForkedBooter.java:115)
	at org.apache.maven.surefire.booter.ForkedBooter.main(ForkedBooter.java:75)


FAILED:  org.apache.maven.plugins.surefire.report.SurefireReportMojoTest.testBasicSurefireReport_AnchorTestCases

Error Message:
Could not initialize class org.apache.commons.lang.SystemUtils

Stack Trace:
java.lang.NoClassDefFoundError: Could not initialize class org.apache.commons.lang.SystemUtils
	at org.apache.maven.doxia.siterenderer.DefaultSiteRenderer.generateDocument(DefaultSiteRenderer.java:732)
	at org.apache.maven.reporting.AbstractMavenReport.execute(AbstractMavenReport.java:154)
	at org.apache.maven.plugins.surefire.report.SurefireReportMojoTest.testBasicSurefireReport_AnchorTestCases(SurefireReportMojoTest.java:211)
	at java.base/jdk.internal.reflect.NativeMethodAccessorImpl.invoke0(Native Method)
	at java.base/jdk.internal.reflect.NativeMethodAccessorImpl.invoke(NativeMethodAccessorImpl.java:62)
	at java.base/jdk.internal.reflect.DelegatingMethodAccessorImpl.invoke(DelegatingMethodAccessorImpl.java:43)
	at java.base/java.lang.reflect.Method.invoke(Method.java:566)
	at junit.framework.TestCase.runTest(TestCase.java:176)
	at junit.framework.TestCase.runBare(TestCase.java:141)
	at junit.framework.TestResult$1.protect(TestResult.java:122)
	at junit.framework.TestResult.runProtected(TestResult.java:142)
	at junit.framework.TestResult.run(TestResult.java:125)
	at junit.framework.TestCase.run(TestCase.java:129)
	at junit.framework.TestSuite.runTest(TestSuite.java:252)
	at junit.framework.TestSuite.run(TestSuite.java:247)
	at org.junit.internal.runners.JUnit38ClassRunner.run(JUnit38ClassRunner.java:86)
	at org.apache.maven.surefire.junit4.JUnit4Provider.execute(JUnit4Provider.java:252)
	at org.apache.maven.surefire.junit4.JUnit4Provider.executeTestSet(JUnit4Provider.java:141)
	at org.apache.maven.surefire.junit4.JUnit4Provider.invoke(JUnit4Provider.java:112)
	at java.base/jdk.internal.reflect.NativeMethodAccessorImpl.invoke0(Native Method)
	at java.base/jdk.internal.reflect.NativeMethodAccessorImpl.invoke(NativeMethodAccessorImpl.java:62)
	at java.base/jdk.internal.reflect.DelegatingMethodAccessorImpl.invoke(DelegatingMethodAccessorImpl.java:43)
	at java.base/java.lang.reflect.Method.invoke(Method.java:566)
	at org.apache.maven.surefire.util.ReflectionUtils.invokeMethodWithArray(ReflectionUtils.java:189)
	at org.apache.maven.surefire.booter.ProviderFactory$ProviderProxy.invoke(ProviderFactory.java:165)
	at org.apache.maven.surefire.booter.ProviderFactory.invokeProvider(ProviderFactory.java:85)
	at org.apache.maven.surefire.booter.ForkedBooter.runSuitesInProcess(ForkedBooter.java:115)
	at org.apache.maven.surefire.booter.ForkedBooter.main(ForkedBooter.java:75)


FAILED:  org.apache.maven.plugins.surefire.report.SurefireReportMojoTest.testBasicSurefireReportIfShowSuccessIsFalse

Error Message:
Could not initialize class org.apache.commons.lang.SystemUtils

Stack Trace:
java.lang.NoClassDefFoundError: Could not initialize class org.apache.commons.lang.SystemUtils
	at org.apache.maven.doxia.siterenderer.DefaultSiteRenderer.generateDocument(DefaultSiteRenderer.java:732)
	at org.apache.maven.reporting.AbstractMavenReport.execute(AbstractMavenReport.java:154)
	at org.apache.maven.plugins.surefire.report.SurefireReportMojoTest.testBasicSurefireReportIfShowSuccessIsFalse(SurefireReportMojoTest.java:132)
	at java.base/jdk.internal.reflect.NativeMethodAccessorImpl.invoke0(Native Method)
	at java.base/jdk.internal.reflect.NativeMethodAccessorImpl.invoke(NativeMethodAccessorImpl.java:62)
	at java.base/jdk.internal.reflect.DelegatingMethodAccessorImpl.invoke(DelegatingMethodAccessorImpl.java:43)
	at java.base/java.lang.reflect.Method.invoke(Method.java:566)
	at junit.framework.TestCase.runTest(TestCase.java:176)
	at junit.framework.TestCase.runBare(TestCase.java:141)
	at junit.framework.TestResult$1.protect(TestResult.java:122)
	at junit.framework.TestResult.runProtected(TestResult.java:142)
	at junit.framework.TestResult.run(TestResult.java:125)
	at junit.framework.TestCase.run(TestCase.java:129)
	at junit.framework.TestSuite.runTest(TestSuite.java:252)
	at junit.framework.TestSuite.run(TestSuite.java:247)
	at org.junit.internal.runners.JUnit38ClassRunner.run(JUnit38ClassRunner.java:86)
	at org.apache.maven.surefire.junit4.JUnit4Provider.execute(JUnit4Provider.java:252)
	at org.apache.maven.surefire.junit4.JUnit4Provider.executeTestSet(JUnit4Provider.java:141)
	at org.apache.maven.surefire.junit4.JUnit4Provider.invoke(JUnit4Provider.java:112)
	at java.base/jdk.internal.reflect.NativeMethodAccessorImpl.invoke0(Native Method)
	at java.base/jdk.internal.reflect.NativeMethodAccessorImpl.invoke(NativeMethodAccessorImpl.java:62)
	at java.base/jdk.internal.reflect.DelegatingMethodAccessorImpl.invoke(DelegatingMethodAccessorImpl.java:43)
	at java.base/java.lang.reflect.Method.invoke(Method.java:566)
	at org.apache.maven.surefire.util.ReflectionUtils.invokeMethodWithArray(ReflectionUtils.java:189)
	at org.apache.maven.surefire.booter.ProviderFactory$ProviderProxy.invoke(ProviderFactory.java:165)
	at org.apache.maven.surefire.booter.ProviderFactory.invokeProvider(ProviderFactory.java:85)
	at org.apache.maven.surefire.booter.ForkedBooter.runSuitesInProcess(ForkedBooter.java:115)
	at org.apache.maven.surefire.booter.ForkedBooter.main(ForkedBooter.java:75)


FAILED:  org.apache.maven.plugins.surefire.report.SurefireReportMojoTest.testSurefireReportNestedClass

Error Message:
Could not initialize class org.apache.commons.lang.SystemUtils

Stack Trace:
java.lang.NoClassDefFoundError: Could not initialize class org.apache.commons.lang.SystemUtils
	at org.apache.maven.doxia.siterenderer.DefaultSiteRenderer.generateDocument(DefaultSiteRenderer.java:732)
	at org.apache.maven.reporting.AbstractMavenReport.execute(AbstractMavenReport.java:154)
	at org.apache.maven.plugins.surefire.report.SurefireReportMojoTest.testSurefireReportNestedClass(SurefireReportMojoTest.java:384)
	at java.base/jdk.internal.reflect.NativeMethodAccessorImpl.invoke0(Native Method)
	at java.base/jdk.internal.reflect.NativeMethodAccessorImpl.invoke(NativeMethodAccessorImpl.java:62)
	at java.base/jdk.internal.reflect.DelegatingMethodAccessorImpl.invoke(DelegatingMethodAccessorImpl.java:43)
	at java.base/java.lang.reflect.Method.invoke(Method.java:566)
	at junit.framework.TestCase.runTest(TestCase.java:176)
	at junit.framework.TestCase.runBare(TestCase.java:141)
	at junit.framework.TestResult$1.protect(TestResult.java:122)
	at junit.framework.TestResult.runProtected(TestResult.java:142)
	at junit.framework.TestResult.run(TestResult.java:125)
	at junit.framework.TestCase.run(TestCase.java:129)
	at junit.framework.TestSuite.runTest(TestSuite.java:252)
	at junit.framework.TestSuite.run(TestSuite.java:247)
	at org.junit.internal.runners.JUnit38ClassRunner.run(JUnit38ClassRunner.java:86)
	at org.apache.maven.surefire.junit4.JUnit4Provider.execute(JUnit4Provider.java:252)
	at org.apache.maven.surefire.junit4.JUnit4Provider.executeTestSet(JUnit4Provider.java:141)
	at org.apache.maven.surefire.junit4.JUnit4Provider.invoke(JUnit4Provider.java:112)
	at java.base/jdk.internal.reflect.NativeMethodAccessorImpl.invoke0(Native Method)
	at java.base/jdk.internal.reflect.NativeMethodAccessorImpl.invoke(NativeMethodAccessorImpl.java:62)
	at java.base/jdk.internal.reflect.DelegatingMethodAccessorImpl.invoke(DelegatingMethodAccessorImpl.java:43)
	at java.base/java.lang.reflect.Method.invoke(Method.java:566)
	at org.apache.maven.surefire.util.ReflectionUtils.invokeMethodWithArray(ReflectionUtils.java:189)
	at org.apache.maven.surefire.booter.ProviderFactory$ProviderProxy.invoke(ProviderFactory.java:165)
	at org.apache.maven.surefire.booter.ProviderFactory.invokeProvider(ProviderFactory.java:85)
	at org.apache.maven.surefire.booter.ForkedBooter.runSuitesInProcess(ForkedBooter.java:115)
	at org.apache.maven.surefire.booter.ForkedBooter.main(ForkedBooter.java:75)


FAILED:  org.apache.maven.plugins.surefire.report.SurefireReportMojoTest.testSurefireReportSingleError

Error Message:
Could not initialize class org.apache.commons.lang.SystemUtils

Stack Trace:
java.lang.NoClassDefFoundError: Could not initialize class org.apache.commons.lang.SystemUtils
	at org.apache.maven.doxia.siterenderer.DefaultSiteRenderer.generateDocument(DefaultSiteRenderer.java:732)
	at org.apache.maven.reporting.AbstractMavenReport.execute(AbstractMavenReport.java:154)
	at org.apache.maven.plugins.surefire.report.SurefireReportMojoTest.testSurefireReportSingleError(SurefireReportMojoTest.java:236)
	at java.base/jdk.internal.reflect.NativeMethodAccessorImpl.invoke0(Native Method)
	at java.base/jdk.internal.reflect.NativeMethodAccessorImpl.invoke(NativeMethodAccessorImpl.java:62)
	at java.base/jdk.internal.reflect.DelegatingMethodAccessorImpl.invoke(DelegatingMethodAccessorImpl.java:43)
	at java.base/java.lang.reflect.Method.invoke(Method.java:566)
	at junit.framework.TestCase.runTest(TestCase.java:176)
	at junit.framework.TestCase.runBare(TestCase.java:141)
	at junit.framework.TestResult$1.protect(TestResult.java:122)
	at junit.framework.TestResult.runProtected(TestResult.java:142)
	at junit.framework.TestResult.run(TestResult.java:125)
	at junit.framework.TestCase.run(TestCase.java:129)
	at junit.framework.TestSuite.runTest(TestSuite.java:252)
	at junit.framework.TestSuite.run(TestSuite.java:247)
	at org.junit.internal.runners.JUnit38ClassRunner.run(JUnit38ClassRunner.java:86)
	at org.apache.maven.surefire.junit4.JUnit4Provider.execute(JUnit4Provider.java:252)
	at org.apache.maven.surefire.junit4.JUnit4Provider.executeTestSet(JUnit4Provider.java:141)
	at org.apache.maven.surefire.junit4.JUnit4Provider.invoke(JUnit4Provider.java:112)
	at java.base/jdk.internal.reflect.NativeMethodAccessorImpl.invoke0(Native Method)
	at java.base/jdk.internal.reflect.NativeMethodAccessorImpl.invoke(NativeMethodAccessorImpl.java:62)
	at java.base/jdk.internal.reflect.DelegatingMethodAccessorImpl.invoke(DelegatingMethodAccessorImpl.java:43)
	at java.base/java.lang.reflect.Method.invoke(Method.java:566)
	at org.apache.maven.surefire.util.ReflectionUtils.invokeMethodWithArray(ReflectionUtils.java:189)
	at org.apache.maven.surefire.booter.ProviderFactory$ProviderProxy.invoke(ProviderFactory.java:165)
	at org.apache.maven.surefire.booter.ProviderFactory.invokeProvider(ProviderFactory.java:85)
	at org.apache.maven.surefire.booter.ForkedBooter.runSuitesInProcess(ForkedBooter.java:115)
	at org.apache.maven.surefire.booter.ForkedBooter.main(ForkedBooter.java:75)




Build log:
[...truncated 15.51 MB...]
[windows-jdk7-maven3.5.x] Running org.apache.maven.surefire.its.jiras.Surefire943ReportContentIT
[windows-jdk7-maven3.5.x] Tests run: 2, Failures: 0, Errors: 0, Skipped: 0, Time elapsed: 30.836 sec
[windows-jdk8-maven3.5.x] Running org.apache.maven.surefire.its.jiras.Surefire818NpeIgnoresTestsIT
[windows-jdk8-maven3.5.x] Tests run: 1, Failures: 0, Errors: 0, Skipped: 0, Time elapsed: 16.69 sec
[windows-jdk7-maven3.5.x] Running org.apache.maven.surefire.its.jiras.Surefire946KillMainProcessInReusableForkIT
[windows-jdk7-maven3.5.x] Tests run: 3, Failures: 0, Errors: 0, Skipped: 0, Time elapsed: 25.367 sec
[windows-jdk7-maven3.5.x] Running org.apache.maven.surefire.its.jiras.Surefire972BizarreNoClassDefIT
[windows-jdk7-maven3.5.x] Tests run: 1, Failures: 0, Errors: 0, Skipped: 0, Time elapsed: 17.77 sec
[windows-jdk7-maven3.5.x] Running org.apache.maven.surefire.its.jiras.Surefire975DefaultVMEncodingIT
[windows-jdk7-maven3.5.x] Tests run: 1, Failures: 0, Errors: 0, Skipped: 0, Time elapsed: 15.915 sec
[windows-jdk8-maven3.5.x] Running org.apache.maven.surefire.its.jiras.Surefire828EmptyGroupExprIT
[windows-jdk8-maven3.5.x] Tests run: 4, Failures: 0, Errors: 0, Skipped: 0, Time elapsed: 61.646 sec
[windows-jdk7-maven3.5.x] Running org.apache.maven.surefire.its.jiras.Surefire979WrongClassLoaderIT
[windows-jdk7-maven3.5.x] Tests run: 1, Failures: 0, Errors: 0, Skipped: 0, Time elapsed: 15.169 sec
[windows-jdk7-maven3.5.x] Running org.apache.maven.surefire.its.jiras.Surefire985ParameterizedRunnerAndCategoriesIT
[windows-jdk7-maven3.5.x] Tests run: 1, Failures: 0, Errors: 0, Skipped: 0, Time elapsed: 5.168 sec
[windows-jdk8-maven3.5.x] Running org.apache.maven.surefire.its.jiras.Surefire832ProviderSelectionIT
[windows-jdk8-maven3.5.x] Tests run: 1, Failures: 0, Errors: 0, Skipped: 0, Time elapsed: 15.116 sec
[windows-jdk7-maven3.5.x] Running org.apache.maven.surefire.its.ModulePathIT
[windows-jdk7-maven3.5.x] Tests run: 1, Failures: 0, Errors: 0, Skipped: 1, Time elapsed: 0 sec
[windows-jdk7-maven3.5.x] Running org.apache.maven.surefire.its.JUnitPlatformIT
[windows-jdk7-maven3.5.x] Tests run: 5, Failures: 0, Errors: 0, Skipped: 5, Time elapsed: 0 sec
[windows-jdk7-maven3.5.x] Running org.apache.maven.surefire.its.jiras.Surefire1295AttributeJvmCrashesToTestsIT
[windows-jdk7-maven3.5.x] Tests run: 9, Failures: 0, Errors: 0, Skipped: 9, Time elapsed: 0.002 sec
[windows-jdk7-maven3.5.x] Running org.apache.maven.surefire.its.jiras.Surefire1265Java9IT
[windows-jdk7-maven3.5.x] Tests run: 1, Failures: 0, Errors: 0, Skipped: 1, Time elapsed: 0.001 sec
[windows-jdk7-maven3.5.x] Running org.apache.maven.surefire.its.JUnitPlatformEnginesIT
[windows-jdk7-maven3.5.x] Tests run: 10, Failures: 0, Errors: 0, Skipped: 10, Time elapsed: 0.005 sec
[windows-jdk7-maven3.5.x] Running org.apache.maven.surefire.its.TestMultipleMethodPatternsIT
[windows-jdk7-maven3.5.x] Tests run: 180, Failures: 0, Errors: 0, Skipped: 87, Time elapsed: 497.422 sec
[windows-jdk7-maven3.5.x] Running org.apache.maven.surefire.its.jiras.Surefire260TestWithIdenticalNamesIT
[windows-jdk7-maven3.5.x] Tests run: 1, Failures: 0, Errors: 0, Skipped: 1, Time elapsed: 0 sec
[windows-jdk7-maven3.5.x] Running org.apache.maven.surefire.its.jiras.Surefire995CategoryInheritanceIT
[windows-jdk7-maven3.5.x] Tests run: 5, Failures: 0, Errors: 0, Skipped: 0, Time elapsed: 26.404 sec
[windows-jdk7-maven3.5.x] Running org.apache.maven.surefire.its.TestMultipleMethodPatternsTestNGIT
[windows-jdk7-maven3.5.x] Tests run: 90, Failures: 0, Errors: 0, Skipped: 41, Time elapsed: 256.137 sec
[windows-jdk7-maven3.5.x] Running org.apache.maven.surefire.its.Java9FullApiIT
[windows-jdk7-maven3.5.x] Tests run: 3, Failures: 0, Errors: 0, Skipped: 3, Time elapsed: 0.011 sec
[windows-jdk7-maven3.5.x] 
[windows-jdk7-maven3.5.x] Results :
[windows-jdk7-maven3.5.x] 
[windows-jdk7-maven3.5.x] Tests run: 780, Failures: 0, Errors: 0, Skipped: 162
[windows-jdk7-maven3.5.x] 
[windows-jdk7-maven3.5.x] [INFO] 
[windows-jdk7-maven3.5.x] [INFO] --- maven-checkstyle-plugin:3.0.0:check (checkstyle-check) @ surefire-its ---
[windows-jdk7-maven3.5.x] [INFO] 
[windows-jdk7-maven3.5.x] [INFO] --- maven-failsafe-plugin:2.12.4:verify (default) @ surefire-its ---
[windows-jdk7-maven3.5.x] [INFO] Failsafe report directory: F:\jenkins\jenkins-slave\workspace\box_maven-surefire_3.0.0-M1-VOMECAKSVISJOPKETIPDSWOOERZ2GRJICZTDYCTKUOMZVRQP4WVQ@2\surefire-its\target\failsafe-reports
[windows-jdk7-maven3.5.x] [INFO] 
[windows-jdk7-maven3.5.x] [INFO] --- maven-install-plugin:2.5.2:install (default-install) @ surefire-its ---
[windows-jdk7-maven3.5.x] [INFO] Skipping artifact installation
[windows-jdk7-maven3.5.x] [INFO] 
[windows-jdk7-maven3.5.x] [INFO] --- jacoco-maven-plugin:0.8.2:report (default-cli) @ surefire-its ---
[windows-jdk7-maven3.5.x] [INFO] Skipping JaCoCo execution because property jacoco.skip is set.
[windows-jdk7-maven3.5.x] [INFO] ------------------------------------------------------------------------
[windows-jdk7-maven3.5.x] [INFO] Reactor Summary:
[windows-jdk7-maven3.5.x] [INFO] 
[windows-jdk7-maven3.5.x] [INFO] Apache Maven Surefire .............................. SUCCESS [ 37.467 s]
[windows-jdk7-maven3.5.x] [INFO] SureFire Logger API ................................ SUCCESS [  8.299 s]
[windows-jdk7-maven3.5.x] [INFO] SureFire API ....................................... SUCCESS [ 16.806 s]
[windows-jdk7-maven3.5.x] [INFO] ShadeFire JUnit3 Provider .......................... SUCCESS [  1.828 s]
[windows-jdk7-maven3.5.x] [INFO] SureFire Booter .................................... SUCCESS [ 14.943 s]
[windows-jdk7-maven3.5.x] [INFO] Maven Surefire Test-Grouping Support ............... SUCCESS [  9.334 s]
[windows-jdk7-maven3.5.x] [INFO] SureFire Providers ................................. SUCCESS [  1.257 s]
[windows-jdk7-maven3.5.x] [INFO] Shared JUnit3 Provider Code ........................ SUCCESS [  5.022 s]
[windows-jdk7-maven3.5.x] [INFO] Shared Java 5 Provider Base ........................ SUCCESS [  5.994 s]
[windows-jdk7-maven3.5.x] [INFO] Shared JUnit4 Provider Code ........................ SUCCESS [  6.271 s]
[windows-jdk7-maven3.5.x] [INFO] Shared JUnit48 Provider Code ....................... SUCCESS [  7.192 s]
[windows-jdk7-maven3.5.x] [INFO] SureFire JUnit Runner .............................. SUCCESS [  5.256 s]
[windows-jdk7-maven3.5.x] [INFO] SureFire JUnit4 Runner ............................. SUCCESS [  5.923 s]
[windows-jdk7-maven3.5.x] [INFO] Maven Surefire Common .............................. SUCCESS [ 33.843 s]
[windows-jdk7-maven3.5.x] [INFO] SureFire JUnitCore Runner .......................... SUCCESS [02:17 min]
[windows-jdk7-maven3.5.x] [INFO] SureFire JUnit Platform Runner ..................... SUCCESS [  9.804 s]
[windows-jdk7-maven3.5.x] [INFO] SureFire TestNG Utils .............................. SUCCESS [  5.665 s]
[windows-jdk7-maven3.5.x] [INFO] SureFire TestNG Runner ............................. SUCCESS [  6.256 s]
[windows-jdk7-maven3.5.x] [INFO] Surefire Report Parser ............................. SUCCESS [  6.745 s]
[windows-jdk7-maven3.5.x] [INFO] Maven Surefire Plugin .............................. SUCCESS [ 14.765 s]
[windows-jdk7-maven3.5.x] [INFO] Maven Failsafe Plugin .............................. SUCCESS [02:35 min]
[windows-jdk7-maven3.5.x] [INFO] Maven Surefire Report Plugin ....................... SUCCESS [ 19.613 s]
[windows-jdk7-maven3.5.x] [INFO] Maven Surefire Integration Tests ................... SUCCESS [  02:08 h]
[windows-jdk7-maven3.5.x] [INFO] ------------------------------------------------------------------------
[windows-jdk7-maven3.5.x] [INFO] BUILD SUCCESS
[windows-jdk7-maven3.5.x] [INFO] ------------------------------------------------------------------------
[windows-jdk7-maven3.5.x] [INFO] Total time: 02:17 h
[windows-jdk7-maven3.5.x] [INFO] Finished at: 2018-10-29T18:51:45-07:00
[windows-jdk7-maven3.5.x] [INFO] Final Memory: 50M/168M
[windows-jdk7-maven3.5.x] [INFO] ------------------------------------------------------------------------
[Pipeline] [windows-jdk7-maven3.5.x] }
[Pipeline] [windows-jdk7-maven3.5.x] // withEnv
[Pipeline] [windows-jdk7-maven3.5.x] }
[Pipeline] [windows-jdk7-maven3.5.x] // stage
[Pipeline] [windows-jdk7-maven3.5.x] stage
[Pipeline] [windows-jdk7-maven3.5.x] { (reporting windows-jdk7-maven3.5.x)
[Pipeline] [windows-jdk7-maven3.5.x] fileExists
[Pipeline] [windows-jdk7-maven3.5.x] zip
[windows-jdk7-maven3.5.x] Writing zip file of f:\jenkins\jenkins-slave\workspace\box_maven-surefire_3.0.0-M1-VOMECAKSVISJOPKETIPDSWOOERZ2GRJICZTDYCTKUOMZVRQP4WVQ@2\maven-failsafe-plugin\target\it to f:\jenkins\jenkins-slave\workspace\box_maven-surefire_3.0.0-M1-VOMECAKSVISJOPKETIPDSWOOERZ2GRJICZTDYCTKUOMZVRQP4WVQ@2\maven-failsafe-plugin--windows-jdk7-maven3.5.x.zip
[windows-jdk7-maven3.5.x] Zipped 78 entries.
[windows-jdk7-maven3.5.x] Archiving f:\jenkins\jenkins-slave\workspace\box_maven-surefire_3.0.0-M1-VOMECAKSVISJOPKETIPDSWOOERZ2GRJICZTDYCTKUOMZVRQP4WVQ@2\maven-failsafe-plugin--windows-jdk7-maven3.5.x.zip
[Pipeline] [windows-jdk7-maven3.5.x] fileExists
[Pipeline] [windows-jdk7-maven3.5.x] zip
[windows-jdk7-maven3.5.x] Writing zip file of f:\jenkins\jenkins-slave\workspace\box_maven-surefire_3.0.0-M1-VOMECAKSVISJOPKETIPDSWOOERZ2GRJICZTDYCTKUOMZVRQP4WVQ@2\surefire-its\target to f:\jenkins\jenkins-slave\workspace\box_maven-surefire_3.0.0-M1-VOMECAKSVISJOPKETIPDSWOOERZ2GRJICZTDYCTKUOMZVRQP4WVQ@2\surefire-its--windows-jdk7-maven3.5.x.zip
[windows-jdk8-maven3.5.x] Running org.apache.maven.surefire.its.jiras.Surefire839TestWithoutCategoriesIT
[windows-jdk8-maven3.5.x] Tests run: 2, Failures: 0, Errors: 0, Skipped: 0, Time elapsed: 30.822 sec
[windows-jdk7-maven3.5.x] Zipped 15700 entries.
[windows-jdk7-maven3.5.x] Archiving f:\jenkins\jenkins-slave\workspace\box_maven-surefire_3.0.0-M1-VOMECAKSVISJOPKETIPDSWOOERZ2GRJICZTDYCTKUOMZVRQP4WVQ@2\surefire-its--windows-jdk7-maven3.5.x.zip
[Pipeline] [windows-jdk7-maven3.5.x] archiveArtifacts
[windows-jdk7-maven3.5.x] Archiving artifacts
[Pipeline] [windows-jdk7-maven3.5.x] }
[Pipeline] [windows-jdk7-maven3.5.x] // stage
[Pipeline] [windows-jdk7-maven3.5.x] stage
[Pipeline] [windows-jdk7-maven3.5.x] { (cleanup windows-jdk7-maven3.5.x)
[Pipeline] [windows-jdk7-maven3.5.x] cleanWs
[windows-jdk7-maven3.5.x] [WS-CLEANUP] Deleting project workspace...[WS-CLEANUP] done
[Pipeline] [windows-jdk7-maven3.5.x] }
[Pipeline] [windows-jdk7-maven3.5.x] // stage
[Pipeline] [windows-jdk7-maven3.5.x] }
[Pipeline] [windows-jdk7-maven3.5.x] // timestamps
[Pipeline] [windows-jdk7-maven3.5.x] }
[Pipeline] [windows-jdk7-maven3.5.x] // node
[Pipeline] [windows-jdk7-maven3.5.x] }
[windows-jdk8-maven3.5.x] Running org.apache.maven.surefire.its.jiras.Surefire847AdditionalFailureIT
[windows-jdk8-maven3.5.x] Tests run: 1, Failures: 0, Errors: 0, Skipped: 0, Time elapsed: 16.446 sec
[windows-jdk8-maven3.5.x] Running org.apache.maven.surefire.its.jiras.Surefire855AllowFailsafeUseArtifactFileIT
[windows-jdk8-maven3.5.x] Tests run: 4, Failures: 0, Errors: 0, Skipped: 0, Time elapsed: 83.523 sec
[windows-jdk8-maven3.5.x] Running org.apache.maven.surefire.its.jiras.Surefire901MIssingResultfileWhenNoTestsIT
[windows-jdk8-maven3.5.x] Tests run: 1, Failures: 0, Errors: 0, Skipped: 0, Time elapsed: 4.842 sec
[windows-jdk8-maven3.5.x] Running org.apache.maven.surefire.its.jiras.Surefire907PerThreadWithoutThreadCountIT
[windows-jdk8-maven3.5.x] Tests run: 1, Failures: 0, Errors: 0, Skipped: 0, Time elapsed: 4.708 sec
[windows-jdk8-maven3.5.x] Running org.apache.maven.surefire.its.jiras.Surefire920TestFailureIgnoreWithTimeoutIT
[windows-jdk8-maven3.5.x] Tests run: 2, Failures: 0, Errors: 0, Skipped: 0, Time elapsed: 30.935 sec
[windows-jdk8-maven3.5.x] Running org.apache.maven.surefire.its.jiras.Surefire926FailureWith2ProvidersIT
[windows-jdk8-maven3.5.x] Tests run: 1, Failures: 0, Errors: 0, Skipped: 0, Time elapsed: 26.719 sec
[windows-jdk8-maven3.5.x] Running org.apache.maven.surefire.its.jiras.Surefire930TestNgSuiteXmlIT
[windows-jdk8-maven3.5.x] Tests run: 1, Failures: 0, Errors: 0, Skipped: 0, Time elapsed: 15.929 sec
[windows-jdk8-maven3.5.x] Running org.apache.maven.surefire.its.jiras.Surefire943ReportContentIT
[windows-jdk8-maven3.5.x] Tests run: 2, Failures: 0, Errors: 0, Skipped: 0, Time elapsed: 30.911 sec
[windows-jdk8-maven3.5.x] Running org.apache.maven.surefire.its.jiras.Surefire946KillMainProcessInReusableForkIT
[windows-jdk8-maven3.5.x] Tests run: 3, Failures: 0, Errors: 0, Skipped: 0, Time elapsed: 25.093 sec
[windows-jdk8-maven3.5.x] Running org.apache.maven.surefire.its.jiras.Surefire972BizarreNoClassDefIT
[windows-jdk8-maven3.5.x] Tests run: 1, Failures: 0, Errors: 0, Skipped: 0, Time elapsed: 18.406 sec
[windows-jdk8-maven3.5.x] Running org.apache.maven.surefire.its.jiras.Surefire975DefaultVMEncodingIT
[windows-jdk8-maven3.5.x] Tests run: 1, Failures: 0, Errors: 0, Skipped: 0, Time elapsed: 15.394 sec
[windows-jdk8-maven3.5.x] Running org.apache.maven.surefire.its.jiras.Surefire979WrongClassLoaderIT
[windows-jdk8-maven3.5.x] Tests run: 1, Failures: 0, Errors: 0, Skipped: 0, Time elapsed: 15.431 sec
[windows-jdk8-maven3.5.x] Running org.apache.maven.surefire.its.jiras.Surefire985ParameterizedRunnerAndCategoriesIT
[windows-jdk8-maven3.5.x] Tests run: 1, Failures: 0, Errors: 0, Skipped: 0, Time elapsed: 5.472 sec
[windows-jdk8-maven3.5.x] Running org.apache.maven.surefire.its.jiras.Surefire995CategoryInheritanceIT
[windows-jdk8-maven3.5.x] Tests run: 5, Failures: 0, Errors: 0, Skipped: 0, Time elapsed: 27.727 sec
[windows-jdk8-maven3.5.x] Running org.apache.maven.surefire.its.jiras.Surefire1265Java9IT
[windows-jdk8-maven3.5.x] Tests run: 1, Failures: 0, Errors: 0, Skipped: 1, Time elapsed: 0.001 sec
[windows-jdk8-maven3.5.x] Running org.apache.maven.surefire.its.jiras.Surefire1295AttributeJvmCrashesToTestsIT
[windows-jdk8-maven3.5.x] Tests run: 9, Failures: 0, Errors: 0, Skipped: 9, Time elapsed: 0.002 sec
[windows-jdk8-maven3.5.x] Running org.apache.maven.surefire.its.TestMultipleMethodPatternsTestNGIT
[windows-jdk8-maven3.5.x] Tests run: 90, Failures: 0, Errors: 0, Skipped: 41, Time elapsed: 282.295 sec
[windows-jdk8-maven3.5.x] Running org.apache.maven.surefire.its.Java9FullApiIT
[windows-jdk8-maven3.5.x] Tests run: 3, Failures: 0, Errors: 0, Skipped: 3, Time elapsed: 0.009 sec
[windows-jdk8-maven3.5.x] Running org.apache.maven.surefire.its.TestMultipleMethodPatternsIT
[windows-jdk8-maven3.5.x] Tests run: 180, Failures: 0, Errors: 0, Skipped: 87, Time elapsed: 510.613 sec
[windows-jdk8-maven3.5.x] Running org.apache.maven.surefire.its.ModulePathIT
[windows-jdk8-maven3.5.x] Tests run: 1, Failures: 0, Errors: 0, Skipped: 1, Time elapsed: 0.001 sec
[windows-jdk8-maven3.5.x] 
[windows-jdk8-maven3.5.x] Results :
[windows-jdk8-maven3.5.x] 
[windows-jdk8-maven3.5.x] Tests run: 780, Failures: 0, Errors: 0, Skipped: 146
[windows-jdk8-maven3.5.x] 
[windows-jdk8-maven3.5.x] [INFO] 
[windows-jdk8-maven3.5.x] [INFO] --- maven-checkstyle-plugin:3.0.0:check (checkstyle-check) @ surefire-its ---
[windows-jdk8-maven3.5.x] [INFO] 
[windows-jdk8-maven3.5.x] [INFO] --- maven-failsafe-plugin:2.12.4:verify (default) @ surefire-its ---
[windows-jdk8-maven3.5.x] [INFO] Failsafe report directory: F:\jenkins\jenkins-slave\workspace\box_maven-surefire_3.0.0-M1-VOMECAKSVISJOPKETIPDSWOOERZ2GRJICZTDYCTKUOMZVRQP4WVQ\surefire-its\target\failsafe-reports
[windows-jdk8-maven3.5.x] [INFO] 
[windows-jdk8-maven3.5.x] [INFO] --- maven-install-plugin:2.5.2:install (default-install) @ surefire-its ---
[windows-jdk8-maven3.5.x] [INFO] Skipping artifact installation
[windows-jdk8-maven3.5.x] [INFO] 
[windows-jdk8-maven3.5.x] [INFO] --- jacoco-maven-plugin:0.8.2:report (default-cli) @ surefire-its ---
[windows-jdk8-maven3.5.x] [INFO] Skipping JaCoCo execution because property jacoco.skip is set.
[windows-jdk8-maven3.5.x] [INFO] ------------------------------------------------------------------------
[windows-jdk8-maven3.5.x] [INFO] Reactor Summary:
[windows-jdk8-maven3.5.x] [INFO] 
[windows-jdk8-maven3.5.x] [INFO] Apache Maven Surefire .............................. SUCCESS [ 35.142 s]
[windows-jdk8-maven3.5.x] [INFO] SureFire Logger API ................................ SUCCESS [  8.248 s]
[windows-jdk8-maven3.5.x] [INFO] SureFire API ....................................... SUCCESS [ 15.954 s]
[windows-jdk8-maven3.5.x] [INFO] ShadeFire JUnit3 Provider .......................... SUCCESS [  1.770 s]
[windows-jdk8-maven3.5.x] [INFO] SureFire Booter .................................... SUCCESS [ 15.694 s]
[windows-jdk8-maven3.5.x] [INFO] Maven Surefire Test-Grouping Support ............... SUCCESS [  9.447 s]
[windows-jdk8-maven3.5.x] [INFO] SureFire Providers ................................. SUCCESS [  1.339 s]
[windows-jdk8-maven3.5.x] [INFO] Shared JUnit3 Provider Code ........................ SUCCESS [  5.091 s]
[windows-jdk8-maven3.5.x] [INFO] Shared Java 5 Provider Base ........................ SUCCESS [  5.936 s]
[windows-jdk8-maven3.5.x] [INFO] Shared JUnit4 Provider Code ........................ SUCCESS [  6.452 s]
[windows-jdk8-maven3.5.x] [INFO] Shared JUnit48 Provider Code ....................... SUCCESS [  6.966 s]
[windows-jdk8-maven3.5.x] [INFO] SureFire JUnit Runner .............................. SUCCESS [  5.259 s]
[windows-jdk8-maven3.5.x] [INFO] SureFire JUnit4 Runner ............................. SUCCESS [  5.612 s]
[windows-jdk8-maven3.5.x] [INFO] Maven Surefire Common .............................. SUCCESS [ 33.012 s]
[windows-jdk8-maven3.5.x] [INFO] SureFire JUnitCore Runner .......................... SUCCESS [02:20 min]
[windows-jdk8-maven3.5.x] [INFO] SureFire JUnit Platform Runner ..................... SUCCESS [  9.365 s]
[windows-jdk8-maven3.5.x] [INFO] SureFire TestNG Utils .............................. SUCCESS [  5.414 s]
[windows-jdk8-maven3.5.x] [INFO] SureFire TestNG Runner ............................. SUCCESS [  6.297 s]
[windows-jdk8-maven3.5.x] [INFO] Surefire Report Parser ............................. SUCCESS [  6.439 s]
[windows-jdk8-maven3.5.x] [INFO] Maven Surefire Plugin .............................. SUCCESS [ 14.821 s]
[windows-jdk8-maven3.5.x] [INFO] Maven Failsafe Plugin .............................. SUCCESS [02:34 min]
[windows-jdk8-maven3.5.x] [INFO] Maven Surefire Report Plugin ....................... SUCCESS [ 18.724 s]
[windows-jdk8-maven3.5.x] [INFO] Maven Surefire Integration Tests ................... SUCCESS [  02:14 h]
[windows-jdk8-maven3.5.x] [INFO] ------------------------------------------------------------------------
[windows-jdk8-maven3.5.x] [INFO] BUILD SUCCESS
[windows-jdk8-maven3.5.x] [INFO] ------------------------------------------------------------------------
[windows-jdk8-maven3.5.x] [INFO] Total time: 02:23 h
[windows-jdk8-maven3.5.x] [INFO] Finished at: 2018-10-29T18:57:25-07:00
[windows-jdk8-maven3.5.x] [INFO] Final Memory: 50M/168M
[windows-jdk8-maven3.5.x] [INFO] ------------------------------------------------------------------------
[Pipeline] [windows-jdk8-maven3.5.x] }
[Pipeline] [windows-jdk8-maven3.5.x] // withEnv
[Pipeline] [windows-jdk8-maven3.5.x] }
[Pipeline] [windows-jdk8-maven3.5.x] // stage
[Pipeline] [windows-jdk8-maven3.5.x] stage
[Pipeline] [windows-jdk8-maven3.5.x] { (reporting windows-jdk8-maven3.5.x)
[Pipeline] [windows-jdk8-maven3.5.x] fileExists
[Pipeline] [windows-jdk8-maven3.5.x] zip
[windows-jdk8-maven3.5.x] Writing zip file of f:\jenkins\jenkins-slave\workspace\box_maven-surefire_3.0.0-M1-VOMECAKSVISJOPKETIPDSWOOERZ2GRJICZTDYCTKUOMZVRQP4WVQ\maven-failsafe-plugin\target\it to f:\jenkins\jenkins-slave\workspace\box_maven-surefire_3.0.0-M1-VOMECAKSVISJOPKETIPDSWOOERZ2GRJICZTDYCTKUOMZVRQP4WVQ\maven-failsafe-plugin--windows-jdk8-maven3.5.x.zip
[windows-jdk8-maven3.5.x] Zipped 78 entries.
[windows-jdk8-maven3.5.x] Archiving f:\jenkins\jenkins-slave\workspace\box_maven-surefire_3.0.0-M1-VOMECAKSVISJOPKETIPDSWOOERZ2GRJICZTDYCTKUOMZVRQP4WVQ\maven-failsafe-plugin--windows-jdk8-maven3.5.x.zip
[Pipeline] [windows-jdk8-maven3.5.x] fileExists
[Pipeline] [windows-jdk8-maven3.5.x] zip
[windows-jdk8-maven3.5.x] Writing zip file of f:\jenkins\jenkins-slave\workspace\box_maven-surefire_3.0.0-M1-VOMECAKSVISJOPKETIPDSWOOERZ2GRJICZTDYCTKUOMZVRQP4WVQ\surefire-its\target to f:\jenkins\jenkins-slave\workspace\box_maven-surefire_3.0.0-M1-VOMECAKSVISJOPKETIPDSWOOERZ2GRJICZTDYCTKUOMZVRQP4WVQ\surefire-its--windows-jdk8-maven3.5.x.zip
[windows-jdk8-maven3.5.x] Zipped 15809 entries.
[windows-jdk8-maven3.5.x] Archiving f:\jenkins\jenkins-slave\workspace\box_maven-surefire_3.0.0-M1-VOMECAKSVISJOPKETIPDSWOOERZ2GRJICZTDYCTKUOMZVRQP4WVQ\surefire-its--windows-jdk8-maven3.5.x.zip
[Pipeline] [windows-jdk8-maven3.5.x] archiveArtifacts
[windows-jdk8-maven3.5.x] Archiving artifacts
[Pipeline] [windows-jdk8-maven3.5.x] }
[Pipeline] [windows-jdk8-maven3.5.x] // stage
[Pipeline] [windows-jdk8-maven3.5.x] stage
[Pipeline] [windows-jdk8-maven3.5.x] { (cleanup windows-jdk8-maven3.5.x)
[Pipeline] [windows-jdk8-maven3.5.x] cleanWs
[windows-jdk8-maven3.5.x] [WS-CLEANUP] Deleting project workspace...[WS-CLEANUP] done
[Pipeline] [windows-jdk8-maven3.5.x] }
[Pipeline] [windows-jdk8-maven3.5.x] // stage
[Pipeline] [windows-jdk8-maven3.5.x] }
[Pipeline] [windows-jdk8-maven3.5.x] // timestamps
[Pipeline] [windows-jdk8-maven3.5.x] }
[Pipeline] [windows-jdk8-maven3.5.x] // node
[Pipeline] [windows-jdk8-maven3.5.x] }
[Pipeline] // parallel
[Pipeline] echo
hudson.AbortException: hudson.AbortException: script returned exit code 1
[Pipeline] stage
[Pipeline] { (notifications)
[Pipeline] echo
Build result: FAILURE
[Pipeline] jiraIssueSelector
[Pipeline] emailext
Mime
  • Unnamed multipart/mixed (inline, None, 0 bytes)
View raw message