maven-notifications mailing list archives

Site index · List index
Message view « Date » · « Thread »
Top « Date » · « Thread »
From Apache Jenkins Server <jenk...@builds.apache.org>
Subject Build failed in Jenkins: Maven TLP » maven-surefire » SUREFIRE-1585 #7
Date Sat, 27 Oct 2018 06:10:20 GMT
See https://builds.apache.org/job/maven-box/job/maven-surefire/job/SUREFIRE-1585/7/

Changes:

* Cleanup implementation
* Cleanup implementation
* Cleanup implementation
* Cleanup implementation
* Cleanup implementation
* Cleanup implementation

All tests passed

Build log:
[...truncated 46.78 MB...]
[windows-jdk8-maven3.5.x] Tests run: 2, Failures: 0, Errors: 0, Skipped: 0, Time elapsed:
19.791 sec
[windows-jdk8-maven3.5.x] Running org.apache.maven.surefire.its.jiras.Surefire1179IT
[windows-jdk8-maven3.5.x] Tests run: 1, Failures: 0, Errors: 0, Skipped: 0, Time elapsed:
11.666 sec
[windows-jdk8-maven3.5.x] Running org.apache.maven.surefire.its.jiras.Surefire1185DoNotSpawnTestsIT
[windows-jdk8-maven3.5.x] Tests run: 1, Failures: 0, Errors: 0, Skipped: 0, Time elapsed:
6.135 sec
[windows-jdk8-maven3.5.x] Running org.apache.maven.surefire.its.jiras.Surefire1202RerunAndSkipIT
[windows-jdk8-maven3.5.x] Tests run: 2, Failures: 0, Errors: 0, Skipped: 0, Time elapsed:
41.597 sec
[windows-jdk8-maven3.5.x] Running org.apache.maven.surefire.its.jiras.Surefire1209RerunAndForkCountIT
[windows-jdk8-maven3.5.x] Tests run: 4, Failures: 0, Errors: 0, Skipped: 0, Time elapsed:
65.659 sec
[windows-jdk8-maven3.5.x] Running org.apache.maven.surefire.its.jiras.Surefire1211JUnitTestNgIT
[windows-jdk8-maven3.5.x] Tests run: 2, Failures: 0, Errors: 0, Skipped: 0, Time elapsed:
19.401 sec
[windows-jdk8-maven3.5.x] Running org.apache.maven.surefire.its.jiras.Surefire1264IT
[windows-jdk8-maven3.5.x] Tests run: 2, Failures: 0, Errors: 0, Skipped: 0, Time elapsed:
19.607 sec
[windows-jdk8-maven3.5.x] Running org.apache.maven.surefire.its.jiras.Surefire1278GroupNameEndingIT
[windows-jdk8-maven3.5.x] Tests run: 1, Failures: 0, Errors: 0, Skipped: 0, Time elapsed:
9.175 sec
[windows-jdk8-maven3.5.x] Running org.apache.maven.surefire.its.jiras.Surefire1364SystemPropertiesIT
[windows-jdk8-maven3.5.x] Tests run: 10, Failures: 0, Errors: 0, Skipped: 0, Time elapsed:
86.052 sec
[windows-jdk8-maven3.5.x] Running org.apache.maven.surefire.its.jiras.Surefire1367AssumptionLogsIT
[windows-jdk8-maven3.5.x] Tests run: 4, Failures: 0, Errors: 0, Skipped: 0, Time elapsed:
28.919 sec
[windows-jdk8-maven3.5.x] Running org.apache.maven.surefire.its.jiras.Surefire1383ScanSessionDependenciesIT
[windows-jdk8-maven3.5.x] Tests run: 1, Failures: 0, Errors: 0, Skipped: 0, Time elapsed:
8.112 sec
[windows-jdk8-maven3.5.x] Running org.apache.maven.surefire.its.jiras.Surefire1396CustomProviderClassPathIT
[windows-jdk8-maven3.5.x] Tests run: 1, Failures: 0, Errors: 0, Skipped: 0, Time elapsed:
11.612 sec
[windows-jdk8-maven3.5.x] Running org.apache.maven.surefire.its.jiras.Surefire141PluggableProvidersIT
[windows-jdk8-maven3.5.x] Tests run: 4, Failures: 0, Errors: 0, Skipped: 0, Time elapsed:
40.531 sec
[windows-jdk8-maven3.5.x] Running org.apache.maven.surefire.its.jiras.Surefire146ForkPerTestNoSetupIT
[windows-jdk8-maven3.5.x] Tests run: 1, Failures: 0, Errors: 0, Skipped: 0, Time elapsed:
7.58 sec
[windows-jdk8-maven3.5.x] Running org.apache.maven.surefire.its.jiras.Surefire1490ReportTitleDescriptionIT
[windows-jdk8-maven3.5.x] Tests run: 2, Failures: 0, Errors: 0, Skipped: 0, Time elapsed:
37.643 sec
[windows-jdk8-maven3.5.x] Running org.apache.maven.surefire.its.jiras.Surefire1535TestNGParallelSuitesIT
[windows-jdk8-maven3.5.x] Tests run: 4, Failures: 0, Errors: 0, Skipped: 0, Time elapsed:
36.896 sec
[windows-jdk8-maven3.5.x] Running org.apache.maven.surefire.its.jiras.Surefire162CharsetProviderIT
[windows-jdk8-maven3.5.x] Tests run: 1, Failures: 0, Errors: 0, Skipped: 0, Time elapsed:
8.16 sec
[windows-jdk8-maven3.5.x] Running org.apache.maven.surefire.its.jiras.Surefire224WellFormedXmlFailuresIT
[windows-jdk8-maven3.5.x] Tests run: 1, Failures: 0, Errors: 0, Skipped: 0, Time elapsed:
8.101 sec
[windows-jdk8-maven3.5.x] Running org.apache.maven.surefire.its.jiras.Surefire257NotRerunningTestsIT
[windows-jdk8-maven3.5.x] Tests run: 1, Failures: 0, Errors: 0, Skipped: 0, Time elapsed:
11.507 sec
[windows-jdk8-maven3.5.x] Running org.apache.maven.surefire.its.jiras.Surefire260TestWithIdenticalNamesIT
[windows-jdk8-maven3.5.x] Tests run: 1, Failures: 0, Errors: 0, Skipped: 0, Time elapsed:
19.326 sec
[windows-jdk8-maven3.5.x] Running org.apache.maven.surefire.its.jiras.Surefire34SecurityManagerIT
[windows-jdk8-maven3.5.x] Tests run: 2, Failures: 0, Errors: 0, Skipped: 0, Time elapsed:
15.756 sec
[windows-jdk8-maven3.5.x] Running org.apache.maven.surefire.its.jiras.Surefire376TestNgAfterSuiteFailureIT
[windows-jdk8-maven3.5.x] Tests run: 1, Failures: 0, Errors: 0, Skipped: 0, Time elapsed:
8.101 sec
[windows-jdk8-maven3.5.x] Running org.apache.maven.surefire.its.jiras.Surefire377TestNgAndJUnitTogetherIT
[windows-jdk8-maven3.5.x] Tests run: 2, Failures: 0, Errors: 0, Skipped: 0, Time elapsed:
15.786 sec
[windows-jdk8-maven3.5.x] Running org.apache.maven.surefire.its.jiras.Surefire408ManualProviderSelectionIT
[windows-jdk8-maven3.5.x] Tests run: 1, Failures: 0, Errors: 0, Skipped: 0, Time elapsed:
7.475 sec
[windows-jdk8-maven3.5.x] Running org.apache.maven.surefire.its.jiras.Surefire42NotExtendingTestCaseIT
[windows-jdk8-maven3.5.x] Tests run: 1, Failures: 0, Errors: 0, Skipped: 0, Time elapsed:
8.386 sec
[windows-jdk8-maven3.5.x] Running org.apache.maven.surefire.its.jiras.Surefire44InnerClassTestIT
[windows-jdk8-maven3.5.x] Tests run: 1, Failures: 0, Errors: 0, Skipped: 0, Time elapsed:
7.916 sec
[windows-jdk8-maven3.5.x] Running org.apache.maven.surefire.its.jiras.Surefire500PuzzlingErrorIT
[windows-jdk8-maven3.5.x] Tests run: 1, Failures: 0, Errors: 0, Skipped: 0, Time elapsed:
7.924 sec
[windows-jdk8-maven3.5.x] Running org.apache.maven.surefire.its.jiras.Surefire510TestClassPathForkModesIT
[windows-jdk8-maven3.5.x] Tests run: 2, Failures: 0, Errors: 0, Skipped: 0, Time elapsed:
16.05 sec
[windows-jdk8-maven3.5.x] Running org.apache.maven.surefire.its.jiras.Surefire569RunTestFromDependencyJarsIT
[windows-jdk8-maven3.5.x] Tests run: 1, Failures: 0, Errors: 0, Skipped: 0, Time elapsed:
7.419 sec
[windows-jdk8-maven3.5.x] Running org.apache.maven.surefire.its.jiras.Surefire570MultipleReportDirectoriesIT
[windows-jdk8-maven3.5.x] Tests run: 2, Failures: 0, Errors: 0, Skipped: 0, Time elapsed:
42.784 sec
[windows-jdk8-maven3.5.x] Running org.apache.maven.surefire.its.jiras.Surefire613TestCountInParallelIT
[windows-jdk8-maven3.5.x] Tests run: 1, Failures: 0, Errors: 0, Skipped: 0, Time elapsed:
8.472 sec
[windows-jdk8-maven3.5.x] Running org.apache.maven.surefire.its.jiras.Surefire621TestCountingJunit3InParallelIT
[windows-jdk8-maven3.5.x] Tests run: 5, Failures: 0, Errors: 0, Skipped: 0, Time elapsed:
43.077 sec
[windows-jdk8-maven3.5.x] Running org.apache.maven.surefire.its.jiras.Surefire628ConsoleOutputBeforeAndAfterClassIT
[windows-jdk8-maven3.5.x] Tests run: 1, Failures: 0, Errors: 0, Skipped: 0, Time elapsed:
8.2 sec
[windows-jdk8-maven3.5.x] Running org.apache.maven.surefire.its.jiras.Surefire634UnsettableSystemPropertiesWarningIT
[windows-jdk8-maven3.5.x] Tests run: 1, Failures: 0, Errors: 0, Skipped: 0, Time elapsed:
7.71 sec
[windows-jdk8-maven3.5.x] Running org.apache.maven.surefire.its.jiras.Surefire649EmptyStringSystemPropertiesIT
[windows-jdk8-maven3.5.x] Tests run: 2, Failures: 0, Errors: 0, Skipped: 0, Time elapsed:
12.692 sec
[windows-jdk8-maven3.5.x] Running org.apache.maven.surefire.its.jiras.Surefire673MockitoIT
[windows-jdk8-maven3.5.x] Tests run: 1, Failures: 0, Errors: 0, Skipped: 0, Time elapsed:
9.413 sec
[windows-jdk8-maven3.5.x] Running org.apache.maven.surefire.its.jiras.Surefire674BuildFailingWhenErrorsIT
[windows-jdk8-maven3.5.x] Tests run: 1, Failures: 0, Errors: 0, Skipped: 0, Time elapsed:
8.162 sec
[windows-jdk8-maven3.5.x] Running org.apache.maven.surefire.its.jiras.Surefire674BuildFailingWhenFailsafeErrorsIT
[windows-jdk8-maven3.5.x] Tests run: 1, Failures: 0, Errors: 0, Skipped: 0, Time elapsed:
9.894 sec
[windows-jdk8-maven3.5.x] Running org.apache.maven.surefire.its.jiras.Surefire685CommaSeparatedIncludesIT
[windows-jdk8-maven3.5.x] Tests run: 1, Failures: 0, Errors: 0, Skipped: 0, Time elapsed:
8.804 sec
[windows-jdk8-maven3.5.x] Running org.apache.maven.surefire.its.jiras.Surefire697NiceSummaryIT
[windows-jdk8-maven3.5.x] Tests run: 1, Failures: 0, Errors: 0, Skipped: 0, Time elapsed:
8.4 sec
[windows-jdk8-maven3.5.x] Running org.apache.maven.surefire.its.jiras.Surefire705ParallelForkTimeoutIT
[windows-jdk8-maven3.5.x] Tests run: 1, Failures: 0, Errors: 0, Skipped: 0, Time elapsed:
10.866 sec
[windows-jdk8-maven3.5.x] Running org.apache.maven.surefire.its.jiras.Surefire733AllOverrridesCapturedIT
[windows-jdk8-maven3.5.x] Tests run: 1, Failures: 0, Errors: 0, Skipped: 0, Time elapsed:
8.288 sec
[windows-jdk8-maven3.5.x] Running org.apache.maven.surefire.its.jiras.Surefire735ForkFailWithRedirectConsoleOutputIT
[windows-jdk8-maven3.5.x] Tests run: 2, Failures: 0, Errors: 0, Skipped: 0, Time elapsed:
15.181 sec
[windows-jdk8-maven3.5.x] Running org.apache.maven.surefire.its.jiras.Surefire740TruncatedCommaIT
[windows-jdk8-maven3.5.x] Tests run: 1, Failures: 0, Errors: 0, Skipped: 0, Time elapsed:
6.962 sec
[windows-jdk8-maven3.5.x] Running org.apache.maven.surefire.its.jiras.Surefire747MethodParallelWithSuiteCountIT
[windows-jdk8-maven3.5.x] Tests run: 2, Failures: 0, Errors: 0, Skipped: 0, Time elapsed:
27.669 sec
[windows-jdk8-maven3.5.x] Running org.apache.maven.surefire.its.jiras.Surefire772BothReportsIT
[windows-jdk8-maven3.5.x] Tests run: 3, Failures: 0, Errors: 0, Skipped: 0, Time elapsed:
16.504 sec
[windows-jdk8-maven3.5.x] Running org.apache.maven.surefire.its.jiras.Surefire772NoFailsafeReportsIT
[windows-jdk8-maven3.5.x] Tests run: 4, Failures: 0, Errors: 0, Skipped: 0, Time elapsed:
21.741 sec
[windows-jdk8-maven3.5.x] Running org.apache.maven.surefire.its.jiras.Surefire772NoSurefireReportsIT
[windows-jdk8-maven3.5.x] Tests run: 4, Failures: 0, Errors: 0, Skipped: 0, Time elapsed:
22.337 sec
[windows-jdk8-maven3.5.x] Running org.apache.maven.surefire.its.jiras.Surefire772SpecifiedReportsIT
[windows-jdk8-maven3.5.x] Tests run: 3, Failures: 0, Errors: 0, Skipped: 0, Time elapsed:
16.091 sec
[windows-jdk8-maven3.5.x] Running org.apache.maven.surefire.its.jiras.Surefire801ForkModeNoneClassLoaderIT
[windows-jdk8-maven3.5.x] Tests run: 1, Failures: 0, Errors: 0, Skipped: 0, Time elapsed:
6.242 sec
[windows-jdk8-maven3.5.x] Running org.apache.maven.surefire.its.jiras.Surefire803MultiFailsafeExecsIT
[windows-jdk8-maven3.5.x] Tests run: 2, Failures: 0, Errors: 0, Skipped: 0, Time elapsed:
28.281 sec
[windows-jdk8-maven3.5.x] Running org.apache.maven.surefire.its.jiras.Surefire806SpecifiedTestControlsIT
[windows-jdk8-maven3.5.x] Tests run: 3, Failures: 0, Errors: 0, Skipped: 2, Time elapsed:
7.907 sec
[windows-jdk8-maven3.5.x] Running org.apache.maven.surefire.its.jiras.Surefire809GroupExpressionsIT
[windows-jdk8-maven3.5.x] Tests run: 6, Failures: 0, Errors: 0, Skipped: 0, Time elapsed:
47.485 sec
[windows-jdk8-maven3.5.x] Running org.apache.maven.surefire.its.jiras.Surefire812Log4JClassLoaderIT
[windows-jdk8-maven3.5.x] Tests run: 1, Failures: 0, Errors: 0, Skipped: 0, Time elapsed:
9.006 sec
[windows-jdk8-maven3.5.x] Running org.apache.maven.surefire.its.jiras.Surefire817SystemExitIT
[windows-jdk8-maven3.5.x] Tests run: 1, Failures: 0, Errors: 0, Skipped: 0, Time elapsed:
8.301 sec
[windows-jdk8-maven3.5.x] Running org.apache.maven.surefire.its.jiras.Surefire818NpeIgnoresTestsIT
[windows-jdk8-maven3.5.x] Tests run: 1, Failures: 0, Errors: 0, Skipped: 0, Time elapsed:
8.923 sec
[windows-jdk8-maven3.5.x] Running org.apache.maven.surefire.its.jiras.Surefire828EmptyGroupExprIT
[windows-jdk8-maven3.5.x] Tests run: 4, Failures: 0, Errors: 0, Skipped: 0, Time elapsed:
33.812 sec
[windows-jdk8-maven3.5.x] Running org.apache.maven.surefire.its.jiras.Surefire832ProviderSelectionIT
[windows-jdk8-maven3.5.x] Tests run: 1, Failures: 0, Errors: 0, Skipped: 0, Time elapsed:
8.46 sec
[windows-jdk8-maven3.5.x] Running org.apache.maven.surefire.its.jiras.Surefire839TestWithoutCategoriesIT
[windows-jdk8-maven3.5.x] Tests run: 2, Failures: 0, Errors: 0, Skipped: 0, Time elapsed:
17.227 sec
[windows-jdk8-maven3.5.x] Running org.apache.maven.surefire.its.jiras.Surefire847AdditionalFailureIT
[windows-jdk8-maven3.5.x] Tests run: 1, Failures: 0, Errors: 0, Skipped: 0, Time elapsed:
10.287 sec
[windows-jdk8-maven3.5.x] Running org.apache.maven.surefire.its.jiras.Surefire855AllowFailsafeUseArtifactFileIT
[windows-jdk8-maven3.5.x] Tests run: 4, Failures: 0, Errors: 0, Skipped: 0, Time elapsed:
66.484 sec
[windows-jdk8-maven3.5.x] Running org.apache.maven.surefire.its.jiras.Surefire901MIssingResultfileWhenNoTestsIT
[windows-jdk8-maven3.5.x] Tests run: 1, Failures: 0, Errors: 0, Skipped: 0, Time elapsed:
6.404 sec
[windows-jdk8-maven3.5.x] Running org.apache.maven.surefire.its.jiras.Surefire907PerThreadWithoutThreadCountIT
[windows-jdk8-maven3.5.x] Tests run: 1, Failures: 0, Errors: 0, Skipped: 0, Time elapsed:
6.071 sec
[windows-jdk8-maven3.5.x] Running org.apache.maven.surefire.its.jiras.Surefire920TestFailureIgnoreWithTimeoutIT
[windows-jdk8-maven3.5.x] Tests run: 2, Failures: 0, Errors: 0, Skipped: 0, Time elapsed:
18.01 sec
[windows-jdk8-maven3.5.x] Running org.apache.maven.surefire.its.jiras.Surefire926FailureWith2ProvidersIT
[windows-jdk8-maven3.5.x] Tests run: 1, Failures: 0, Errors: 0, Skipped: 0, Time elapsed:
11.553 sec
[windows-jdk8-maven3.5.x] Running org.apache.maven.surefire.its.jiras.Surefire930TestNgSuiteXmlIT
[windows-jdk8-maven3.5.x] Tests run: 1, Failures: 0, Errors: 0, Skipped: 0, Time elapsed:
9.786 sec
[windows-jdk8-maven3.5.x] Running org.apache.maven.surefire.its.jiras.Surefire943ReportContentIT
[windows-jdk8-maven3.5.x] Tests run: 2, Failures: 0, Errors: 0, Skipped: 0, Time elapsed:
24.089 sec
[windows-jdk8-maven3.5.x] Running org.apache.maven.surefire.its.jiras.Surefire946KillMainProcessInReusableForkIT
[windows-jdk8-maven3.5.x] Tests run: 3, Failures: 0, Errors: 0, Skipped: 0, Time elapsed:
27.212 sec
[windows-jdk8-maven3.5.x] Running org.apache.maven.surefire.its.jiras.Surefire972BizarreNoClassDefIT
[windows-jdk8-maven3.5.x] Tests run: 1, Failures: 0, Errors: 0, Skipped: 0, Time elapsed:
11.889 sec
[windows-jdk8-maven3.5.x] Running org.apache.maven.surefire.its.jiras.Surefire975DefaultVMEncodingIT
[windows-jdk8-maven3.5.x] Tests run: 1, Failures: 0, Errors: 0, Skipped: 0, Time elapsed:
8.768 sec
[windows-jdk8-maven3.5.x] Running org.apache.maven.surefire.its.jiras.Surefire979WrongClassLoaderIT
[windows-jdk8-maven3.5.x] Tests run: 1, Failures: 0, Errors: 0, Skipped: 0, Time elapsed:
8.179 sec
[windows-jdk8-maven3.5.x] Running org.apache.maven.surefire.its.jiras.Surefire985ParameterizedRunnerAndCategoriesIT
[windows-jdk8-maven3.5.x] Tests run: 1, Failures: 0, Errors: 0, Skipped: 0, Time elapsed:
6.979 sec
[windows-jdk8-maven3.5.x] Running org.apache.maven.surefire.its.jiras.Surefire995CategoryInheritanceIT
[windows-jdk8-maven3.5.x] Tests run: 5, Failures: 0, Errors: 0, Skipped: 0, Time elapsed:
33.49 sec
[windows-jdk8-maven3.5.x] Running org.apache.maven.surefire.its.jiras.Surefire1265Java9IT
[windows-jdk8-maven3.5.x] Tests run: 1, Failures: 0, Errors: 0, Skipped: 1, Time elapsed:
0.001 sec
[windows-jdk8-maven3.5.x] Running org.apache.maven.surefire.its.jiras.Surefire1295AttributeJvmCrashesToTestsIT
[windows-jdk8-maven3.5.x] Tests run: 9, Failures: 0, Errors: 0, Skipped: 9, Time elapsed:
0.002 sec
[windows-jdk8-maven3.5.x] Running org.apache.maven.surefire.its.TestMultipleMethodPatternsTestNGIT
[windows-jdk8-maven3.5.x] Tests run: 90, Failures: 0, Errors: 0, Skipped: 41, Time elapsed:
328.166 sec
[windows-jdk8-maven3.5.x] Running org.apache.maven.surefire.its.Java9FullApiIT
[windows-jdk8-maven3.5.x] Tests run: 3, Failures: 0, Errors: 0, Skipped: 3, Time elapsed:
0.011 sec
[windows-jdk8-maven3.5.x] Running org.apache.maven.surefire.its.TestMultipleMethodPatternsIT
[windows-jdk8-maven3.5.x] Tests run: 180, Failures: 0, Errors: 0, Skipped: 87, Time elapsed:
605.875 sec
[windows-jdk8-maven3.5.x] Running org.apache.maven.surefire.its.ModulePathIT
[windows-jdk8-maven3.5.x] Tests run: 1, Failures: 0, Errors: 0, Skipped: 1, Time elapsed:
0.002 sec
[windows-jdk8-maven3.5.x] 
[windows-jdk8-maven3.5.x] Results :
[windows-jdk8-maven3.5.x] 
[windows-jdk8-maven3.5.x] Tests run: 778, Failures: 0, Errors: 0, Skipped: 146
[windows-jdk8-maven3.5.x] 
[windows-jdk8-maven3.5.x] [INFO] 
[windows-jdk8-maven3.5.x] [INFO] --- maven-checkstyle-plugin:3.0.0:check (checkstyle-check)
@ surefire-its ---
[windows-jdk8-maven3.5.x] [INFO] 
[windows-jdk8-maven3.5.x] [INFO] --- maven-failsafe-plugin:2.12.4:verify (default) @ surefire-its
---
[windows-jdk8-maven3.5.x] [INFO] Failsafe report directory: F:\jenkins\jenkins-slave\workspace\aven-surefire_SUREFIRE-1585-U3U5P3K7SWF3PYVGCAJQVC6YYZDYOOVUGVOP3FKEMVRXVXAVVJJQ@2\surefire-its\target\failsafe-reports
[windows-jdk8-maven3.5.x] [INFO] 
[windows-jdk8-maven3.5.x] [INFO] --- maven-install-plugin:2.5.2:install (default-install)
@ surefire-its ---
[windows-jdk8-maven3.5.x] [INFO] Skipping artifact installation
[windows-jdk8-maven3.5.x] [INFO] 
[windows-jdk8-maven3.5.x] [INFO] --- jacoco-maven-plugin:0.8.2:report (default-cli) @ surefire-its
---
[windows-jdk8-maven3.5.x] [INFO] Skipping JaCoCo execution because property jacoco.skip is
set.
[windows-jdk8-maven3.5.x] [INFO] ------------------------------------------------------------------------
[windows-jdk8-maven3.5.x] [INFO] Reactor Summary:
[windows-jdk8-maven3.5.x] [INFO] 
[windows-jdk8-maven3.5.x] [INFO] Apache Maven Surefire .............................. SUCCESS
[ 43.921 s]
[windows-jdk8-maven3.5.x] [INFO] SureFire Logger API ................................ SUCCESS
[ 10.861 s]
[windows-jdk8-maven3.5.x] [INFO] SureFire API ....................................... SUCCESS
[ 20.277 s]
[windows-jdk8-maven3.5.x] [INFO] ShadeFire JUnit3 Provider .......................... SUCCESS
[  4.951 s]
[windows-jdk8-maven3.5.x] [INFO] SureFire Booter .................................... SUCCESS
[ 19.654 s]
[windows-jdk8-maven3.5.x] [INFO] Maven Surefire Test-Grouping Support ............... SUCCESS
[ 11.044 s]
[windows-jdk8-maven3.5.x] [INFO] SureFire Providers ................................. SUCCESS
[  1.687 s]
[windows-jdk8-maven3.5.x] [INFO] Shared JUnit3 Provider Code ........................ SUCCESS
[  7.420 s]
[windows-jdk8-maven3.5.x] [INFO] Shared Java 5 Provider Base ........................ SUCCESS
[  7.319 s]
[windows-jdk8-maven3.5.x] [INFO] Shared JUnit4 Provider Code ........................ SUCCESS
[  8.160 s]
[windows-jdk8-maven3.5.x] [INFO] Shared JUnit48 Provider Code ....................... SUCCESS
[ 10.344 s]
[windows-jdk8-maven3.5.x] [INFO] SureFire JUnit Runner .............................. SUCCESS
[  6.895 s]
[windows-jdk8-maven3.5.x] [INFO] SureFire JUnit4 Runner ............................. SUCCESS
[  7.345 s]
[windows-jdk8-maven3.5.x] [INFO] Maven Surefire Common .............................. SUCCESS
[ 46.876 s]
[windows-jdk8-maven3.5.x] [INFO] SureFire JUnitCore Runner .......................... SUCCESS
[02:16 min]
[windows-jdk8-maven3.5.x] [INFO] SureFire JUnit Platform Runner ..................... SUCCESS
[ 12.555 s]
[windows-jdk8-maven3.5.x] [INFO] SureFire TestNG Utils .............................. SUCCESS
[  8.768 s]
[windows-jdk8-maven3.5.x] [INFO] SureFire TestNG Runner ............................. SUCCESS
[  8.482 s]
[windows-jdk8-maven3.5.x] [INFO] Surefire Report Parser ............................. SUCCESS
[  9.644 s]
[windows-jdk8-maven3.5.x] [INFO] Maven Surefire Plugin .............................. SUCCESS
[ 17.419 s]
[windows-jdk8-maven3.5.x] [INFO] Maven Failsafe Plugin .............................. SUCCESS
[01:55 min]
[windows-jdk8-maven3.5.x] [INFO] Maven Surefire Report Plugin ....................... SUCCESS
[ 25.000 s]
[windows-jdk8-maven3.5.x] [INFO] Maven Surefire Integration Tests ................... SUCCESS
[  01:36 h]
[windows-jdk8-maven3.5.x] [INFO] ------------------------------------------------------------------------
[windows-jdk8-maven3.5.x] [INFO] BUILD SUCCESS
[windows-jdk8-maven3.5.x] [INFO] ------------------------------------------------------------------------
[windows-jdk8-maven3.5.x] [INFO] Total time: 01:45 h
[windows-jdk8-maven3.5.x] [INFO] Finished at: 2018-10-26T23:09:58-07:00
[windows-jdk8-maven3.5.x] [INFO] Final Memory: 42M/142M
[windows-jdk8-maven3.5.x] [INFO] ------------------------------------------------------------------------
[Pipeline] [windows-jdk8-maven3.5.x] }
[Pipeline] [windows-jdk8-maven3.5.x] // withEnv
[Pipeline] [windows-jdk8-maven3.5.x] }
[Pipeline] [windows-jdk8-maven3.5.x] // stage
[Pipeline] [windows-jdk8-maven3.5.x] stage
[Pipeline] [windows-jdk8-maven3.5.x] { (reporting windows-jdk8-maven3.5.x)
[Pipeline] [windows-jdk8-maven3.5.x] fileExists
[Pipeline] [windows-jdk8-maven3.5.x] zip
[windows-jdk8-maven3.5.x] Writing zip file of f:\jenkins\jenkins-slave\workspace\aven-surefire_SUREFIRE-1585-U3U5P3K7SWF3PYVGCAJQVC6YYZDYOOVUGVOP3FKEMVRXVXAVVJJQ@2\maven-failsafe-plugin\target\it
to f:\jenkins\jenkins-slave\workspace\aven-surefire_SUREFIRE-1585-U3U5P3K7SWF3PYVGCAJQVC6YYZDYOOVUGVOP3FKEMVRXVXAVVJJQ@2\maven-failsafe-plugin--windows-jdk8-maven3.5.x.zip
[windows-jdk8-maven3.5.x] Zipped 79 entries.
[windows-jdk8-maven3.5.x] Archiving f:\jenkins\jenkins-slave\workspace\aven-surefire_SUREFIRE-1585-U3U5P3K7SWF3PYVGCAJQVC6YYZDYOOVUGVOP3FKEMVRXVXAVVJJQ@2\maven-failsafe-plugin--windows-jdk8-maven3.5.x.zip
[windows-jdk8-maven3.5.x] [Fast Archiver] No prior successful build to compare, so performing
full copy of artifacts
[Pipeline] [windows-jdk8-maven3.5.x] fileExists
[Pipeline] [windows-jdk8-maven3.5.x] zip
[windows-jdk8-maven3.5.x] Writing zip file of f:\jenkins\jenkins-slave\workspace\aven-surefire_SUREFIRE-1585-U3U5P3K7SWF3PYVGCAJQVC6YYZDYOOVUGVOP3FKEMVRXVXAVVJJQ@2\surefire-its\target
to f:\jenkins\jenkins-slave\workspace\aven-surefire_SUREFIRE-1585-U3U5P3K7SWF3PYVGCAJQVC6YYZDYOOVUGVOP3FKEMVRXVXAVVJJQ@2\surefire-its--windows-jdk8-maven3.5.x.zip
[windows-jdk8-maven3.5.x] Zipped 15802 entries.
[windows-jdk8-maven3.5.x] Archiving f:\jenkins\jenkins-slave\workspace\aven-surefire_SUREFIRE-1585-U3U5P3K7SWF3PYVGCAJQVC6YYZDYOOVUGVOP3FKEMVRXVXAVVJJQ@2\surefire-its--windows-jdk8-maven3.5.x.zip
[windows-jdk8-maven3.5.x] [Fast Archiver] No prior successful build to compare, so performing
full copy of artifacts
[Pipeline] [windows-jdk8-maven3.5.x] archiveArtifacts
[windows-jdk8-maven3.5.x] Archiving artifacts
[windows-jdk8-maven3.5.x] [Fast Archiver] No prior successful build to compare, so performing
full copy of artifacts
[Pipeline] [windows-jdk8-maven3.5.x] }
[Pipeline] [windows-jdk8-maven3.5.x] // stage
[Pipeline] [windows-jdk8-maven3.5.x] stage
[Pipeline] [windows-jdk8-maven3.5.x] { (cleanup windows-jdk8-maven3.5.x)
[Pipeline] [windows-jdk8-maven3.5.x] cleanWs
[windows-jdk8-maven3.5.x] [WS-CLEANUP] Deleting project workspace...[WS-CLEANUP] done
[Pipeline] [windows-jdk8-maven3.5.x] }
[Pipeline] [windows-jdk8-maven3.5.x] // stage
[Pipeline] [windows-jdk8-maven3.5.x] }
[Pipeline] [windows-jdk8-maven3.5.x] // timestamps
[Pipeline] [windows-jdk8-maven3.5.x] }
[Pipeline] [windows-jdk8-maven3.5.x] // node
[Pipeline] [windows-jdk8-maven3.5.x] }
[Pipeline] // parallel
[Pipeline] echo
hudson.AbortException: hudson.AbortException: script returned exit code 1
[Pipeline] stage
[Pipeline] { (notifications)
[Pipeline] echo
Build result: FAILURE
[Pipeline] jiraIssueSelector
[Pipeline] emailext
Mime
  • Unnamed multipart/mixed (inline, None, 0 bytes)
View raw message