maven-notifications mailing list archives

Site index · List index
Message view « Date » · « Thread »
Top « Date » · « Thread »
From Apache Jenkins Server <jenk...@builds.apache.org>
Subject Build failed in Jenkins: Maven TLP » maven-plugin-tools » jdk11_asm7 #6
Date Wed, 03 Oct 2018 22:18:34 GMT
See https://builds.apache.org/job/maven-box/job/maven-plugin-tools/job/jdk11_asm7/6/

Changes:

* back to 3.6.0-SNAPSHOT and some java7 sugar syntax
* back to 3.6.0-SNAPSHOT and some java7 sugar syntax
* back to 3.6.0-SNAPSHOT and some java7 sugar syntax
* back to 3.6.0-SNAPSHOT and some java7 sugar syntax
* back to 3.6.0-SNAPSHOT and some java7 sugar syntax
* back to 3.6.0-SNAPSHOT and some java7 sugar syntax
* back to 3.6.0-SNAPSHOT and some java7 sugar syntax

All tests passed

Build log:
[...truncated 5.29 MB...]
[linux-jdk10-m3.5.x_build] [INFO] 
[linux-jdk10-m3.5.x_build] [INFO] --- maven-resources-plugin:3.1.0:testResources (default-testResources)
@ maven-plugin-tools-annotations ---
[linux-jdk10-m3.5.x_build] [INFO] Using 'UTF-8' encoding to copy filtered resources.
[linux-jdk10-m3.5.x_build] [INFO] Copying 2 resources
[linux-jdk10-m3.5.x_build] [INFO] Copying 3 resources
[linux-jdk10-m3.5.x_build] [INFO] 
[linux-jdk10-m3.5.x_build] [INFO] --- maven-compiler-plugin:3.7.0:testCompile (default-testCompile)
@ maven-plugin-tools-annotations ---
[linux-jdk10-m3.5.x_build] [INFO] Changes detected - recompiling the module!
[linux-jdk10-m3.5.x_build] [INFO] Compiling 3 source files to /home/jenkins/jenkins-slave/workspace/ven-plugin-tools_jdk11_asm7-J7667H6X6V4EBCRWUSKUMW4LMBBFILIHPFM47RV7V2XYHJFAOARA/linux-jdk10-m3.5.x_build/maven-plugin-tools-annotations/target/test-classes
[linux-jdk10-m3.5.x_build] [INFO] 
[linux-jdk10-m3.5.x_build] [INFO] --- plexus-component-metadata:1.7:generate-test-metadata
(default) @ maven-plugin-tools-annotations ---
[linux-jdk10-m3.5.x_build] [INFO] 
[linux-jdk10-m3.5.x_build] [INFO] --- maven-surefire-plugin:2.22.0:test (default-test) @ maven-plugin-tools-annotations
---
[linux-jdk10-m3.5.x_build] [INFO] 
[linux-jdk10-m3.5.x_build] [INFO] -------------------------------------------------------
[linux-jdk10-m3.5.x_build] [INFO]  T E S T S
[linux-jdk10-m3.5.x_build] [INFO] -------------------------------------------------------
[linux-jdk11-m3.5.x_build] [INFO] Tests run: 2, Failures: 0, Errors: 0, Skipped: 0, Time elapsed:
0.429 s - in org.apache.maven.tools.plugin.extractor.annotations.scanner.DefaultMojoAnnotationsScannerTest
[linux-jdk11-m3.5.x_build] [INFO] Running org.apache.maven.tools.plugin.extractor.annotations.TestAnnotationsReader
[linux-jdk11-m3.5.x_build] mojoAnnotatedClasses:{org.apache.maven.tools.plugin.extractor.annotations.FooMojo=MojoAnnotatedClass{className='org.apache.maven.tools.plugin.extractor.annotations.FooMojo',
parentClassName='org.apache.maven.plugin.AbstractMojo', mojo=MojoAnnotationContent{name='foo',
defaultPhase=COMPILE, requiresDependencyResolution='NONE', requiresDependencyCollection='NONE',
instantiationStrategy='PER_LOOKUP', executionStrategy='once-per-session', requiresProject=true,
requiresReports=false, aggregator=false, requiresDirectInvocation=false, requiresOnline=false,
inheritByDefault=true, configurator='null', threadSafe=true}, execute=ExecuteAnnotationContent{goal='compiler',
lifecycle='my-lifecycle', phase=PACKAGE}, parameters={bar=AnnotatedField{fieldName='bar'}ParameterAnnotationContent{name='null',
alias='null', property='thebar', defaultValue='coolbar', required=true, readonly=false}, beer=AnnotatedField{fieldName='beer'}ParameterAnnotationContent{name='null',
alias='null', property='thebeer', defaultValue='coolbeer', required=false, readonly=false}},
components={artifactMetadataSource=AnnotatedField{fieldName='artifactMetadataSource'}ComponentAnnotationContent{role='org.apache.maven.artifact.metadata.ArtifactMetadataSource',
hint='maven'}, compilerManager=AnnotatedField{fieldName='compilerManager'}ComponentAnnotationContent{role='org.codehaus.plexus.compiler.manager.CompilerManager',
hint='null'}}}}
[linux-jdk11-m3.5.x_build] [INFO] Tests run: 1, Failures: 0, Errors: 0, Skipped: 0, Time elapsed:
0.063 s - in org.apache.maven.tools.plugin.extractor.annotations.TestAnnotationsReader
[linux-jdk11-m3.5.x_build] [INFO] 
[linux-jdk11-m3.5.x_build] [INFO] Results:
[linux-jdk11-m3.5.x_build] [INFO] 
[linux-jdk11-m3.5.x_build] [INFO] Tests run: 3, Failures: 0, Errors: 0, Skipped: 0
[linux-jdk11-m3.5.x_build] [INFO] 
[linux-jdk11-m3.5.x_build] [INFO] 
[linux-jdk11-m3.5.x_build] [INFO] --- maven-jar-plugin:3.1.0:jar (default-jar) @ maven-plugin-tools-annotations
---
[linux-jdk11-m3.5.x_build] [INFO] Building jar: /home/jenkins/jenkins-slave/workspace/ven-plugin-tools_jdk11_asm7-J7667H6X6V4EBCRWUSKUMW4LMBBFILIHPFM47RV7V2XYHJFAOARA/linux-jdk11-m3.5.x_build/maven-plugin-tools-annotations/target/maven-plugin-tools-annotations-3.6.0-SNAPSHOT.jar
[linux-jdk11-m3.5.x_build] [INFO] 
[linux-jdk11-m3.5.x_build] [INFO] --- maven-site-plugin:3.7.1:attach-descriptor (attach-descriptor)
@ maven-plugin-tools-annotations ---
[linux-jdk11-m3.5.x_build] [INFO] Skipping because packaging 'jar' is not pom.
[linux-jdk11-m3.5.x_build] [INFO] 
[linux-jdk11-m3.5.x_build] [INFO] --- maven-jar-plugin:3.1.0:test-jar (default) @ maven-plugin-tools-annotations
---
[linux-jdk11-m3.5.x_build] [INFO] Building jar: /home/jenkins/jenkins-slave/workspace/ven-plugin-tools_jdk11_asm7-J7667H6X6V4EBCRWUSKUMW4LMBBFILIHPFM47RV7V2XYHJFAOARA/linux-jdk11-m3.5.x_build/maven-plugin-tools-annotations/target/maven-plugin-tools-annotations-3.6.0-SNAPSHOT-tests.jar
[linux-jdk11-m3.5.x_build] [INFO] 
[linux-jdk11-m3.5.x_build] [INFO] --- maven-source-plugin:3.0.1:test-jar-no-fork (default)
@ maven-plugin-tools-annotations ---
[linux-jdk11-m3.5.x_build] [INFO] Downloading from central: https://repo.maven.apache.org/maven2/org/apache/maven/shared/maven-shared-utils/3.0.1/maven-shared-utils-3.0.1.jar
[linux-jdk11-m3.5.x_build] [INFO] Downloaded from central: https://repo.maven.apache.org/maven2/org/apache/maven/shared/maven-shared-utils/3.0.1/maven-shared-utils-3.0.1.jar
(154 kB at 7.7 MB/s)
[linux-jdk10-m3.5.x_build] [INFO] Running org.apache.maven.tools.plugin.extractor.annotations.TestAnnotationsReader
[linux-jdk10-m3.5.x_build] mojoAnnotatedClasses:{org.apache.maven.tools.plugin.extractor.annotations.FooMojo=MojoAnnotatedClass{className='org.apache.maven.tools.plugin.extractor.annotations.FooMojo',
parentClassName='org.apache.maven.plugin.AbstractMojo', mojo=MojoAnnotationContent{name='foo',
defaultPhase=COMPILE, requiresDependencyResolution='NONE', requiresDependencyCollection='NONE',
instantiationStrategy='PER_LOOKUP', executionStrategy='once-per-session', requiresProject=true,
requiresReports=false, aggregator=false, requiresDirectInvocation=false, requiresOnline=false,
inheritByDefault=true, configurator='null', threadSafe=true}, execute=ExecuteAnnotationContent{goal='compiler',
lifecycle='my-lifecycle', phase=PACKAGE}, parameters={bar=AnnotatedField{fieldName='bar'}ParameterAnnotationContent{name='null',
alias='null', property='thebar', defaultValue='coolbar', required=true, readonly=false}, beer=AnnotatedField{fieldName='beer'}ParameterAnnotationContent{name='null',
alias='null', property='thebeer', defaultValue='coolbeer', required=false, readonly=false}},
components={artifactMetadataSource=AnnotatedField{fieldName='artifactMetadataSource'}ComponentAnnotationContent{role='org.apache.maven.artifact.metadata.ArtifactMetadataSource',
hint='maven'}, compilerManager=AnnotatedField{fieldName='compilerManager'}ComponentAnnotationContent{role='org.codehaus.plexus.compiler.manager.CompilerManager',
hint='null'}}}}
[linux-jdk10-m3.5.x_build] [INFO] Tests run: 1, Failures: 0, Errors: 0, Skipped: 0, Time elapsed:
0.404 s - in org.apache.maven.tools.plugin.extractor.annotations.TestAnnotationsReader
[linux-jdk10-m3.5.x_build] [INFO] Running org.apache.maven.tools.plugin.extractor.annotations.scanner.DefaultMojoAnnotationsScannerTest
[linux-jdk11-m3.5.x_build] [INFO] Building jar: /home/jenkins/jenkins-slave/workspace/ven-plugin-tools_jdk11_asm7-J7667H6X6V4EBCRWUSKUMW4LMBBFILIHPFM47RV7V2XYHJFAOARA/linux-jdk11-m3.5.x_build/maven-plugin-tools-annotations/target/maven-plugin-tools-annotations-3.6.0-SNAPSHOT-test-sources.jar
[linux-jdk11-m3.5.x_build] [INFO] 
[linux-jdk11-m3.5.x_build] [INFO] --- maven-checkstyle-plugin:3.0.0:check (checkstyle-check)
@ maven-plugin-tools-annotations ---
[linux-jdk10-m3.5.x_build] [INFO] Tests run: 2, Failures: 0, Errors: 0, Skipped: 0, Time elapsed:
0.106 s - in org.apache.maven.tools.plugin.extractor.annotations.scanner.DefaultMojoAnnotationsScannerTest
[linux-jdk10-m3.5.x_build] [INFO] 
[linux-jdk10-m3.5.x_build] [INFO] Results:
[linux-jdk10-m3.5.x_build] [INFO] 
[linux-jdk10-m3.5.x_build] [INFO] Tests run: 3, Failures: 0, Errors: 0, Skipped: 0
[linux-jdk10-m3.5.x_build] [INFO] 
[linux-jdk10-m3.5.x_build] [INFO] 
[linux-jdk10-m3.5.x_build] [INFO] --- maven-jar-plugin:3.1.0:jar (default-jar) @ maven-plugin-tools-annotations
---
[linux-jdk10-m3.5.x_build] [INFO] Building jar: /home/jenkins/jenkins-slave/workspace/ven-plugin-tools_jdk11_asm7-J7667H6X6V4EBCRWUSKUMW4LMBBFILIHPFM47RV7V2XYHJFAOARA/linux-jdk10-m3.5.x_build/maven-plugin-tools-annotations/target/maven-plugin-tools-annotations-3.6.0-SNAPSHOT.jar
[linux-jdk10-m3.5.x_build] [INFO] 
[linux-jdk10-m3.5.x_build] [INFO] --- maven-site-plugin:3.7.1:attach-descriptor (attach-descriptor)
@ maven-plugin-tools-annotations ---
[linux-jdk10-m3.5.x_build] [INFO] Skipping because packaging 'jar' is not pom.
[linux-jdk10-m3.5.x_build] [INFO] 
[linux-jdk10-m3.5.x_build] [INFO] --- maven-jar-plugin:3.1.0:test-jar (default) @ maven-plugin-tools-annotations
---
[linux-jdk10-m3.5.x_build] [INFO] Building jar: /home/jenkins/jenkins-slave/workspace/ven-plugin-tools_jdk11_asm7-J7667H6X6V4EBCRWUSKUMW4LMBBFILIHPFM47RV7V2XYHJFAOARA/linux-jdk10-m3.5.x_build/maven-plugin-tools-annotations/target/maven-plugin-tools-annotations-3.6.0-SNAPSHOT-tests.jar
[linux-jdk10-m3.5.x_build] [INFO] 
[linux-jdk10-m3.5.x_build] [INFO] --- maven-source-plugin:3.0.1:test-jar-no-fork (default)
@ maven-plugin-tools-annotations ---
[linux-jdk10-m3.5.x_build] [INFO] Downloading from central: https://repo.maven.apache.org/maven2/org/apache/maven/shared/maven-shared-utils/3.0.1/maven-shared-utils-3.0.1.jar
[linux-jdk10-m3.5.x_build] [INFO] Downloaded from central: https://repo.maven.apache.org/maven2/org/apache/maven/shared/maven-shared-utils/3.0.1/maven-shared-utils-3.0.1.jar
(154 kB at 7.7 MB/s)
[linux-jdk10-m3.5.x_build] [INFO] Building jar: /home/jenkins/jenkins-slave/workspace/ven-plugin-tools_jdk11_asm7-J7667H6X6V4EBCRWUSKUMW4LMBBFILIHPFM47RV7V2XYHJFAOARA/linux-jdk10-m3.5.x_build/maven-plugin-tools-annotations/target/maven-plugin-tools-annotations-3.6.0-SNAPSHOT-test-sources.jar
[linux-jdk11-m3.5.x_build] [INFO] There are 8 errors reported by Checkstyle 6.18 with config/maven_checks.xml
ruleset.
[linux-jdk11-m3.5.x_build] [ERROR] src/main/java/org/apache/maven/tools/plugin/extractor/annotations/scanner/DefaultMojoAnnotationsScanner.java:[49,8]
(imports) UnusedImports: Unused import - org.codehaus.plexus.util.IOUtil.
[linux-jdk11-m3.5.x_build] [ERROR] src/main/java/org/apache/maven/tools/plugin/extractor/annotations/scanner/DefaultMojoAnnotationsScanner.java:[132,12]
(whitespace) WhitespaceAround: 'try' is not followed by whitespace.
[linux-jdk11-m3.5.x_build] [ERROR] src/main/java/org/apache/maven/tools/plugin/extractor/annotations/scanner/DefaultMojoAnnotationsScanner.java:[132,13]
(whitespace) ParenPad: '(' is not followed by whitespace.
[linux-jdk11-m3.5.x_build] [ERROR] src/main/java/org/apache/maven/tools/plugin/extractor/annotations/scanner/DefaultMojoAnnotationsScanner.java:[132,100]
(whitespace) ParenPad: ')' is not preceded with whitespace.
[linux-jdk11-m3.5.x_build] [ERROR] src/main/java/org/apache/maven/tools/plugin/extractor/annotations/scanner/DefaultMojoAnnotationsScanner.java:[191]
(sizes) LineLength: Line is longer than 120 characters (found 121).
[linux-jdk11-m3.5.x_build] [ERROR] src/main/java/org/apache/maven/tools/plugin/extractor/annotations/scanner/DefaultMojoAnnotationsScanner.java:[191,16]
(whitespace) WhitespaceAround: 'try' is not followed by whitespace.
[linux-jdk11-m3.5.x_build] [ERROR] src/main/java/org/apache/maven/tools/plugin/extractor/annotations/scanner/DefaultMojoAnnotationsScanner.java:[191,17]
(whitespace) ParenPad: '(' is not followed by whitespace.
[linux-jdk11-m3.5.x_build] [ERROR] src/main/java/org/apache/maven/tools/plugin/extractor/annotations/scanner/DefaultMojoAnnotationsScanner.java:[191,121]
(whitespace) ParenPad: ')' is not preceded with whitespace.
[linux-jdk11-m3.5.x_build] [INFO] ------------------------------------------------------------------------
[linux-jdk11-m3.5.x_build] [INFO] Reactor Summary:
[linux-jdk11-m3.5.x_build] [INFO] 
[linux-jdk11-m3.5.x_build] [INFO] Maven Plugin Tools 3.6.0-SNAPSHOT .................. SUCCESS
[ 14.845 s]
[linux-jdk11-m3.5.x_build] [INFO] Maven Plugin Tools Extractor API ................... SUCCESS
[  7.586 s]
[linux-jdk11-m3.5.x_build] [INFO] Maven Plugin Tools Generators ...................... SUCCESS
[  5.653 s]
[linux-jdk11-m3.5.x_build] [INFO] Maven Plugin Tool for Java with Javadoc Tags ....... SUCCESS
[  4.378 s]
[linux-jdk11-m3.5.x_build] [INFO] Maven Plugin Tools Java Annotations ................ SUCCESS
[  0.648 s]
[linux-jdk11-m3.5.x_build] [INFO] Maven Plugin Tool for Java with Annotations ........ FAILURE
[  4.071 s]
[linux-jdk11-m3.5.x_build] [INFO] Maven Script Mojo Support .......................... SKIPPED
[linux-jdk11-m3.5.x_build] [INFO] Maven Plugin Metadata Model ........................ SKIPPED
[linux-jdk11-m3.5.x_build] [INFO] Maven Plugin Tool for Ant .......................... SKIPPED
[linux-jdk11-m3.5.x_build] [INFO] Maven Ant Mojo Support ............................. SKIPPED
[linux-jdk11-m3.5.x_build] [INFO] Maven Plugin Tool for Beanshell .................... SKIPPED
[linux-jdk11-m3.5.x_build] [INFO] Maven Beanshell Mojo Support ....................... SKIPPED
[linux-jdk11-m3.5.x_build] [INFO] Maven Plugin Plugin 3.6.0-SNAPSHOT ................. SKIPPED
[linux-jdk11-m3.5.x_build] [INFO] ------------------------------------------------------------------------
[linux-jdk11-m3.5.x_build] [INFO] BUILD FAILURE
[linux-jdk11-m3.5.x_build] [INFO] ------------------------------------------------------------------------
[linux-jdk11-m3.5.x_build] [INFO] Total time: 38.643 s
[linux-jdk11-m3.5.x_build] [INFO] Finished at: 2018-10-03T22:17:58Z
[linux-jdk11-m3.5.x_build] [INFO] ------------------------------------------------------------------------
[linux-jdk11-m3.5.x_build] [INFO] [jenkins-event-spy] Generated /home/jenkins/jenkins-slave/workspace/ven-plugin-tools_jdk11_asm7-J7667H6X6V4EBCRWUSKUMW4LMBBFILIHPFM47RV7V2XYHJFAOARA@tmp/withMaven46c127e7/maven-spy-20181003-221719-4179266438506363627467.log
[linux-jdk11-m3.5.x_build] [ERROR] Failed to execute goal org.apache.maven.plugins:maven-checkstyle-plugin:3.0.0:check
(checkstyle-check) on project maven-plugin-tools-annotations: You have 8 Checkstyle violations.
-> [Help 1]
[linux-jdk11-m3.5.x_build] [ERROR] 
[linux-jdk11-m3.5.x_build] [ERROR] To see the full stack trace of the errors, re-run Maven
with the -e switch.
[linux-jdk11-m3.5.x_build] [ERROR] Re-run Maven using the -X switch to enable full debug logging.
[linux-jdk11-m3.5.x_build] [ERROR] 
[linux-jdk11-m3.5.x_build] [ERROR] For more information about the errors and possible solutions,
please read the following articles:
[linux-jdk11-m3.5.x_build] [ERROR] [Help 1] http://cwiki.apache.org/confluence/display/MAVEN/MojoFailureException
[linux-jdk11-m3.5.x_build] [ERROR] 
[linux-jdk11-m3.5.x_build] [ERROR] After correcting the problems, you can resume the build
with the command
[linux-jdk11-m3.5.x_build] [ERROR]   mvn <goals> -rf :maven-plugin-tools-annotations
[Pipeline] [linux-jdk11-m3.5.x_build] }
[Pipeline] [linux-jdk11-m3.5.x_build] // dir
[linux-jdk10-m3.5.x_build] [INFO] 
[linux-jdk10-m3.5.x_build] [INFO] --- maven-checkstyle-plugin:3.0.0:check (checkstyle-check)
@ maven-plugin-tools-annotations ---
[linux-jdk10-m3.5.x_build] [INFO] There are 8 errors reported by Checkstyle 6.18 with config/maven_checks.xml
ruleset.
[linux-jdk10-m3.5.x_build] [ERROR] src/main/java/org/apache/maven/tools/plugin/extractor/annotations/scanner/DefaultMojoAnnotationsScanner.java:[49,8]
(imports) UnusedImports: Unused import - org.codehaus.plexus.util.IOUtil.
[linux-jdk10-m3.5.x_build] [ERROR] src/main/java/org/apache/maven/tools/plugin/extractor/annotations/scanner/DefaultMojoAnnotationsScanner.java:[132,12]
(whitespace) WhitespaceAround: 'try' is not followed by whitespace.
[linux-jdk10-m3.5.x_build] [ERROR] src/main/java/org/apache/maven/tools/plugin/extractor/annotations/scanner/DefaultMojoAnnotationsScanner.java:[132,13]
(whitespace) ParenPad: '(' is not followed by whitespace.
[linux-jdk10-m3.5.x_build] [ERROR] src/main/java/org/apache/maven/tools/plugin/extractor/annotations/scanner/DefaultMojoAnnotationsScanner.java:[132,100]
(whitespace) ParenPad: ')' is not preceded with whitespace.
[linux-jdk10-m3.5.x_build] [ERROR] src/main/java/org/apache/maven/tools/plugin/extractor/annotations/scanner/DefaultMojoAnnotationsScanner.java:[191]
(sizes) LineLength: Line is longer than 120 characters (found 121).
[linux-jdk10-m3.5.x_build] [ERROR] src/main/java/org/apache/maven/tools/plugin/extractor/annotations/scanner/DefaultMojoAnnotationsScanner.java:[191,16]
(whitespace) WhitespaceAround: 'try' is not followed by whitespace.
[linux-jdk10-m3.5.x_build] [ERROR] src/main/java/org/apache/maven/tools/plugin/extractor/annotations/scanner/DefaultMojoAnnotationsScanner.java:[191,17]
(whitespace) ParenPad: '(' is not followed by whitespace.
[linux-jdk10-m3.5.x_build] [ERROR] src/main/java/org/apache/maven/tools/plugin/extractor/annotations/scanner/DefaultMojoAnnotationsScanner.java:[191,121]
(whitespace) ParenPad: ')' is not preceded with whitespace.
[linux-jdk10-m3.5.x_build] [INFO] ------------------------------------------------------------------------
[linux-jdk10-m3.5.x_build] [INFO] Reactor Summary:
[linux-jdk10-m3.5.x_build] [INFO] 
[linux-jdk10-m3.5.x_build] [INFO] Maven Plugin Tools 3.6.0-SNAPSHOT .................. SUCCESS
[ 15.554 s]
[linux-jdk10-m3.5.x_build] [INFO] Maven Plugin Tools Extractor API ................... SUCCESS
[  8.289 s]
[linux-jdk10-m3.5.x_build] [INFO] Maven Plugin Tools Generators ...................... SUCCESS
[  6.160 s]
[linux-jdk10-m3.5.x_build] [INFO] Maven Plugin Tool for Java with Javadoc Tags ....... SUCCESS
[  4.788 s]
[linux-jdk10-m3.5.x_build] [INFO] Maven Plugin Tools Java Annotations ................ SUCCESS
[  0.737 s]
[linux-jdk10-m3.5.x_build] [INFO] Maven Plugin Tool for Java with Annotations ........ FAILURE
[  4.179 s]
[linux-jdk10-m3.5.x_build] [INFO] Maven Script Mojo Support .......................... SKIPPED
[linux-jdk10-m3.5.x_build] [INFO] Maven Plugin Metadata Model ........................ SKIPPED
[linux-jdk10-m3.5.x_build] [INFO] Maven Plugin Tool for Ant .......................... SKIPPED
[linux-jdk10-m3.5.x_build] [INFO] Maven Ant Mojo Support ............................. SKIPPED
[linux-jdk10-m3.5.x_build] [INFO] Maven Plugin Tool for Beanshell .................... SKIPPED
[linux-jdk10-m3.5.x_build] [INFO] Maven Beanshell Mojo Support ....................... SKIPPED
[linux-jdk10-m3.5.x_build] [INFO] Maven Plugin Plugin 3.6.0-SNAPSHOT ................. SKIPPED
[linux-jdk10-m3.5.x_build] [INFO] ------------------------------------------------------------------------
[linux-jdk10-m3.5.x_build] [INFO] BUILD FAILURE
[linux-jdk10-m3.5.x_build] [INFO] ------------------------------------------------------------------------
[linux-jdk10-m3.5.x_build] [INFO] Total time: 41.203 s
[linux-jdk10-m3.5.x_build] [INFO] Finished at: 2018-10-03T22:17:59Z
[linux-jdk10-m3.5.x_build] [INFO] ------------------------------------------------------------------------
[linux-jdk10-m3.5.x_build] [INFO] [jenkins-event-spy] Generated /home/jenkins/jenkins-slave/workspace/ven-plugin-tools_jdk11_asm7-J7667H6X6V4EBCRWUSKUMW4LMBBFILIHPFM47RV7V2XYHJFAOARA@tmp/withMaven39619bf4/maven-spy-20181003-221718-2517091711387558004409.log
[linux-jdk10-m3.5.x_build] [ERROR] Failed to execute goal org.apache.maven.plugins:maven-checkstyle-plugin:3.0.0:check
(checkstyle-check) on project maven-plugin-tools-annotations: You have 8 Checkstyle violations.
-> [Help 1]
[linux-jdk10-m3.5.x_build] [ERROR] 
[linux-jdk10-m3.5.x_build] [ERROR] To see the full stack trace of the errors, re-run Maven
with the -e switch.
[linux-jdk10-m3.5.x_build] [ERROR] Re-run Maven using the -X switch to enable full debug logging.
[linux-jdk10-m3.5.x_build] [ERROR] 
[linux-jdk10-m3.5.x_build] [ERROR] For more information about the errors and possible solutions,
please read the following articles:
[linux-jdk10-m3.5.x_build] [ERROR] [Help 1] http://cwiki.apache.org/confluence/display/MAVEN/MojoFailureException
[linux-jdk10-m3.5.x_build] [ERROR] 
[linux-jdk10-m3.5.x_build] [ERROR] After correcting the problems, you can resume the build
with the command
[linux-jdk10-m3.5.x_build] [ERROR]   mvn <goals> -rf :maven-plugin-tools-annotations
[Pipeline] [linux-jdk11-m3.5.x_build] }
[linux-jdk11-m3.5.x_build] [withMaven] artifactsPublisher - Archive artifact linux-jdk11-m3.5.x_build/pom.xml
under org/apache/maven/plugin-tools/maven-plugin-tools/3.6.0-SNAPSHOT/maven-plugin-tools-3.6.0-SNAPSHOT.pom
[linux-jdk11-m3.5.x_build] [withMaven] artifactsPublisher - Archive artifact linux-jdk11-m3.5.x_build/target/maven-plugin-tools-3.6.0-SNAPSHOT-site.xml
under org/apache/maven/plugin-tools/maven-plugin-tools/3.6.0-SNAPSHOT/maven-plugin-tools-3.6.0-SNAPSHOT-site.xml
[linux-jdk11-m3.5.x_build] [withMaven] artifactsPublisher - Archive artifact linux-jdk11-m3.5.x_build/maven-plugin-tools-api/pom.xml
under org/apache/maven/plugin-tools/maven-plugin-tools-api/3.6.0-SNAPSHOT/maven-plugin-tools-api-3.6.0-SNAPSHOT.pom
[linux-jdk11-m3.5.x_build] [withMaven] artifactsPublisher - Archive artifact linux-jdk11-m3.5.x_build/maven-plugin-tools-api/target/maven-plugin-tools-api-3.6.0-SNAPSHOT.jar
under org/apache/maven/plugin-tools/maven-plugin-tools-api/3.6.0-SNAPSHOT/maven-plugin-tools-api-3.6.0-SNAPSHOT.jar
[linux-jdk11-m3.5.x_build] [withMaven] artifactsPublisher - Archive artifact linux-jdk11-m3.5.x_build/maven-plugin-tools-generators/pom.xml
under org/apache/maven/plugin-tools/maven-plugin-tools-generators/3.6.0-SNAPSHOT/maven-plugin-tools-generators-3.6.0-SNAPSHOT.pom
[linux-jdk11-m3.5.x_build] [withMaven] artifactsPublisher - Archive artifact linux-jdk11-m3.5.x_build/maven-plugin-tools-generators/target/maven-plugin-tools-generators-3.6.0-SNAPSHOT.jar
under org/apache/maven/plugin-tools/maven-plugin-tools-generators/3.6.0-SNAPSHOT/maven-plugin-tools-generators-3.6.0-SNAPSHOT.jar
[linux-jdk11-m3.5.x_build] [withMaven] artifactsPublisher - Archive artifact linux-jdk11-m3.5.x_build/maven-plugin-tools-java/pom.xml
under org/apache/maven/plugin-tools/maven-plugin-tools-java/3.6.0-SNAPSHOT/maven-plugin-tools-java-3.6.0-SNAPSHOT.pom
[linux-jdk11-m3.5.x_build] [withMaven] artifactsPublisher - Archive artifact linux-jdk11-m3.5.x_build/maven-plugin-tools-java/target/maven-plugin-tools-java-3.6.0-SNAPSHOT.jar
under org/apache/maven/plugin-tools/maven-plugin-tools-java/3.6.0-SNAPSHOT/maven-plugin-tools-java-3.6.0-SNAPSHOT.jar
[linux-jdk11-m3.5.x_build] [withMaven] artifactsPublisher - Archive artifact linux-jdk11-m3.5.x_build/maven-plugin-annotations/pom.xml
under org/apache/maven/plugin-tools/maven-plugin-annotations/3.6.0-SNAPSHOT/maven-plugin-annotations-3.6.0-SNAPSHOT.pom
[linux-jdk11-m3.5.x_build] [withMaven] artifactsPublisher - Archive artifact linux-jdk11-m3.5.x_build/maven-plugin-annotations/target/maven-plugin-annotations-3.6.0-SNAPSHOT.jar
under org/apache/maven/plugin-tools/maven-plugin-annotations/3.6.0-SNAPSHOT/maven-plugin-annotations-3.6.0-SNAPSHOT.jar
[linux-jdk11-m3.5.x_build] [withMaven] junitPublisher - Archive test results for Maven artifact
org.apache.maven.plugin-tools:maven-plugin-tools-api:3.6.0-SNAPSHOT generated by maven-surefire-plugin:test
(default-test): linux-jdk11-m3.5.x_build/maven-plugin-tools-api/target/surefire-reports/*.xml
[linux-jdk11-m3.5.x_build] Recording test results
[linux-jdk11-m3.5.x_build] [withMaven] junitPublisher - Archive test results for Maven artifact
org.apache.maven.plugin-tools:maven-plugin-tools-generators:3.6.0-SNAPSHOT generated by maven-surefire-plugin:test
(default-test): linux-jdk11-m3.5.x_build/maven-plugin-tools-generators/target/surefire-reports/*.xml
[linux-jdk11-m3.5.x_build] Recording test results
[linux-jdk11-m3.5.x_build] [withMaven] junitPublisher - Archive test results for Maven artifact
org.apache.maven.plugin-tools:maven-plugin-tools-java:3.6.0-SNAPSHOT generated by maven-surefire-plugin:test
(default-test): linux-jdk11-m3.5.x_build/maven-plugin-tools-java/target/surefire-reports/*.xml
[linux-jdk11-m3.5.x_build] Recording test results
[linux-jdk11-m3.5.x_build] [withMaven] junitPublisher - Archive test results for Maven artifact
org.apache.maven.plugin-tools:maven-plugin-annotations:3.6.0-SNAPSHOT generated by maven-surefire-plugin:test
(default-test): linux-jdk11-m3.5.x_build/maven-plugin-annotations/target/surefire-reports/*.xml
[linux-jdk11-m3.5.x_build] Recording test results
[linux-jdk11-m3.5.x_build] None of the test reports contained any result
[linux-jdk11-m3.5.x_build] [withMaven] junitPublisher - Archive test results for Maven artifact
org.apache.maven.plugin-tools:maven-plugin-tools-annotations:3.6.0-SNAPSHOT generated by maven-surefire-plugin:test
(default-test): linux-jdk11-m3.5.x_build/maven-plugin-tools-annotations/target/surefire-reports/*.xml
[linux-jdk11-m3.5.x_build] Recording test results
[linux-jdk11-m3.5.x_build] [withMaven] openTasksPublisher - Scan Tasks for Maven artifact
org.apache.maven.plugin-tools:maven-plugin-tools-api:3.6.0-SNAPSHOT in source directory linux-jdk11-m3.5.x_build/maven-plugin-tools-api/src/main/java
[linux-jdk11-m3.5.x_build] [withMaven] openTasksPublisher - Scan Tasks for Maven artifact
org.apache.maven.plugin-tools:maven-plugin-tools-generators:3.6.0-SNAPSHOT in source directory
linux-jdk11-m3.5.x_build/maven-plugin-tools-generators/src/main/java
[linux-jdk11-m3.5.x_build] [withMaven] openTasksPublisher - Scan Tasks for Maven artifact
org.apache.maven.plugin-tools:maven-plugin-tools-java:3.6.0-SNAPSHOT in source directory linux-jdk11-m3.5.x_build/maven-plugin-tools-java/src/main/java
[linux-jdk11-m3.5.x_build] [withMaven] openTasksPublisher - Scan Tasks for Maven artifact
org.apache.maven.plugin-tools:maven-plugin-annotations:3.6.0-SNAPSHOT in source directory
linux-jdk11-m3.5.x_build/maven-plugin-annotations/src/main/java
[linux-jdk11-m3.5.x_build] [withMaven] openTasksPublisher - Scan Tasks for Maven artifact
org.apache.maven.plugin-tools:maven-plugin-tools-annotations:3.6.0-SNAPSHOT in source directory
linux-jdk11-m3.5.x_build/maven-plugin-tools-annotations/src/main/java
[linux-jdk11-m3.5.x_build] [TASKS] Scanning folder '/home/jenkins/jenkins-slave/workspace/ven-plugin-tools_jdk11_asm7-J7667H6X6V4EBCRWUSKUMW4LMBBFILIHPFM47RV7V2XYHJFAOARA'
for files matching the pattern 'linux-jdk11-m3.5.x_build/maven-plugin-tools-api/src/main/java/**/*,linux-jdk11-m3.5.x_build/maven-plugin-tools-generators/src/main/java/**/*,linux-jdk11-m3.5.x_build/maven-plugin-tools-java/src/main/java/**/*,linux-jdk11-m3.5.x_build/maven-plugin-annotations/src/main/java/**/*,linux-jdk11-m3.5.x_build/maven-plugin-tools-annotations/src/main/java/**/*'
- excludes: null
[linux-jdk11-m3.5.x_build] [TASKS] Found 38 files to scan for tasks
[linux-jdk11-m3.5.x_build] [TASKS] Found 8 open tasks.
[linux-jdk11-m3.5.x_build] Skipping warnings blame since pipelines do not have an SCM link.%n
[linux-jdk11-m3.5.x_build] [TASKS] Computing warning deltas based on reference build #5
[Pipeline] [linux-jdk11-m3.5.x_build] // withMaven
[Pipeline] [linux-jdk10-m3.5.x_build] }
[Pipeline] [linux-jdk11-m3.5.x_build] cleanWs
[Pipeline] [linux-jdk10-m3.5.x_build] // dir
[linux-jdk11-m3.5.x_build] [WS-CLEANUP] Deleting project workspace...[WS-CLEANUP] done
[Pipeline] [linux-jdk10-m3.5.x_build] }
[linux-jdk10-m3.5.x_build] [withMaven] artifactsPublisher - Archive artifact linux-jdk10-m3.5.x_build/pom.xml
under org/apache/maven/plugin-tools/maven-plugin-tools/3.6.0-SNAPSHOT/maven-plugin-tools-3.6.0-SNAPSHOT.pom
[linux-jdk10-m3.5.x_build] [withMaven] artifactsPublisher - Archive artifact linux-jdk10-m3.5.x_build/target/maven-plugin-tools-3.6.0-SNAPSHOT-site.xml
under org/apache/maven/plugin-tools/maven-plugin-tools/3.6.0-SNAPSHOT/maven-plugin-tools-3.6.0-SNAPSHOT-site.xml
[linux-jdk10-m3.5.x_build] [withMaven] artifactsPublisher - Archive artifact linux-jdk10-m3.5.x_build/maven-plugin-tools-api/pom.xml
under org/apache/maven/plugin-tools/maven-plugin-tools-api/3.6.0-SNAPSHOT/maven-plugin-tools-api-3.6.0-SNAPSHOT.pom
[linux-jdk10-m3.5.x_build] [withMaven] artifactsPublisher - Archive artifact linux-jdk10-m3.5.x_build/maven-plugin-tools-api/target/maven-plugin-tools-api-3.6.0-SNAPSHOT.jar
under org/apache/maven/plugin-tools/maven-plugin-tools-api/3.6.0-SNAPSHOT/maven-plugin-tools-api-3.6.0-SNAPSHOT.jar
[linux-jdk10-m3.5.x_build] [withMaven] artifactsPublisher - Archive artifact linux-jdk10-m3.5.x_build/maven-plugin-tools-generators/pom.xml
under org/apache/maven/plugin-tools/maven-plugin-tools-generators/3.6.0-SNAPSHOT/maven-plugin-tools-generators-3.6.0-SNAPSHOT.pom
[linux-jdk10-m3.5.x_build] [withMaven] artifactsPublisher - Archive artifact linux-jdk10-m3.5.x_build/maven-plugin-tools-generators/target/maven-plugin-tools-generators-3.6.0-SNAPSHOT.jar
under org/apache/maven/plugin-tools/maven-plugin-tools-generators/3.6.0-SNAPSHOT/maven-plugin-tools-generators-3.6.0-SNAPSHOT.jar
[linux-jdk10-m3.5.x_build] [withMaven] artifactsPublisher - Archive artifact linux-jdk10-m3.5.x_build/maven-plugin-tools-java/pom.xml
under org/apache/maven/plugin-tools/maven-plugin-tools-java/3.6.0-SNAPSHOT/maven-plugin-tools-java-3.6.0-SNAPSHOT.pom
[linux-jdk10-m3.5.x_build] [withMaven] artifactsPublisher - Archive artifact linux-jdk10-m3.5.x_build/maven-plugin-tools-java/target/maven-plugin-tools-java-3.6.0-SNAPSHOT.jar
under org/apache/maven/plugin-tools/maven-plugin-tools-java/3.6.0-SNAPSHOT/maven-plugin-tools-java-3.6.0-SNAPSHOT.jar
[linux-jdk10-m3.5.x_build] [withMaven] artifactsPublisher - Archive artifact linux-jdk10-m3.5.x_build/maven-plugin-annotations/pom.xml
under org/apache/maven/plugin-tools/maven-plugin-annotations/3.6.0-SNAPSHOT/maven-plugin-annotations-3.6.0-SNAPSHOT.pom
[linux-jdk10-m3.5.x_build] [withMaven] artifactsPublisher - Archive artifact linux-jdk10-m3.5.x_build/maven-plugin-annotations/target/maven-plugin-annotations-3.6.0-SNAPSHOT.jar
under org/apache/maven/plugin-tools/maven-plugin-annotations/3.6.0-SNAPSHOT/maven-plugin-annotations-3.6.0-SNAPSHOT.jar
[linux-jdk10-m3.5.x_build] [withMaven] junitPublisher - Archive test results for Maven artifact
org.apache.maven.plugin-tools:maven-plugin-tools-api:3.6.0-SNAPSHOT generated by maven-surefire-plugin:test
(default-test): linux-jdk10-m3.5.x_build/maven-plugin-tools-api/target/surefire-reports/*.xml
[linux-jdk10-m3.5.x_build] Recording test results
[linux-jdk10-m3.5.x_build] [withMaven] junitPublisher - Archive test results for Maven artifact
org.apache.maven.plugin-tools:maven-plugin-tools-generators:3.6.0-SNAPSHOT generated by maven-surefire-plugin:test
(default-test): linux-jdk10-m3.5.x_build/maven-plugin-tools-generators/target/surefire-reports/*.xml
[linux-jdk10-m3.5.x_build] Recording test results
[linux-jdk10-m3.5.x_build] [withMaven] junitPublisher - Archive test results for Maven artifact
org.apache.maven.plugin-tools:maven-plugin-tools-java:3.6.0-SNAPSHOT generated by maven-surefire-plugin:test
(default-test): linux-jdk10-m3.5.x_build/maven-plugin-tools-java/target/surefire-reports/*.xml
[linux-jdk10-m3.5.x_build] Recording test results
[linux-jdk10-m3.5.x_build] [withMaven] junitPublisher - Archive test results for Maven artifact
org.apache.maven.plugin-tools:maven-plugin-annotations:3.6.0-SNAPSHOT generated by maven-surefire-plugin:test
(default-test): linux-jdk10-m3.5.x_build/maven-plugin-annotations/target/surefire-reports/*.xml
[linux-jdk10-m3.5.x_build] Recording test results
[linux-jdk10-m3.5.x_build] None of the test reports contained any result
[linux-jdk10-m3.5.x_build] [withMaven] junitPublisher - Archive test results for Maven artifact
org.apache.maven.plugin-tools:maven-plugin-tools-annotations:3.6.0-SNAPSHOT generated by maven-surefire-plugin:test
(default-test): linux-jdk10-m3.5.x_build/maven-plugin-tools-annotations/target/surefire-reports/*.xml
[linux-jdk10-m3.5.x_build] Recording test results
[linux-jdk10-m3.5.x_build] [withMaven] openTasksPublisher - Scan Tasks for Maven artifact
org.apache.maven.plugin-tools:maven-plugin-tools-api:3.6.0-SNAPSHOT in source directory linux-jdk10-m3.5.x_build/maven-plugin-tools-api/src/main/java
[linux-jdk10-m3.5.x_build] [withMaven] openTasksPublisher - Scan Tasks for Maven artifact
org.apache.maven.plugin-tools:maven-plugin-tools-generators:3.6.0-SNAPSHOT in source directory
linux-jdk10-m3.5.x_build/maven-plugin-tools-generators/src/main/java
[linux-jdk10-m3.5.x_build] [withMaven] openTasksPublisher - Scan Tasks for Maven artifact
org.apache.maven.plugin-tools:maven-plugin-tools-java:3.6.0-SNAPSHOT in source directory linux-jdk10-m3.5.x_build/maven-plugin-tools-java/src/main/java
[linux-jdk10-m3.5.x_build] [withMaven] openTasksPublisher - Scan Tasks for Maven artifact
org.apache.maven.plugin-tools:maven-plugin-annotations:3.6.0-SNAPSHOT in source directory
linux-jdk10-m3.5.x_build/maven-plugin-annotations/src/main/java
[linux-jdk10-m3.5.x_build] [withMaven] openTasksPublisher - Scan Tasks for Maven artifact
org.apache.maven.plugin-tools:maven-plugin-tools-annotations:3.6.0-SNAPSHOT in source directory
linux-jdk10-m3.5.x_build/maven-plugin-tools-annotations/src/main/java
[linux-jdk10-m3.5.x_build] [TASKS] Scanning folder '/home/jenkins/jenkins-slave/workspace/ven-plugin-tools_jdk11_asm7-J7667H6X6V4EBCRWUSKUMW4LMBBFILIHPFM47RV7V2XYHJFAOARA'
for files matching the pattern 'linux-jdk10-m3.5.x_build/maven-plugin-tools-api/src/main/java/**/*,linux-jdk10-m3.5.x_build/maven-plugin-tools-generators/src/main/java/**/*,linux-jdk10-m3.5.x_build/maven-plugin-tools-java/src/main/java/**/*,linux-jdk10-m3.5.x_build/maven-plugin-annotations/src/main/java/**/*,linux-jdk10-m3.5.x_build/maven-plugin-tools-annotations/src/main/java/**/*'
- excludes: null
[linux-jdk10-m3.5.x_build] [TASKS] Found 38 files to scan for tasks
[linux-jdk10-m3.5.x_build] [TASKS] Found 8 open tasks.
[linux-jdk10-m3.5.x_build] Skipping warnings blame since pipelines do not have an SCM link.%n
[linux-jdk10-m3.5.x_build] [TASKS] Computing warning deltas based on reference build #5
[Pipeline] [linux-jdk10-m3.5.x_build] // withMaven
[Pipeline] [linux-jdk10-m3.5.x_build] cleanWs
[Pipeline] [linux-jdk11-m3.5.x_build] cleanWs
[linux-jdk10-m3.5.x_build] [WS-CLEANUP] Deleting project workspace...[WS-CLEANUP] done
[linux-jdk11-m3.5.x_build] [WS-CLEANUP] Deleting project workspace...[WS-CLEANUP] done
[Pipeline] [linux-jdk11-m3.5.x_build] }
[Pipeline] [linux-jdk11-m3.5.x_build] // stage
[Pipeline] [linux-jdk11-m3.5.x_build] }
[Pipeline] [linux-jdk10-m3.5.x_build] cleanWs
[Pipeline] [linux-jdk11-m3.5.x_build] // node
[Pipeline] [linux-jdk11-m3.5.x_build] }
[linux-jdk11-m3.5.x_build] Failed in branch linux-jdk11-m3.5.x_build
[linux-jdk10-m3.5.x_build] [WS-CLEANUP] Deleting project workspace...[WS-CLEANUP] done
[Pipeline] [linux-jdk10-m3.5.x_build] }
[Pipeline] [linux-jdk10-m3.5.x_build] // stage
[Pipeline] [linux-jdk10-m3.5.x_build] }
[Pipeline] [linux-jdk10-m3.5.x_build] // node
[Pipeline] [linux-jdk10-m3.5.x_build] }
[linux-jdk10-m3.5.x_build] Failed in branch linux-jdk10-m3.5.x_build
[Pipeline] // parallel
[Pipeline] stage
[Pipeline] { (Notifications)
[Pipeline] echo
Build result: FAILURE
[Pipeline] jiraIssueSelector
[Pipeline] emailext
Mime
  • Unnamed multipart/mixed (inline, None, 0 bytes)
View raw message