maven-notifications mailing list archives

Site index · List index
Message view « Date » · « Thread »
Top « Date » · « Thread »
From Apache Jenkins Server <jenk...@builds.apache.org>
Subject Build unstable in Jenkins: Maven TLP » maven-plugin-tools » master #47
Date Mon, 08 Oct 2018 11:39:16 GMT
See https://builds.apache.org/job/maven-box/job/maven-plugin-tools/job/master/47/

Changes:

* [MPLUGIN-332] remove plugin:updateRegistry goal, which is unused in
* [MPLUGIN-332] remove plugin:updateRegistry goal, which is unused in
* [MPLUGIN-332] remove plugin:updateRegistry goal, which is unused in
* [MPLUGIN-332] remove plugin:updateRegistry goal, which is unused in
* [MPLUGIN-332] remove plugin:updateRegistry goal, which is unused in
* [MPLUGIN-332] remove plugin:updateRegistry goal, which is unused in
* [MPLUGIN-332] remove plugin:updateRegistry goal, which is unused in
* [MPLUGIN-332] remove plugin:updateRegistry goal, which is unused in
* [MPLUGIN-332] remove plugin:updateRegistry goal, which is unused in
* [MPLUGIN-332] remove plugin:updateRegistry goal, which is unused in
* [MPLUGIN-332] remove plugin:updateRegistry goal, which is unused in
* [MPLUGIN-332] remove plugin:updateRegistry goal, which is unused in
* [MPLUGIN-332] remove plugin:updateRegistry goal, which is unused in
* [MPLUGIN-332] remove plugin:updateRegistry goal, which is unused in

1 tests failed.
FAILED:  org.apache.maven.tools.plugin.generator.PluginXdocGeneratorTest.testGenerator

Error Message:
/tmp/testGenerator-outDir/testGoal-mojo.xml (No such file or directory)

Stack Trace:
org.apache.maven.tools.plugin.generator.GeneratorException: /tmp/testGenerator-outDir/testGoal-mojo.xml (No such file or directory)
	at org.apache.maven.tools.plugin.generator.PluginXdocGenerator.execute(PluginXdocGenerator.java:119)
	at org.apache.maven.tools.plugin.generator.AbstractGeneratorTestCase.testGenerator(AbstractGeneratorTestCase.java:119)
	at java.base/jdk.internal.reflect.NativeMethodAccessorImpl.invoke0(Native Method)
	at java.base/jdk.internal.reflect.NativeMethodAccessorImpl.invoke(NativeMethodAccessorImpl.java:62)
	at java.base/jdk.internal.reflect.DelegatingMethodAccessorImpl.invoke(DelegatingMethodAccessorImpl.java:43)
	at java.base/java.lang.reflect.Method.invoke(Method.java:564)
	at junit.framework.TestCase.runTest(TestCase.java:164)
	at junit.framework.TestCase.runBare(TestCase.java:130)
	at junit.framework.TestResult$1.protect(TestResult.java:106)
	at junit.framework.TestResult.runProtected(TestResult.java:124)
	at junit.framework.TestResult.run(TestResult.java:109)
	at junit.framework.TestCase.run(TestCase.java:120)
	at junit.framework.TestSuite.runTest(TestSuite.java:230)
	at junit.framework.TestSuite.run(TestSuite.java:225)
	at java.base/jdk.internal.reflect.NativeMethodAccessorImpl.invoke0(Native Method)
	at java.base/jdk.internal.reflect.NativeMethodAccessorImpl.invoke(NativeMethodAccessorImpl.java:62)
	at java.base/jdk.internal.reflect.DelegatingMethodAccessorImpl.invoke(DelegatingMethodAccessorImpl.java:43)
	at java.base/java.lang.reflect.Method.invoke(Method.java:564)
	at org.apache.maven.surefire.junit.JUnitTestSet.execute(JUnitTestSet.java:100)
	at org.apache.maven.surefire.junit.JUnit3Provider.executeTestSet(JUnit3Provider.java:140)
	at org.apache.maven.surefire.junit.JUnit3Provider.invoke(JUnit3Provider.java:113)
	at org.apache.maven.surefire.booter.ForkedBooter.invokeProviderInSameClassLoader(ForkedBooter.java:383)
	at org.apache.maven.surefire.booter.ForkedBooter.runSuitesInProcess(ForkedBooter.java:344)
	at org.apache.maven.surefire.booter.ForkedBooter.execute(ForkedBooter.java:125)
	at org.apache.maven.surefire.booter.ForkedBooter.main(ForkedBooter.java:417)
Caused by: java.io.FileNotFoundException: /tmp/testGenerator-outDir/testGoal-mojo.xml (No such file or directory)
	at java.base/java.io.FileOutputStream.open0(Native Method)
	at java.base/java.io.FileOutputStream.open(FileOutputStream.java:299)
	at java.base/java.io.FileOutputStream.<init>(FileOutputStream.java:238)
	at java.base/java.io.FileOutputStream.<init>(FileOutputStream.java:188)
	at org.apache.maven.tools.plugin.generator.PluginXdocGenerator.processMojoDescriptor(PluginXdocGenerator.java:134)
	at org.apache.maven.tools.plugin.generator.PluginXdocGenerator.execute(PluginXdocGenerator.java:113)
	... 24 more
Caused by: java.io.FileNotFoundException: /tmp/testGenerator-outDir/testGoal-mojo.xml (No such file or directory)
	at java.base/java.io.FileOutputStream.open0(Native Method)
	at java.base/java.io.FileOutputStream.open(FileOutputStream.java:299)
	at java.base/java.io.FileOutputStream.<init>(FileOutputStream.java:238)
	at java.base/java.io.FileOutputStream.<init>(FileOutputStream.java:188)
	at org.apache.maven.tools.plugin.generator.PluginXdocGenerator.processMojoDescriptor(PluginXdocGenerator.java:134)
	at org.apache.maven.tools.plugin.generator.PluginXdocGenerator.execute(PluginXdocGenerator.java:113)
	... 24 more




Build log:
[...truncated 7.48 MB...]
[windows-jdk7-m3.3.x_build] [withMaven] artifactsPublisher - Archive artifact windows-jdk7-m3.3.x_build\target\maven-plugin-tools-3.6.0-SNAPSHOT-site.xml under org\apache\maven\plugin-tools\maven-plugin-tools\3.6.0-SNAPSHOT\maven-plugin-tools-3.6.0-SNAPSHOT-site.xml
[windows-jdk7-m3.3.x_build] [withMaven] artifactsPublisher - Archive artifact windows-jdk7-m3.3.x_build\maven-plugin-tools-api\pom.xml under org\apache\maven\plugin-tools\maven-plugin-tools-api\3.6.0-SNAPSHOT\maven-plugin-tools-api-3.6.0-SNAPSHOT.pom
[windows-jdk7-m3.3.x_build] [withMaven] artifactsPublisher - Archive artifact windows-jdk7-m3.3.x_build\maven-plugin-tools-api\target\maven-plugin-tools-api-3.6.0-SNAPSHOT.jar under org\apache\maven\plugin-tools\maven-plugin-tools-api\3.6.0-SNAPSHOT\maven-plugin-tools-api-3.6.0-SNAPSHOT.jar
[windows-jdk7-m3.3.x_build] [withMaven] artifactsPublisher - Archive artifact windows-jdk7-m3.3.x_build\maven-plugin-tools-generators\pom.xml under org\apache\maven\plugin-tools\maven-plugin-tools-generators\3.6.0-SNAPSHOT\maven-plugin-tools-generators-3.6.0-SNAPSHOT.pom
[windows-jdk7-m3.3.x_build] [withMaven] artifactsPublisher - Archive artifact windows-jdk7-m3.3.x_build\maven-plugin-tools-generators\target\maven-plugin-tools-generators-3.6.0-SNAPSHOT.jar under org\apache\maven\plugin-tools\maven-plugin-tools-generators\3.6.0-SNAPSHOT\maven-plugin-tools-generators-3.6.0-SNAPSHOT.jar
[windows-jdk7-m3.3.x_build] [withMaven] artifactsPublisher - Archive artifact windows-jdk7-m3.3.x_build\maven-plugin-tools-java\pom.xml under org\apache\maven\plugin-tools\maven-plugin-tools-java\3.6.0-SNAPSHOT\maven-plugin-tools-java-3.6.0-SNAPSHOT.pom
[windows-jdk7-m3.3.x_build] [withMaven] artifactsPublisher - Archive artifact windows-jdk7-m3.3.x_build\maven-plugin-tools-java\target\maven-plugin-tools-java-3.6.0-SNAPSHOT.jar under org\apache\maven\plugin-tools\maven-plugin-tools-java\3.6.0-SNAPSHOT\maven-plugin-tools-java-3.6.0-SNAPSHOT.jar
[windows-jdk7-m3.3.x_build] [withMaven] artifactsPublisher - Archive artifact windows-jdk7-m3.3.x_build\maven-plugin-annotations\pom.xml under org\apache\maven\plugin-tools\maven-plugin-annotations\3.6.0-SNAPSHOT\maven-plugin-annotations-3.6.0-SNAPSHOT.pom
[windows-jdk7-m3.3.x_build] [withMaven] artifactsPublisher - Archive artifact windows-jdk7-m3.3.x_build\maven-plugin-annotations\target\maven-plugin-annotations-3.6.0-SNAPSHOT.jar under org\apache\maven\plugin-tools\maven-plugin-annotations\3.6.0-SNAPSHOT\maven-plugin-annotations-3.6.0-SNAPSHOT.jar
[windows-jdk7-m3.3.x_build] [withMaven] artifactsPublisher - Archive artifact windows-jdk7-m3.3.x_build\maven-plugin-tools-annotations\pom.xml under org\apache\maven\plugin-tools\maven-plugin-tools-annotations\3.6.0-SNAPSHOT\maven-plugin-tools-annotations-3.6.0-SNAPSHOT.pom
[windows-jdk7-m3.3.x_build] [withMaven] artifactsPublisher - Archive artifact windows-jdk7-m3.3.x_build\maven-plugin-tools-annotations\target\maven-plugin-tools-annotations-3.6.0-SNAPSHOT.jar under org\apache\maven\plugin-tools\maven-plugin-tools-annotations\3.6.0-SNAPSHOT\maven-plugin-tools-annotations-3.6.0-SNAPSHOT.jar
[windows-jdk7-m3.3.x_build] [withMaven] artifactsPublisher - Archive artifact windows-jdk7-m3.3.x_build\maven-plugin-tools-annotations\target\maven-plugin-tools-annotations-3.6.0-SNAPSHOT-tests.jar under org\apache\maven\plugin-tools\maven-plugin-tools-annotations\3.6.0-SNAPSHOT\maven-plugin-tools-annotations-3.6.0-SNAPSHOT-tests.jar
[windows-jdk7-m3.3.x_build] [withMaven] artifactsPublisher - Archive artifact windows-jdk7-m3.3.x_build\maven-plugin-tools-annotations\target\maven-plugin-tools-annotations-3.6.0-SNAPSHOT-test-sources.jar under org\apache\maven\plugin-tools\maven-plugin-tools-annotations\3.6.0-SNAPSHOT\maven-plugin-tools-annotations-3.6.0-SNAPSHOT-test-sources.jar
[windows-jdk7-m3.3.x_build] [withMaven] artifactsPublisher - Archive artifact windows-jdk7-m3.3.x_build\maven-script\pom.xml under org\apache\maven\plugin-tools\maven-script\3.6.0-SNAPSHOT\maven-script-3.6.0-SNAPSHOT.pom
[windows-jdk7-m3.3.x_build] [withMaven] artifactsPublisher - Archive artifact windows-jdk7-m3.3.x_build\maven-script\target\maven-script-3.6.0-SNAPSHOT-site.xml under org\apache\maven\plugin-tools\maven-script\3.6.0-SNAPSHOT\maven-script-3.6.0-SNAPSHOT-site.xml
[windows-jdk7-m3.3.x_build] [withMaven] artifactsPublisher - Archive artifact windows-jdk7-m3.3.x_build\maven-script\maven-plugin-tools-model\pom.xml under org\apache\maven\plugin-tools\maven-plugin-tools-model\3.6.0-SNAPSHOT\maven-plugin-tools-model-3.6.0-SNAPSHOT.pom
[windows-jdk7-m3.3.x_build] [withMaven] artifactsPublisher - Archive artifact windows-jdk7-m3.3.x_build\maven-script\maven-plugin-tools-model\target\maven-plugin-tools-model-3.6.0-SNAPSHOT.jar under org\apache\maven\plugin-tools\maven-plugin-tools-model\3.6.0-SNAPSHOT\maven-plugin-tools-model-3.6.0-SNAPSHOT.jar
[windows-jdk7-m3.3.x_build] [withMaven] artifactsPublisher - Archive artifact windows-jdk7-m3.3.x_build\maven-script\maven-plugin-tools-ant\pom.xml under org\apache\maven\plugin-tools\maven-plugin-tools-ant\3.6.0-SNAPSHOT\maven-plugin-tools-ant-3.6.0-SNAPSHOT.pom
[windows-jdk7-m3.3.x_build] [withMaven] artifactsPublisher - Archive artifact windows-jdk7-m3.3.x_build\maven-script\maven-plugin-tools-ant\target\maven-plugin-tools-ant-3.6.0-SNAPSHOT.jar under org\apache\maven\plugin-tools\maven-plugin-tools-ant\3.6.0-SNAPSHOT\maven-plugin-tools-ant-3.6.0-SNAPSHOT.jar
[windows-jdk7-m3.3.x_build] [withMaven] artifactsPublisher - Archive artifact windows-jdk7-m3.3.x_build\maven-script\maven-script-ant\pom.xml under org\apache\maven\plugin-tools\maven-script-ant\3.6.0-SNAPSHOT\maven-script-ant-3.6.0-SNAPSHOT.pom
[windows-jdk7-m3.3.x_build] [withMaven] artifactsPublisher - Archive artifact windows-jdk7-m3.3.x_build\maven-script\maven-script-ant\target\maven-script-ant-3.6.0-SNAPSHOT.jar under org\apache\maven\plugin-tools\maven-script-ant\3.6.0-SNAPSHOT\maven-script-ant-3.6.0-SNAPSHOT.jar
[windows-jdk7-m3.3.x_build] [withMaven] artifactsPublisher - Archive artifact windows-jdk7-m3.3.x_build\maven-script\maven-plugin-tools-beanshell\pom.xml under org\apache\maven\plugin-tools\maven-plugin-tools-beanshell\3.6.0-SNAPSHOT\maven-plugin-tools-beanshell-3.6.0-SNAPSHOT.pom
[windows-jdk7-m3.3.x_build] [withMaven] artifactsPublisher - Archive artifact windows-jdk7-m3.3.x_build\maven-script\maven-plugin-tools-beanshell\target\maven-plugin-tools-beanshell-3.6.0-SNAPSHOT.jar under org\apache\maven\plugin-tools\maven-plugin-tools-beanshell\3.6.0-SNAPSHOT\maven-plugin-tools-beanshell-3.6.0-SNAPSHOT.jar
[windows-jdk7-m3.3.x_build] [withMaven] artifactsPublisher - Archive artifact windows-jdk7-m3.3.x_build\maven-script\maven-script-beanshell\pom.xml under org\apache\maven\plugin-tools\maven-script-beanshell\3.6.0-SNAPSHOT\maven-script-beanshell-3.6.0-SNAPSHOT.pom
[windows-jdk7-m3.3.x_build] [withMaven] artifactsPublisher - Archive artifact windows-jdk7-m3.3.x_build\maven-script\maven-script-beanshell\target\maven-script-beanshell-3.6.0-SNAPSHOT.jar under org\apache\maven\plugin-tools\maven-script-beanshell\3.6.0-SNAPSHOT\maven-script-beanshell-3.6.0-SNAPSHOT.jar
[windows-jdk7-m3.3.x_build] [withMaven] artifactsPublisher - Archive artifact windows-jdk7-m3.3.x_build\maven-plugin-plugin\pom.xml under org\apache\maven\plugins\maven-plugin-plugin\3.6.0-SNAPSHOT\maven-plugin-plugin-3.6.0-SNAPSHOT.pom
[windows-jdk7-m3.3.x_build] [withMaven] artifactsPublisher - Archive artifact windows-jdk7-m3.3.x_build\maven-plugin-plugin\target\maven-plugin-plugin-3.6.0-SNAPSHOT.jar under org\apache\maven\plugins\maven-plugin-plugin\3.6.0-SNAPSHOT\maven-plugin-plugin-3.6.0-SNAPSHOT.jar
[windows-jdk7-m3.3.x_build] [withMaven] invokerPublisher - Archive invoker results for Maven artifact MavenArtifact{org.apache.maven.plugins:maven-plugin-plugin::3.6.0-SNAPSHOT(version: 3.6.0-SNAPSHOT, snapshot:false) } generated by PluginInvocation{org.apache.maven.plugins:maven-invoker-plugin:3.0.1@run  integration-test}: windows-jdk7-m3.3.x_build\maven-plugin-plugin\target\invoker-reports\*.xml
[windows-jdk7-m3.3.x_build] performing MavenInvokerRecorder, reportsFilenamePattern:'**/windows-jdk7-m3.3.x_build\maven-plugin-plugin\target\invoker-reports/BUILD*.xml', invokerBuildDir:'**/windows-jdk7-m3.3.x_build\maven-plugin-plugin\target\it'
[windows-jdk7-m3.3.x_build] Found reports:[f:\jenkins\jenkins-slave\workspace\x_maven-plugin-tools_master-XKS4EHY3PSXHGP4DHIXUDAAM6TMAKT3YNFP2XDSSXFM24ZMKWIXQ@2@2\windows-jdk7-m3.3.x_build\maven-plugin-plugin\target\invoker-reports\BUILD-annotation-with-inheritance-from-deps.xml, f:\jenkins\jenkins-slave\workspace\x_maven-plugin-tools_master-XKS4EHY3PSXHGP4DHIXUDAAM6TMAKT3YNFP2XDSSXFM24ZMKWIXQ@2@2\windows-jdk7-m3.3.x_build\maven-plugin-plugin\target\invoker-reports\BUILD-annotation-with-inheritance-reactor.xml, f:\jenkins\jenkins-slave\workspace\x_maven-plugin-tools_master-XKS4EHY3PSXHGP4DHIXUDAAM6TMAKT3YNFP2XDSSXFM24ZMKWIXQ@2@2\windows-jdk7-m3.3.x_build\maven-plugin-plugin\target\invoker-reports\BUILD-annotation-with-inheritance.xml, f:\jenkins\jenkins-slave\workspace\x_maven-plugin-tools_master-XKS4EHY3PSXHGP4DHIXUDAAM6TMAKT3YNFP2XDSSXFM24ZMKWIXQ@2@2\windows-jdk7-m3.3.x_build\maven-plugin-plugin\target\invoker-reports\BUILD-ant-basic.xml, f:\jenkins\jenkins-slave\workspace\x_maven-plugin-tools_master-XKS4EHY3PSXHGP4DHIXUDAAM6TMAKT3YNFP2XDSSXFM24ZMKWIXQ@2@2\windows-jdk7-m3.3.x_build\maven-plugin-plugin\target\invoker-reports\BUILD-ant-reference-parameter.xml, f:\jenkins\jenkins-slave\workspace\x_maven-plugin-tools_master-XKS4EHY3PSXHGP4DHIXUDAAM6TMAKT3YNFP2XDSSXFM24ZMKWIXQ@2@2\windows-jdk7-m3.3.x_build\maven-plugin-plugin\target\invoker-reports\BUILD-ant-simple-usage.xml, f:\jenkins\jenkins-slave\workspace\x_maven-plugin-tools_master-XKS4EHY3PSXHGP4DHIXUDAAM6TMAKT3YNFP2XDSSXFM24ZMKWIXQ@2@2\windows-jdk7-m3.3.x_build\maven-plugin-plugin\target\invoker-reports\BUILD-ant-since-maven-plugin.xml, f:\jenkins\jenkins-slave\workspace\x_maven-plugin-tools_master-XKS4EHY3PSXHGP4DHIXUDAAM6TMAKT3YNFP2XDSSXFM24ZMKWIXQ@2@2\windows-jdk7-m3.3.x_build\maven-plugin-plugin\target\invoker-reports\BUILD-asm-failure.xml, f:\jenkins\jenkins-slave\workspace\x_maven-plugin-tools_master-XKS4EHY3PSXHGP4DHIXUDAAM6TMAKT3YNFP2XDSSXFM24ZMKWIXQ@2@2\windows-jdk7-m3.3.x_build\maven-plugin-plugin\target\invoker-reports\BUILD-beanshell-simple.xml, f:\jenkins\jenkins-slave\workspace\x_maven-plugin-tools_master-XKS4EHY3PSXHGP4DHIXUDAAM6TMAKT3YNFP2XDSSXFM24ZMKWIXQ@2@2\windows-jdk7-m3.3.x_build\maven-plugin-plugin\target\invoker-reports\BUILD-fix-maven-since-3.x.xml, f:\jenkins\jenkins-slave\workspace\x_maven-plugin-tools_master-XKS4EHY3PSXHGP4DHIXUDAAM6TMAKT3YNFP2XDSSXFM24ZMKWIXQ@2@2\windows-jdk7-m3.3.x_build\maven-plugin-plugin\target\invoker-reports\BUILD-help-basic-jdk11.xml, f:\jenkins\jenkins-slave\workspace\x_maven-plugin-tools_master-XKS4EHY3PSXHGP4DHIXUDAAM6TMAKT3YNFP2XDSSXFM24ZMKWIXQ@2@2\windows-jdk7-m3.3.x_build\maven-plugin-plugin\target\invoker-reports\BUILD-help-basic.xml, f:\jenkins\jenkins-slave\workspace\x_maven-plugin-tools_master-XKS4EHY3PSXHGP4DHIXUDAAM6TMAKT3YNFP2XDSSXFM24ZMKWIXQ@2@2\windows-jdk7-m3.3.x_build\maven-plugin-plugin\target\invoker-reports\BUILD-help-package.xml, f:\jenkins\jenkins-slave\workspace\x_maven-plugin-tools_master-XKS4EHY3PSXHGP4DHIXUDAAM6TMAKT3YNFP2XDSSXFM24ZMKWIXQ@2@2\windows-jdk7-m3.3.x_build\maven-plugin-plugin\target\invoker-reports\BUILD-ignore-plugin-class-realm.xml, f:\jenkins\jenkins-slave\workspace\x_maven-plugin-tools_master-XKS4EHY3PSXHGP4DHIXUDAAM6TMAKT3YNFP2XDSSXFM24ZMKWIXQ@2@2\windows-jdk7-m3.3.x_build\maven-plugin-plugin\target\invoker-reports\BUILD-java-basic-annotations-jdk11.xml, f:\jenkins\jenkins-slave\workspace\x_maven-plugin-tools_master-XKS4EHY3PSXHGP4DHIXUDAAM6TMAKT3YNFP2XDSSXFM24ZMKWIXQ@2@2\windows-jdk7-m3.3.x_build\maven-plugin-plugin\target\invoker-reports\BUILD-java-basic-annotations-jdk8.xml, f:\jenkins\jenkins-slave\workspace\x_maven-plugin-tools_master-XKS4EHY3PSXHGP4DHIXUDAAM6TMAKT3YNFP2XDSSXFM24ZMKWIXQ@2@2\windows-jdk7-m3.3.x_build\maven-plugin-plugin\target\invoker-reports\BUILD-java-basic-annotations.xml, f:\jenkins\jenkins-slave\workspace\x_maven-plugin-tools_master-XKS4EHY3PSXHGP4DHIXUDAAM6TMAKT3YNFP2XDSSXFM24ZMKWIXQ@2@2\windows-jdk7-m3.3.x_build\maven-plugin-plugin\target\invoker-reports\BUILD-java-basic.xml, f:\jenkins\jenkins-slave\workspace\x_maven-plugin-tools_master-XKS4EHY3PSXHGP4DHIXUDAAM6TMAKT3YNFP2XDSSXFM24ZMKWIXQ@2@2\windows-jdk7-m3.3.x_build\maven-plugin-plugin\target\invoker-reports\BUILD-mplugin-187.xml, f:\jenkins\jenkins-slave\workspace\x_maven-plugin-tools_master-XKS4EHY3PSXHGP4DHIXUDAAM6TMAKT3YNFP2XDSSXFM24ZMKWIXQ@2@2\windows-jdk7-m3.3.x_build\maven-plugin-plugin\target\invoker-reports\BUILD-mplugin-191.xml, f:\jenkins\jenkins-slave\workspace\x_maven-plugin-tools_master-XKS4EHY3PSXHGP4DHIXUDAAM6TMAKT3YNFP2XDSSXFM24ZMKWIXQ@2@2\windows-jdk7-m3.3.x_build\maven-plugin-plugin\target\invoker-reports\BUILD-mplugin-223.xml, f:\jenkins\jenkins-slave\workspace\x_maven-plugin-tools_master-XKS4EHY3PSXHGP4DHIXUDAAM6TMAKT3YNFP2XDSSXFM24ZMKWIXQ@2@2\windows-jdk7-m3.3.x_build\maven-plugin-plugin\target\invoker-reports\BUILD-mplugin-272_java8.xml, f:\jenkins\jenkins-slave\workspace\x_maven-plugin-tools_master-XKS4EHY3PSXHGP4DHIXUDAAM6TMAKT3YNFP2XDSSXFM24ZMKWIXQ@2@2\windows-jdk7-m3.3.x_build\maven-plugin-plugin\target\invoker-reports\BUILD-mplugin-299_no-configuration.xml, f:\jenkins\jenkins-slave\workspace\x_maven-plugin-tools_master-XKS4EHY3PSXHGP4DHIXUDAAM6TMAKT3YNFP2XDSSXFM24ZMKWIXQ@2@2\windows-jdk7-m3.3.x_build\maven-plugin-plugin\target\invoker-reports\BUILD-mplugin-305_defaultMojoDependencies.xml, f:\jenkins\jenkins-slave\workspace\x_maven-plugin-tools_master-XKS4EHY3PSXHGP4DHIXUDAAM6TMAKT3YNFP2XDSSXFM24ZMKWIXQ@2@2\windows-jdk7-m3.3.x_build\maven-plugin-plugin\target\invoker-reports\BUILD-mplugin-305_emptyMojoDependencies.xml, f:\jenkins\jenkins-slave\workspace\x_maven-plugin-tools_master-XKS4EHY3PSXHGP4DHIXUDAAM6TMAKT3YNFP2XDSSXFM24ZMKWIXQ@2@2\windows-jdk7-m3.3.x_build\maven-plugin-plugin\target\invoker-reports\BUILD-mplugin-305_singleMojoDependencies.xml, f:\jenkins\jenkins-slave\workspace\x_maven-plugin-tools_master-XKS4EHY3PSXHGP4DHIXUDAAM6TMAKT3YNFP2XDSSXFM24ZMKWIXQ@2@2\windows-jdk7-m3.3.x_build\maven-plugin-plugin\target\invoker-reports\BUILD-mplugin-319_report-since.xml, f:\jenkins\jenkins-slave\workspace\x_maven-plugin-tools_master-XKS4EHY3PSXHGP4DHIXUDAAM6TMAKT3YNFP2XDSSXFM24ZMKWIXQ@2@2\windows-jdk7-m3.3.x_build\maven-plugin-plugin\target\invoker-reports\BUILD-mplugin-324_javadoc.xml, f:\jenkins\jenkins-slave\workspace\x_maven-plugin-tools_master-XKS4EHY3PSXHGP4DHIXUDAAM6TMAKT3YNFP2XDSSXFM24ZMKWIXQ@2@2\windows-jdk7-m3.3.x_build\maven-plugin-plugin\target\invoker-reports\BUILD-packaging-jar.xml, f:\jenkins\jenkins-slave\workspace\x_maven-plugin-tools_master-XKS4EHY3PSXHGP4DHIXUDAAM6TMAKT3YNFP2XDSSXFM24ZMKWIXQ@2@2\windows-jdk7-m3.3.x_build\maven-plugin-plugin\target\invoker-reports\BUILD-plugin-info-jdk-default-version.xml, f:\jenkins\jenkins-slave\workspace\x_maven-plugin-tools_master-XKS4EHY3PSXHGP4DHIXUDAAM6TMAKT3YNFP2XDSSXFM24ZMKWIXQ@2@2\windows-jdk7-m3.3.x_build\maven-plugin-plugin\target\invoker-reports\BUILD-plugin-info-jdk.xml, f:\jenkins\jenkins-slave\workspace\x_maven-plugin-tools_master-XKS4EHY3PSXHGP4DHIXUDAAM6TMAKT3YNFP2XDSSXFM24ZMKWIXQ@2@2\windows-jdk7-m3.3.x_build\maven-plugin-plugin\target\invoker-reports\BUILD-plugin-report-annotations.xml, f:\jenkins\jenkins-slave\workspace\x_maven-plugin-tools_master-XKS4EHY3PSXHGP4DHIXUDAAM6TMAKT3YNFP2XDSSXFM24ZMKWIXQ@2@2\windows-jdk7-m3.3.x_build\maven-plugin-plugin\target\invoker-reports\BUILD-plugin-report.xml, f:\jenkins\jenkins-slave\workspace\x_maven-plugin-tools_master-XKS4EHY3PSXHGP4DHIXUDAAM6TMAKT3YNFP2XDSSXFM24ZMKWIXQ@2@2\windows-jdk7-m3.3.x_build\maven-plugin-plugin\target\invoker-reports\BUILD-skip.xml, f:\jenkins\jenkins-slave\workspace\x_maven-plugin-tools_master-XKS4EHY3PSXHGP4DHIXUDAAM6TMAKT3YNFP2XDSSXFM24ZMKWIXQ@2@2\windows-jdk7-m3.3.x_build\maven-plugin-plugin\target\invoker-reports\BUILD-source-encoding.xml]
[windows-jdk7-m3.3.x_build] Found logs:[f:\jenkins\jenkins-slave\workspace\x_maven-plugin-tools_master-XKS4EHY3PSXHGP4DHIXUDAAM6TMAKT3YNFP2XDSSXFM24ZMKWIXQ@2@2\windows-jdk7-m3.3.x_build\maven-plugin-plugin\target\it\annotation-with-inheritance-from-deps\build.log, f:\jenkins\jenkins-slave\workspace\x_maven-plugin-tools_master-XKS4EHY3PSXHGP4DHIXUDAAM6TMAKT3YNFP2XDSSXFM24ZMKWIXQ@2@2\windows-jdk7-m3.3.x_build\maven-plugin-plugin\target\it\annotation-with-inheritance-reactor\build.log, f:\jenkins\jenkins-slave\workspace\x_maven-plugin-tools_master-XKS4EHY3PSXHGP4DHIXUDAAM6TMAKT3YNFP2XDSSXFM24ZMKWIXQ@2@2\windows-jdk7-m3.3.x_build\maven-plugin-plugin\target\it\annotation-with-inheritance\build.log, f:\jenkins\jenkins-slave\workspace\x_maven-plugin-tools_master-XKS4EHY3PSXHGP4DHIXUDAAM6TMAKT3YNFP2XDSSXFM24ZMKWIXQ@2@2\windows-jdk7-m3.3.x_build\maven-plugin-plugin\target\it\ant-basic\build.log, f:\jenkins\jenkins-slave\workspace\x_maven-plugin-tools_master-XKS4EHY3PSXHGP4DHIXUDAAM6TMAKT3YNFP2XDSSXFM24ZMKWIXQ@2@2\windows-jdk7-m3.3.x_build\maven-plugin-plugin\target\it\ant-reference-parameter\build.log, f:\jenkins\jenkins-slave\workspace\x_maven-plugin-tools_master-XKS4EHY3PSXHGP4DHIXUDAAM6TMAKT3YNFP2XDSSXFM24ZMKWIXQ@2@2\windows-jdk7-m3.3.x_build\maven-plugin-plugin\target\it\ant-simple-usage\build.log, f:\jenkins\jenkins-slave\workspace\x_maven-plugin-tools_master-XKS4EHY3PSXHGP4DHIXUDAAM6TMAKT3YNFP2XDSSXFM24ZMKWIXQ@2@2\windows-jdk7-m3.3.x_build\maven-plugin-plugin\target\it\ant-since-maven-plugin\build.log, f:\jenkins\jenkins-slave\workspace\x_maven-plugin-tools_master-XKS4EHY3PSXHGP4DHIXUDAAM6TMAKT3YNFP2XDSSXFM24ZMKWIXQ@2@2\windows-jdk7-m3.3.x_build\maven-plugin-plugin\target\it\asm-failure\build.log, f:\jenkins\jenkins-slave\workspace\x_maven-plugin-tools_master-XKS4EHY3PSXHGP4DHIXUDAAM6TMAKT3YNFP2XDSSXFM24ZMKWIXQ@2@2\windows-jdk7-m3.3.x_build\maven-plugin-plugin\target\it\beanshell-simple\build.log, f:\jenkins\jenkins-slave\workspace\x_maven-plugin-tools_master-XKS4EHY3PSXHGP4DHIXUDAAM6TMAKT3YNFP2XDSSXFM24ZMKWIXQ@2@2\windows-jdk7-m3.3.x_build\maven-plugin-plugin\target\it\fix-maven-since-3.x\build.log, f:\jenkins\jenkins-slave\workspace\x_maven-plugin-tools_master-XKS4EHY3PSXHGP4DHIXUDAAM6TMAKT3YNFP2XDSSXFM24ZMKWIXQ@2@2\windows-jdk7-m3.3.x_build\maven-plugin-plugin\target\it\help-basic\build.log, f:\jenkins\jenkins-slave\workspace\x_maven-plugin-tools_master-XKS4EHY3PSXHGP4DHIXUDAAM6TMAKT3YNFP2XDSSXFM24ZMKWIXQ@2@2\windows-jdk7-m3.3.x_build\maven-plugin-plugin\target\it\help-package\build.log, f:\jenkins\jenkins-slave\workspace\x_maven-plugin-tools_master-XKS4EHY3PSXHGP4DHIXUDAAM6TMAKT3YNFP2XDSSXFM24ZMKWIXQ@2@2\windows-jdk7-m3.3.x_build\maven-plugin-plugin\target\it\ignore-plugin-class-realm\build.log, f:\jenkins\jenkins-slave\workspace\x_maven-plugin-tools_master-XKS4EHY3PSXHGP4DHIXUDAAM6TMAKT3YNFP2XDSSXFM24ZMKWIXQ@2@2\windows-jdk7-m3.3.x_build\maven-plugin-plugin\target\it\java-basic-annotations\build.log, f:\jenkins\jenkins-slave\workspace\x_maven-plugin-tools_master-XKS4EHY3PSXHGP4DHIXUDAAM6TMAKT3YNFP2XDSSXFM24ZMKWIXQ@2@2\windows-jdk7-m3.3.x_build\maven-plugin-plugin\target\it\java-basic\build.log, f:\jenkins\jenkins-slave\workspace\x_maven-plugin-tools_master-XKS4EHY3PSXHGP4DHIXUDAAM6TMAKT3YNFP2XDSSXFM24ZMKWIXQ@2@2\windows-jdk7-m3.3.x_build\maven-plugin-plugin\target\it\mplugin-187\build.log, f:\jenkins\jenkins-slave\workspace\x_maven-plugin-tools_master-XKS4EHY3PSXHGP4DHIXUDAAM6TMAKT3YNFP2XDSSXFM24ZMKWIXQ@2@2\windows-jdk7-m3.3.x_build\maven-plugin-plugin\target\it\mplugin-191\build.log, f:\jenkins\jenkins-slave\workspace\x_maven-plugin-tools_master-XKS4EHY3PSXHGP4DHIXUDAAM6TMAKT3YNFP2XDSSXFM24ZMKWIXQ@2@2\windows-jdk7-m3.3.x_build\maven-plugin-plugin\target\it\mplugin-223\build.log, f:\jenkins\jenkins-slave\workspace\x_maven-plugin-tools_master-XKS4EHY3PSXHGP4DHIXUDAAM6TMAKT3YNFP2XDSSXFM24ZMKWIXQ@2@2\windows-jdk7-m3.3.x_build\maven-plugin-plugin\target\it\mplugin-299_no-configuration\build.log, f:\jenkins\jenkins-slave\workspace\x_maven-plugin-tools_master-XKS4EHY3PSXHGP4DHIXUDAAM6TMAKT3YNFP2XDSSXFM24ZMKWIXQ@2@2\windows-jdk7-m3.3.x_build\maven-plugin-plugin\target\it\mplugin-305_defaultMojoDependencies\build.log, f:\jenkins\jenkins-slave\workspace\x_maven-plugin-tools_master-XKS4EHY3PSXHGP4DHIXUDAAM6TMAKT3YNFP2XDSSXFM24ZMKWIXQ@2@2\windows-jdk7-m3.3.x_build\maven-plugin-plugin\target\it\mplugin-305_emptyMojoDependencies\build.log, f:\jenkins\jenkins-slave\workspace\x_maven-plugin-tools_master-XKS4EHY3PSXHGP4DHIXUDAAM6TMAKT3YNFP2XDSSXFM24ZMKWIXQ@2@2\windows-jdk7-m3.3.x_build\maven-plugin-plugin\target\it\mplugin-305_singleMojoDependencies\build.log, f:\jenkins\jenkins-slave\workspace\x_maven-plugin-tools_master-XKS4EHY3PSXHGP4DHIXUDAAM6TMAKT3YNFP2XDSSXFM24ZMKWIXQ@2@2\windows-jdk7-m3.3.x_build\maven-plugin-plugin\target\it\mplugin-319_report-since\build.log, f:\jenkins\jenkins-slave\workspace\x_maven-plugin-tools_master-XKS4EHY3PSXHGP4DHIXUDAAM6TMAKT3YNFP2XDSSXFM24ZMKWIXQ@2@2\windows-jdk7-m3.3.x_build\maven-plugin-plugin\target\it\mplugin-324_javadoc\build.log, f:\jenkins\jenkins-slave\workspace\x_maven-plugin-tools_master-XKS4EHY3PSXHGP4DHIXUDAAM6TMAKT3YNFP2XDSSXFM24ZMKWIXQ@2@2\windows-jdk7-m3.3.x_build\maven-plugin-plugin\target\it\packaging-jar\build.log, f:\jenkins\jenkins-slave\workspace\x_maven-plugin-tools_master-XKS4EHY3PSXHGP4DHIXUDAAM6TMAKT3YNFP2XDSSXFM24ZMKWIXQ@2@2\windows-jdk7-m3.3.x_build\maven-plugin-plugin\target\it\plugin-info-jdk-default-version\build.log, f:\jenkins\jenkins-slave\workspace\x_maven-plugin-tools_master-XKS4EHY3PSXHGP4DHIXUDAAM6TMAKT3YNFP2XDSSXFM24ZMKWIXQ@2@2\windows-jdk7-m3.3.x_build\maven-plugin-plugin\target\it\plugin-info-jdk\build.log, f:\jenkins\jenkins-slave\workspace\x_maven-plugin-tools_master-XKS4EHY3PSXHGP4DHIXUDAAM6TMAKT3YNFP2XDSSXFM24ZMKWIXQ@2@2\windows-jdk7-m3.3.x_build\maven-plugin-plugin\target\it\plugin-report-annotations\build.log, f:\jenkins\jenkins-slave\workspace\x_maven-plugin-tools_master-XKS4EHY3PSXHGP4DHIXUDAAM6TMAKT3YNFP2XDSSXFM24ZMKWIXQ@2@2\windows-jdk7-m3.3.x_build\maven-plugin-plugin\target\it\plugin-report\build.log, f:\jenkins\jenkins-slave\workspace\x_maven-plugin-tools_master-XKS4EHY3PSXHGP4DHIXUDAAM6TMAKT3YNFP2XDSSXFM24ZMKWIXQ@2@2\windows-jdk7-m3.3.x_build\maven-plugin-plugin\target\it\skip\build.log, f:\jenkins\jenkins-slave\workspace\x_maven-plugin-tools_master-XKS4EHY3PSXHGP4DHIXUDAAM6TMAKT3YNFP2XDSSXFM24ZMKWIXQ@2@2\windows-jdk7-m3.3.x_build\maven-plugin-plugin\target\it\source-encoding\build.log]
[windows-jdk7-m3.3.x_build] Finished parsing Maven Invoker results (found 35)
[windows-jdk7-m3.3.x_build] [withMaven] junitPublisher - Archive test results for Maven artifact org.apache.maven.plugin-tools:maven-plugin-tools-api:3.6.0-SNAPSHOT generated by maven-surefire-plugin:test (default-test): windows-jdk7-m3.3.x_build\maven-plugin-tools-api\target\surefire-reports\*.xml
[windows-jdk7-m3.3.x_build] Recording test results
[windows-jdk7-m3.3.x_build] [withMaven] junitPublisher - Archive test results for Maven artifact org.apache.maven.plugin-tools:maven-plugin-tools-generators:3.6.0-SNAPSHOT generated by maven-surefire-plugin:test (default-test): windows-jdk7-m3.3.x_build\maven-plugin-tools-generators\target\surefire-reports\*.xml
[windows-jdk7-m3.3.x_build] Recording test results
[windows-jdk7-m3.3.x_build] [withMaven] junitPublisher - Archive test results for Maven artifact org.apache.maven.plugin-tools:maven-plugin-tools-java:3.6.0-SNAPSHOT generated by maven-surefire-plugin:test (default-test): windows-jdk7-m3.3.x_build\maven-plugin-tools-java\target\surefire-reports\*.xml
[windows-jdk7-m3.3.x_build] Recording test results
[windows-jdk7-m3.3.x_build] [withMaven] junitPublisher - Archive test results for Maven artifact org.apache.maven.plugin-tools:maven-plugin-annotations:3.6.0-SNAPSHOT generated by maven-surefire-plugin:test (default-test): windows-jdk7-m3.3.x_build\maven-plugin-annotations\target\surefire-reports\*.xml
[windows-jdk7-m3.3.x_build] Recording test results
[windows-jdk7-m3.3.x_build] None of the test reports contained any result
[windows-jdk7-m3.3.x_build] [withMaven] junitPublisher - Archive test results for Maven artifact org.apache.maven.plugin-tools:maven-plugin-tools-annotations:3.6.0-SNAPSHOT generated by maven-surefire-plugin:test (default-test): windows-jdk7-m3.3.x_build\maven-plugin-tools-annotations\target\surefire-reports\*.xml
[windows-jdk7-m3.3.x_build] Recording test results
[windows-jdk7-m3.3.x_build] [withMaven] junitPublisher - Archive test results for Maven artifact org.apache.maven.plugin-tools:maven-plugin-tools-model:3.6.0-SNAPSHOT generated by maven-surefire-plugin:test (default-test): windows-jdk7-m3.3.x_build\maven-script\maven-plugin-tools-model\target\surefire-reports\*.xml
[windows-jdk7-m3.3.x_build] Recording test results
[windows-jdk7-m3.3.x_build] [withMaven] junitPublisher - Archive test results for Maven artifact org.apache.maven.plugin-tools:maven-plugin-tools-ant:3.6.0-SNAPSHOT generated by maven-surefire-plugin:test (default-test): windows-jdk7-m3.3.x_build\maven-script\maven-plugin-tools-ant\target\surefire-reports\*.xml
[windows-jdk7-m3.3.x_build] Recording test results
[windows-jdk7-m3.3.x_build] [withMaven] junitPublisher - Archive test results for Maven artifact org.apache.maven.plugin-tools:maven-script-ant:3.6.0-SNAPSHOT generated by maven-surefire-plugin:test (default-test): windows-jdk7-m3.3.x_build\maven-script\maven-script-ant\target\surefire-reports\*.xml
[windows-jdk7-m3.3.x_build] Recording test results
[windows-jdk7-m3.3.x_build] [withMaven] junitPublisher - Archive test results for Maven artifact org.apache.maven.plugin-tools:maven-plugin-tools-beanshell:3.6.0-SNAPSHOT generated by maven-surefire-plugin:test (default-test): windows-jdk7-m3.3.x_build\maven-script\maven-plugin-tools-beanshell\target\surefire-reports\*.xml
[windows-jdk7-m3.3.x_build] Recording test results
[windows-jdk7-m3.3.x_build] None of the test reports contained any result
[windows-jdk7-m3.3.x_build] [withMaven] junitPublisher - Archive test results for Maven artifact org.apache.maven.plugin-tools:maven-script-beanshell:3.6.0-SNAPSHOT generated by maven-surefire-plugin:test (default-test): windows-jdk7-m3.3.x_build\maven-script\maven-script-beanshell\target\surefire-reports\*.xml
[windows-jdk7-m3.3.x_build] Recording test results
[windows-jdk7-m3.3.x_build] None of the test reports contained any result
[windows-jdk7-m3.3.x_build] [withMaven] junitPublisher - Archive test results for Maven artifact org.apache.maven.plugins:maven-plugin-plugin:3.6.0-SNAPSHOT generated by maven-surefire-plugin:test (default-test): windows-jdk7-m3.3.x_build\maven-plugin-plugin\target\surefire-reports\*.xml
[windows-jdk7-m3.3.x_build] Recording test results
[windows-jdk7-m3.3.x_build] None of the test reports contained any result
[windows-jdk7-m3.3.x_build] [withMaven] openTasksPublisher - Scan Tasks for Maven artifact org.apache.maven.plugin-tools:maven-plugin-tools-api:3.6.0-SNAPSHOT in source directory windows-jdk7-m3.3.x_build\maven-plugin-tools-api\src\main\java
[windows-jdk7-m3.3.x_build] [withMaven] openTasksPublisher - Scan Tasks for Maven artifact org.apache.maven.plugin-tools:maven-plugin-tools-generators:3.6.0-SNAPSHOT in source directory windows-jdk7-m3.3.x_build\maven-plugin-tools-generators\src\main\java
[windows-jdk7-m3.3.x_build] [withMaven] openTasksPublisher - Scan Tasks for Maven artifact org.apache.maven.plugin-tools:maven-plugin-tools-java:3.6.0-SNAPSHOT in source directory windows-jdk7-m3.3.x_build\maven-plugin-tools-java\src\main\java
[windows-jdk7-m3.3.x_build] [withMaven] openTasksPublisher - Scan Tasks for Maven artifact org.apache.maven.plugin-tools:maven-plugin-annotations:3.6.0-SNAPSHOT in source directory windows-jdk7-m3.3.x_build\maven-plugin-annotations\src\main\java
[windows-jdk7-m3.3.x_build] [withMaven] openTasksPublisher - Scan Tasks for Maven artifact org.apache.maven.plugin-tools:maven-plugin-tools-annotations:3.6.0-SNAPSHOT in source directory windows-jdk7-m3.3.x_build\maven-plugin-tools-annotations\src\main\java
[windows-jdk7-m3.3.x_build] [withMaven] openTasksPublisher - Scan Tasks for Maven artifact org.apache.maven.plugin-tools:maven-plugin-tools-model:3.6.0-SNAPSHOT in source directory windows-jdk7-m3.3.x_build\maven-script\maven-plugin-tools-model\src\main\java
[windows-jdk7-m3.3.x_build] [withMaven] openTasksPublisher - Scan Tasks for Maven artifact org.apache.maven.plugin-tools:maven-plugin-tools-ant:3.6.0-SNAPSHOT in source directory windows-jdk7-m3.3.x_build\maven-script\maven-plugin-tools-ant\src\main\java
[windows-jdk7-m3.3.x_build] [withMaven] openTasksPublisher - Scan Tasks for Maven artifact org.apache.maven.plugin-tools:maven-script-ant:3.6.0-SNAPSHOT in source directory windows-jdk7-m3.3.x_build\maven-script\maven-script-ant\src\main\java
[windows-jdk7-m3.3.x_build] [withMaven] openTasksPublisher - Scan Tasks for Maven artifact org.apache.maven.plugin-tools:maven-plugin-tools-beanshell:3.6.0-SNAPSHOT in source directory windows-jdk7-m3.3.x_build\maven-script\maven-plugin-tools-beanshell\src\main\java
[windows-jdk7-m3.3.x_build] [withMaven] openTasksPublisher - Scan Tasks for Maven artifact org.apache.maven.plugin-tools:maven-script-beanshell:3.6.0-SNAPSHOT in source directory windows-jdk7-m3.3.x_build\maven-script\maven-script-beanshell\src\main\java
[windows-jdk7-m3.3.x_build] [withMaven] openTasksPublisher - Scan Tasks for Maven artifact org.apache.maven.plugins:maven-plugin-plugin:3.6.0-SNAPSHOT in source directory windows-jdk7-m3.3.x_build\maven-plugin-plugin\src\main\java
[windows-jdk7-m3.3.x_build] [TASKS] Scanning folder 'f:\jenkins\jenkins-slave\workspace\x_maven-plugin-tools_master-XKS4EHY3PSXHGP4DHIXUDAAM6TMAKT3YNFP2XDSSXFM24ZMKWIXQ@2@2' for files matching the pattern 'windows-jdk7-m3.3.x_build\maven-plugin-tools-api\src\main\java\**\*,windows-jdk7-m3.3.x_build\maven-plugin-tools-generators\src\main\java\**\*,windows-jdk7-m3.3.x_build\maven-plugin-tools-java\src\main\java\**\*,windows-jdk7-m3.3.x_build\maven-plugin-annotations\src\main\java\**\*,windows-jdk7-m3.3.x_build\maven-plugin-tools-annotations\src\main\java\**\*,windows-jdk7-m3.3.x_build\maven-script\maven-plugin-tools-model\src\main\java\**\*,windows-jdk7-m3.3.x_build\maven-script\maven-plugin-tools-ant\src\main\java\**\*,windows-jdk7-m3.3.x_build\maven-script\maven-script-ant\src\main\java\**\*,windows-jdk7-m3.3.x_build\maven-script\maven-plugin-tools-beanshell\src\main\java\**\*,windows-jdk7-m3.3.x_build\maven-script\maven-script-beanshell\src\main\java\**\*,windows-jdk7-m3.3.x_build\maven-plugin-plugin\src\main\java\**\*' - excludes: null
[windows-jdk7-m3.3.x_build] [TASKS] Found 52 files to scan for tasks
[windows-jdk7-m3.3.x_build] [TASKS] Found 11 open tasks.
[windows-jdk7-m3.3.x_build] Skipping warnings blame since pipelines do not have an SCM link.%n
[windows-jdk7-m3.3.x_build] [TASKS] Computing warning deltas based on reference build #46
[Pipeline] [windows-jdk9-m3.5.x_build] }
[windows-jdk9-m3.5.x_build] [withMaven] artifactsPublisher - Archive artifact windows-jdk9-m3.5.x_build\pom.xml under org\apache\maven\plugin-tools\maven-plugin-tools\3.6.0-SNAPSHOT\maven-plugin-tools-3.6.0-SNAPSHOT.pom
[windows-jdk9-m3.5.x_build] [withMaven] artifactsPublisher - Archive artifact windows-jdk9-m3.5.x_build\target\maven-plugin-tools-3.6.0-SNAPSHOT-site.xml under org\apache\maven\plugin-tools\maven-plugin-tools\3.6.0-SNAPSHOT\maven-plugin-tools-3.6.0-SNAPSHOT-site.xml
[windows-jdk9-m3.5.x_build] [withMaven] artifactsPublisher - Archive artifact windows-jdk9-m3.5.x_build\maven-plugin-tools-api\pom.xml under org\apache\maven\plugin-tools\maven-plugin-tools-api\3.6.0-SNAPSHOT\maven-plugin-tools-api-3.6.0-SNAPSHOT.pom
[windows-jdk9-m3.5.x_build] [withMaven] artifactsPublisher - Archive artifact windows-jdk9-m3.5.x_build\maven-plugin-tools-api\target\maven-plugin-tools-api-3.6.0-SNAPSHOT.jar under org\apache\maven\plugin-tools\maven-plugin-tools-api\3.6.0-SNAPSHOT\maven-plugin-tools-api-3.6.0-SNAPSHOT.jar
[windows-jdk9-m3.5.x_build] [withMaven] artifactsPublisher - Archive artifact windows-jdk9-m3.5.x_build\maven-plugin-tools-generators\pom.xml under org\apache\maven\plugin-tools\maven-plugin-tools-generators\3.6.0-SNAPSHOT\maven-plugin-tools-generators-3.6.0-SNAPSHOT.pom
[windows-jdk9-m3.5.x_build] [withMaven] artifactsPublisher - Archive artifact windows-jdk9-m3.5.x_build\maven-plugin-tools-generators\target\maven-plugin-tools-generators-3.6.0-SNAPSHOT.jar under org\apache\maven\plugin-tools\maven-plugin-tools-generators\3.6.0-SNAPSHOT\maven-plugin-tools-generators-3.6.0-SNAPSHOT.jar
[windows-jdk9-m3.5.x_build] [withMaven] artifactsPublisher - Archive artifact windows-jdk9-m3.5.x_build\maven-plugin-tools-java\pom.xml under org\apache\maven\plugin-tools\maven-plugin-tools-java\3.6.0-SNAPSHOT\maven-plugin-tools-java-3.6.0-SNAPSHOT.pom
[windows-jdk9-m3.5.x_build] [withMaven] artifactsPublisher - Archive artifact windows-jdk9-m3.5.x_build\maven-plugin-tools-java\target\maven-plugin-tools-java-3.6.0-SNAPSHOT.jar under org\apache\maven\plugin-tools\maven-plugin-tools-java\3.6.0-SNAPSHOT\maven-plugin-tools-java-3.6.0-SNAPSHOT.jar
[windows-jdk9-m3.5.x_build] [withMaven] artifactsPublisher - Archive artifact windows-jdk9-m3.5.x_build\maven-plugin-annotations\pom.xml under org\apache\maven\plugin-tools\maven-plugin-annotations\3.6.0-SNAPSHOT\maven-plugin-annotations-3.6.0-SNAPSHOT.pom
[windows-jdk9-m3.5.x_build] [withMaven] artifactsPublisher - Archive artifact windows-jdk9-m3.5.x_build\maven-plugin-annotations\target\maven-plugin-annotations-3.6.0-SNAPSHOT.jar under org\apache\maven\plugin-tools\maven-plugin-annotations\3.6.0-SNAPSHOT\maven-plugin-annotations-3.6.0-SNAPSHOT.jar
[windows-jdk9-m3.5.x_build] [withMaven] artifactsPublisher - Archive artifact windows-jdk9-m3.5.x_build\maven-plugin-tools-annotations\pom.xml under org\apache\maven\plugin-tools\maven-plugin-tools-annotations\3.6.0-SNAPSHOT\maven-plugin-tools-annotations-3.6.0-SNAPSHOT.pom
[windows-jdk9-m3.5.x_build] [withMaven] artifactsPublisher - Archive artifact windows-jdk9-m3.5.x_build\maven-plugin-tools-annotations\target\maven-plugin-tools-annotations-3.6.0-SNAPSHOT.jar under org\apache\maven\plugin-tools\maven-plugin-tools-annotations\3.6.0-SNAPSHOT\maven-plugin-tools-annotations-3.6.0-SNAPSHOT.jar
[windows-jdk9-m3.5.x_build] [withMaven] artifactsPublisher - Archive artifact windows-jdk9-m3.5.x_build\maven-plugin-tools-annotations\target\maven-plugin-tools-annotations-3.6.0-SNAPSHOT-tests.jar under org\apache\maven\plugin-tools\maven-plugin-tools-annotations\3.6.0-SNAPSHOT\maven-plugin-tools-annotations-3.6.0-SNAPSHOT-tests.jar
[windows-jdk9-m3.5.x_build] [withMaven] artifactsPublisher - Archive artifact windows-jdk9-m3.5.x_build\maven-plugin-tools-annotations\target\maven-plugin-tools-annotations-3.6.0-SNAPSHOT-test-sources.jar under org\apache\maven\plugin-tools\maven-plugin-tools-annotations\3.6.0-SNAPSHOT\maven-plugin-tools-annotations-3.6.0-SNAPSHOT-test-sources.jar
[windows-jdk9-m3.5.x_build] [withMaven] artifactsPublisher - Archive artifact windows-jdk9-m3.5.x_build\maven-script\pom.xml under org\apache\maven\plugin-tools\maven-script\3.6.0-SNAPSHOT\maven-script-3.6.0-SNAPSHOT.pom
[windows-jdk9-m3.5.x_build] [withMaven] artifactsPublisher - Archive artifact windows-jdk9-m3.5.x_build\maven-script\target\maven-script-3.6.0-SNAPSHOT-site.xml under org\apache\maven\plugin-tools\maven-script\3.6.0-SNAPSHOT\maven-script-3.6.0-SNAPSHOT-site.xml
[windows-jdk9-m3.5.x_build] [withMaven] artifactsPublisher - Archive artifact windows-jdk9-m3.5.x_build\maven-script\maven-plugin-tools-model\pom.xml under org\apache\maven\plugin-tools\maven-plugin-tools-model\3.6.0-SNAPSHOT\maven-plugin-tools-model-3.6.0-SNAPSHOT.pom
[windows-jdk9-m3.5.x_build] [withMaven] artifactsPublisher - Archive artifact windows-jdk9-m3.5.x_build\maven-script\maven-plugin-tools-model\target\maven-plugin-tools-model-3.6.0-SNAPSHOT.jar under org\apache\maven\plugin-tools\maven-plugin-tools-model\3.6.0-SNAPSHOT\maven-plugin-tools-model-3.6.0-SNAPSHOT.jar
[windows-jdk9-m3.5.x_build] [withMaven] artifactsPublisher - Archive artifact windows-jdk9-m3.5.x_build\maven-script\maven-plugin-tools-ant\pom.xml under org\apache\maven\plugin-tools\maven-plugin-tools-ant\3.6.0-SNAPSHOT\maven-plugin-tools-ant-3.6.0-SNAPSHOT.pom
[windows-jdk9-m3.5.x_build] [withMaven] artifactsPublisher - Archive artifact windows-jdk9-m3.5.x_build\maven-script\maven-plugin-tools-ant\target\maven-plugin-tools-ant-3.6.0-SNAPSHOT.jar under org\apache\maven\plugin-tools\maven-plugin-tools-ant\3.6.0-SNAPSHOT\maven-plugin-tools-ant-3.6.0-SNAPSHOT.jar
[windows-jdk9-m3.5.x_build] [withMaven] artifactsPublisher - Archive artifact windows-jdk9-m3.5.x_build\maven-script\maven-script-ant\pom.xml under org\apache\maven\plugin-tools\maven-script-ant\3.6.0-SNAPSHOT\maven-script-ant-3.6.0-SNAPSHOT.pom
[windows-jdk9-m3.5.x_build] [withMaven] artifactsPublisher - Archive artifact windows-jdk9-m3.5.x_build\maven-script\maven-script-ant\target\maven-script-ant-3.6.0-SNAPSHOT.jar under org\apache\maven\plugin-tools\maven-script-ant\3.6.0-SNAPSHOT\maven-script-ant-3.6.0-SNAPSHOT.jar
[windows-jdk9-m3.5.x_build] [withMaven] artifactsPublisher - Archive artifact windows-jdk9-m3.5.x_build\maven-script\maven-plugin-tools-beanshell\pom.xml under org\apache\maven\plugin-tools\maven-plugin-tools-beanshell\3.6.0-SNAPSHOT\maven-plugin-tools-beanshell-3.6.0-SNAPSHOT.pom
[windows-jdk9-m3.5.x_build] [withMaven] artifactsPublisher - Archive artifact windows-jdk9-m3.5.x_build\maven-script\maven-plugin-tools-beanshell\target\maven-plugin-tools-beanshell-3.6.0-SNAPSHOT.jar under org\apache\maven\plugin-tools\maven-plugin-tools-beanshell\3.6.0-SNAPSHOT\maven-plugin-tools-beanshell-3.6.0-SNAPSHOT.jar
[windows-jdk9-m3.5.x_build] [withMaven] artifactsPublisher - Archive artifact windows-jdk9-m3.5.x_build\maven-script\maven-script-beanshell\pom.xml under org\apache\maven\plugin-tools\maven-script-beanshell\3.6.0-SNAPSHOT\maven-script-beanshell-3.6.0-SNAPSHOT.pom
[windows-jdk9-m3.5.x_build] [withMaven] artifactsPublisher - Archive artifact windows-jdk9-m3.5.x_build\maven-script\maven-script-beanshell\target\maven-script-beanshell-3.6.0-SNAPSHOT.jar under org\apache\maven\plugin-tools\maven-script-beanshell\3.6.0-SNAPSHOT\maven-script-beanshell-3.6.0-SNAPSHOT.jar
[windows-jdk9-m3.5.x_build] [withMaven] artifactsPublisher - Archive artifact windows-jdk9-m3.5.x_build\maven-plugin-plugin\pom.xml under org\apache\maven\plugins\maven-plugin-plugin\3.6.0-SNAPSHOT\maven-plugin-plugin-3.6.0-SNAPSHOT.pom
[windows-jdk9-m3.5.x_build] [withMaven] artifactsPublisher - Archive artifact windows-jdk9-m3.5.x_build\maven-plugin-plugin\target\maven-plugin-plugin-3.6.0-SNAPSHOT.jar under org\apache\maven\plugins\maven-plugin-plugin\3.6.0-SNAPSHOT\maven-plugin-plugin-3.6.0-SNAPSHOT.jar
[windows-jdk9-m3.5.x_build] [withMaven] invokerPublisher - Archive invoker results for Maven artifact MavenArtifact{org.apache.maven.plugins:maven-plugin-plugin::3.6.0-SNAPSHOT(version: 3.6.0-SNAPSHOT, snapshot:false) } generated by PluginInvocation{org.apache.maven.plugins:maven-invoker-plugin:3.0.1@run  integration-test}: windows-jdk9-m3.5.x_build\maven-plugin-plugin\target\invoker-reports\*.xml
[windows-jdk9-m3.5.x_build] performing MavenInvokerRecorder, reportsFilenamePattern:'**/windows-jdk9-m3.5.x_build\maven-plugin-plugin\target\invoker-reports/BUILD*.xml', invokerBuildDir:'**/windows-jdk9-m3.5.x_build\maven-plugin-plugin\target\it'
[windows-jdk9-m3.5.x_build] Found reports:[f:\jenkins\jenkins-slave\workspace\x_maven-plugin-tools_master-XKS4EHY3PSXHGP4DHIXUDAAM6TMAKT3YNFP2XDSSXFM24ZMKWIXQ@2\windows-jdk9-m3.5.x_build\maven-plugin-plugin\target\invoker-reports\BUILD-annotation-with-inheritance-from-deps.xml, f:\jenkins\jenkins-slave\workspace\x_maven-plugin-tools_master-XKS4EHY3PSXHGP4DHIXUDAAM6TMAKT3YNFP2XDSSXFM24ZMKWIXQ@2\windows-jdk9-m3.5.x_build\maven-plugin-plugin\target\invoker-reports\BUILD-annotation-with-inheritance-reactor.xml, f:\jenkins\jenkins-slave\workspace\x_maven-plugin-tools_master-XKS4EHY3PSXHGP4DHIXUDAAM6TMAKT3YNFP2XDSSXFM24ZMKWIXQ@2\windows-jdk9-m3.5.x_build\maven-plugin-plugin\target\invoker-reports\BUILD-annotation-with-inheritance.xml, f:\jenkins\jenkins-slave\workspace\x_maven-plugin-tools_master-XKS4EHY3PSXHGP4DHIXUDAAM6TMAKT3YNFP2XDSSXFM24ZMKWIXQ@2\windows-jdk9-m3.5.x_build\maven-plugin-plugin\target\invoker-reports\BUILD-ant-basic.xml, f:\jenkins\jenkins-slave\workspace\x_maven-plugin-tools_master-XKS4EHY3PSXHGP4DHIXUDAAM6TMAKT3YNFP2XDSSXFM24ZMKWIXQ@2\windows-jdk9-m3.5.x_build\maven-plugin-plugin\target\invoker-reports\BUILD-ant-reference-parameter.xml, f:\jenkins\jenkins-slave\workspace\x_maven-plugin-tools_master-XKS4EHY3PSXHGP4DHIXUDAAM6TMAKT3YNFP2XDSSXFM24ZMKWIXQ@2\windows-jdk9-m3.5.x_build\maven-plugin-plugin\target\invoker-reports\BUILD-ant-simple-usage.xml, f:\jenkins\jenkins-slave\workspace\x_maven-plugin-tools_master-XKS4EHY3PSXHGP4DHIXUDAAM6TMAKT3YNFP2XDSSXFM24ZMKWIXQ@2\windows-jdk9-m3.5.x_build\maven-plugin-plugin\target\invoker-reports\BUILD-ant-since-maven-plugin.xml, f:\jenkins\jenkins-slave\workspace\x_maven-plugin-tools_master-XKS4EHY3PSXHGP4DHIXUDAAM6TMAKT3YNFP2XDSSXFM24ZMKWIXQ@2\windows-jdk9-m3.5.x_build\maven-plugin-plugin\target\invoker-reports\BUILD-asm-failure.xml, f:\jenkins\jenkins-slave\workspace\x_maven-plugin-tools_master-XKS4EHY3PSXHGP4DHIXUDAAM6TMAKT3YNFP2XDSSXFM24ZMKWIXQ@2\windows-jdk9-m3.5.x_build\maven-plugin-plugin\target\invoker-reports\BUILD-beanshell-simple.xml, f:\jenkins\jenkins-slave\workspace\x_maven-plugin-tools_master-XKS4EHY3PSXHGP4DHIXUDAAM6TMAKT3YNFP2XDSSXFM24ZMKWIXQ@2\windows-jdk9-m3.5.x_build\maven-plugin-plugin\target\invoker-reports\BUILD-fix-maven-since-3.x.xml, f:\jenkins\jenkins-slave\workspace\x_maven-plugin-tools_master-XKS4EHY3PSXHGP4DHIXUDAAM6TMAKT3YNFP2XDSSXFM24ZMKWIXQ@2\windows-jdk9-m3.5.x_build\maven-plugin-plugin\target\invoker-reports\BUILD-help-basic-jdk11.xml, f:\jenkins\jenkins-slave\workspace\x_maven-plugin-tools_master-XKS4EHY3PSXHGP4DHIXUDAAM6TMAKT3YNFP2XDSSXFM24ZMKWIXQ@2\windows-jdk9-m3.5.x_build\maven-plugin-plugin\target\invoker-reports\BUILD-help-basic.xml, f:\jenkins\jenkins-slave\workspace\x_maven-plugin-tools_master-XKS4EHY3PSXHGP4DHIXUDAAM6TMAKT3YNFP2XDSSXFM24ZMKWIXQ@2\windows-jdk9-m3.5.x_build\maven-plugin-plugin\target\invoker-reports\BUILD-help-package.xml, f:\jenkins\jenkins-slave\workspace\x_maven-plugin-tools_master-XKS4EHY3PSXHGP4DHIXUDAAM6TMAKT3YNFP2XDSSXFM24ZMKWIXQ@2\windows-jdk9-m3.5.x_build\maven-plugin-plugin\target\invoker-reports\BUILD-ignore-plugin-class-realm.xml, f:\jenkins\jenkins-slave\workspace\x_maven-plugin-tools_master-XKS4EHY3PSXHGP4DHIXUDAAM6TMAKT3YNFP2XDSSXFM24ZMKWIXQ@2\windows-jdk9-m3.5.x_build\maven-plugin-plugin\target\invoker-reports\BUILD-java-basic-annotations-jdk11.xml, f:\jenkins\jenkins-slave\workspace\x_maven-plugin-tools_master-XKS4EHY3PSXHGP4DHIXUDAAM6TMAKT3YNFP2XDSSXFM24ZMKWIXQ@2\windows-jdk9-m3.5.x_build\maven-plugin-plugin\target\invoker-reports\BUILD-java-basic-annotations-jdk8.xml, f:\jenkins\jenkins-slave\workspace\x_maven-plugin-tools_master-XKS4EHY3PSXHGP4DHIXUDAAM6TMAKT3YNFP2XDSSXFM24ZMKWIXQ@2\windows-jdk9-m3.5.x_build\maven-plugin-plugin\target\invoker-reports\BUILD-java-basic-annotations.xml, f:\jenkins\jenkins-slave\workspace\x_maven-plugin-tools_master-XKS4EHY3PSXHGP4DHIXUDAAM6TMAKT3YNFP2XDSSXFM24ZMKWIXQ@2\windows-jdk9-m3.5.x_build\maven-plugin-plugin\target\invoker-reports\BUILD-java-basic.xml, f:\jenkins\jenkins-slave\workspace\x_maven-plugin-tools_master-XKS4EHY3PSXHGP4DHIXUDAAM6TMAKT3YNFP2XDSSXFM24ZMKWIXQ@2\windows-jdk9-m3.5.x_build\maven-plugin-plugin\target\invoker-reports\BUILD-mplugin-187.xml, f:\jenkins\jenkins-slave\workspace\x_maven-plugin-tools_master-XKS4EHY3PSXHGP4DHIXUDAAM6TMAKT3YNFP2XDSSXFM24ZMKWIXQ@2\windows-jdk9-m3.5.x_build\maven-plugin-plugin\target\invoker-reports\BUILD-mplugin-191.xml, f:\jenkins\jenkins-slave\workspace\x_maven-plugin-tools_master-XKS4EHY3PSXHGP4DHIXUDAAM6TMAKT3YNFP2XDSSXFM24ZMKWIXQ@2\windows-jdk9-m3.5.x_build\maven-plugin-plugin\target\invoker-reports\BUILD-mplugin-223.xml, f:\jenkins\jenkins-slave\workspace\x_maven-plugin-tools_master-XKS4EHY3PSXHGP4DHIXUDAAM6TMAKT3YNFP2XDSSXFM24ZMKWIXQ@2\windows-jdk9-m3.5.x_build\maven-plugin-plugin\target\invoker-reports\BUILD-mplugin-272_java8.xml, f:\jenkins\jenkins-slave\workspace\x_maven-plugin-tools_master-XKS4EHY3PSXHGP4DHIXUDAAM6TMAKT3YNFP2XDSSXFM24ZMKWIXQ@2\windows-jdk9-m3.5.x_build\maven-plugin-plugin\target\invoker-reports\BUILD-mplugin-299_no-configuration.xml, f:\jenkins\jenkins-slave\workspace\x_maven-plugin-tools_master-XKS4EHY3PSXHGP4DHIXUDAAM6TMAKT3YNFP2XDSSXFM24ZMKWIXQ@2\windows-jdk9-m3.5.x_build\maven-plugin-plugin\target\invoker-reports\BUILD-mplugin-305_defaultMojoDependencies.xml, f:\jenkins\jenkins-slave\workspace\x_maven-plugin-tools_master-XKS4EHY3PSXHGP4DHIXUDAAM6TMAKT3YNFP2XDSSXFM24ZMKWIXQ@2\windows-jdk9-m3.5.x_build\maven-plugin-plugin\target\invoker-reports\BUILD-mplugin-305_emptyMojoDependencies.xml, f:\jenkins\jenkins-slave\workspace\x_maven-plugin-tools_master-XKS4EHY3PSXHGP4DHIXUDAAM6TMAKT3YNFP2XDSSXFM24ZMKWIXQ@2\windows-jdk9-m3.5.x_build\maven-plugin-plugin\target\invoker-reports\BUILD-mplugin-305_singleMojoDependencies.xml, f:\jenkins\jenkins-slave\workspace\x_maven-plugin-tools_master-XKS4EHY3PSXHGP4DHIXUDAAM6TMAKT3YNFP2XDSSXFM24ZMKWIXQ@2\windows-jdk9-m3.5.x_build\maven-plugin-plugin\target\invoker-reports\BUILD-mplugin-319_report-since.xml, f:\jenkins\jenkins-slave\workspace\x_maven-plugin-tools_master-XKS4EHY3PSXHGP4DHIXUDAAM6TMAKT3YNFP2XDSSXFM24ZMKWIXQ@2\windows-jdk9-m3.5.x_build\maven-plugin-plugin\target\invoker-reports\BUILD-mplugin-324_javadoc.xml, f:\jenkins\jenkins-slave\workspace\x_maven-plugin-tools_master-XKS4EHY3PSXHGP4DHIXUDAAM6TMAKT3YNFP2XDSSXFM24ZMKWIXQ@2\windows-jdk9-m3.5.x_build\maven-plugin-plugin\target\invoker-reports\BUILD-packaging-jar.xml, f:\jenkins\jenkins-slave\workspace\x_maven-plugin-tools_master-XKS4EHY3PSXHGP4DHIXUDAAM6TMAKT3YNFP2XDSSXFM24ZMKWIXQ@2\windows-jdk9-m3.5.x_build\maven-plugin-plugin\target\invoker-reports\BUILD-plugin-info-jdk-default-version.xml, f:\jenkins\jenkins-slave\workspace\x_maven-plugin-tools_master-XKS4EHY3PSXHGP4DHIXUDAAM6TMAKT3YNFP2XDSSXFM24ZMKWIXQ@2\windows-jdk9-m3.5.x_build\maven-plugin-plugin\target\invoker-reports\BUILD-plugin-info-jdk.xml, f:\jenkins\jenkins-slave\workspace\x_maven-plugin-tools_master-XKS4EHY3PSXHGP4DHIXUDAAM6TMAKT3YNFP2XDSSXFM24ZMKWIXQ@2\windows-jdk9-m3.5.x_build\maven-plugin-plugin\target\invoker-reports\BUILD-plugin-report-annotations.xml, f:\jenkins\jenkins-slave\workspace\x_maven-plugin-tools_master-XKS4EHY3PSXHGP4DHIXUDAAM6TMAKT3YNFP2XDSSXFM24ZMKWIXQ@2\windows-jdk9-m3.5.x_build\maven-plugin-plugin\target\invoker-reports\BUILD-plugin-report.xml, f:\jenkins\jenkins-slave\workspace\x_maven-plugin-tools_master-XKS4EHY3PSXHGP4DHIXUDAAM6TMAKT3YNFP2XDSSXFM24ZMKWIXQ@2\windows-jdk9-m3.5.x_build\maven-plugin-plugin\target\invoker-reports\BUILD-skip.xml, f:\jenkins\jenkins-slave\workspace\x_maven-plugin-tools_master-XKS4EHY3PSXHGP4DHIXUDAAM6TMAKT3YNFP2XDSSXFM24ZMKWIXQ@2\windows-jdk9-m3.5.x_build\maven-plugin-plugin\target\invoker-reports\BUILD-source-encoding.xml]
[windows-jdk9-m3.5.x_build] Found logs:[f:\jenkins\jenkins-slave\workspace\x_maven-plugin-tools_master-XKS4EHY3PSXHGP4DHIXUDAAM6TMAKT3YNFP2XDSSXFM24ZMKWIXQ@2\windows-jdk9-m3.5.x_build\maven-plugin-plugin\target\it\annotation-with-inheritance-from-deps\build.log, f:\jenkins\jenkins-slave\workspace\x_maven-plugin-tools_master-XKS4EHY3PSXHGP4DHIXUDAAM6TMAKT3YNFP2XDSSXFM24ZMKWIXQ@2\windows-jdk9-m3.5.x_build\maven-plugin-plugin\target\it\annotation-with-inheritance-reactor\build.log, f:\jenkins\jenkins-slave\workspace\x_maven-plugin-tools_master-XKS4EHY3PSXHGP4DHIXUDAAM6TMAKT3YNFP2XDSSXFM24ZMKWIXQ@2\windows-jdk9-m3.5.x_build\maven-plugin-plugin\target\it\annotation-with-inheritance\build.log, f:\jenkins\jenkins-slave\workspace\x_maven-plugin-tools_master-XKS4EHY3PSXHGP4DHIXUDAAM6TMAKT3YNFP2XDSSXFM24ZMKWIXQ@2\windows-jdk9-m3.5.x_build\maven-plugin-plugin\target\it\ant-basic\build.log, f:\jenkins\jenkins-slave\workspace\x_maven-plugin-tools_master-XKS4EHY3PSXHGP4DHIXUDAAM6TMAKT3YNFP2XDSSXFM24ZMKWIXQ@2\windows-jdk9-m3.5.x_build\maven-plugin-plugin\target\it\ant-reference-parameter\build.log, f:\jenkins\jenkins-slave\workspace\x_maven-plugin-tools_master-XKS4EHY3PSXHGP4DHIXUDAAM6TMAKT3YNFP2XDSSXFM24ZMKWIXQ@2\windows-jdk9-m3.5.x_build\maven-plugin-plugin\target\it\ant-simple-usage\build.log, f:\jenkins\jenkins-slave\workspace\x_maven-plugin-tools_master-XKS4EHY3PSXHGP4DHIXUDAAM6TMAKT3YNFP2XDSSXFM24ZMKWIXQ@2\windows-jdk9-m3.5.x_build\maven-plugin-plugin\target\it\ant-since-maven-plugin\build.log, f:\jenkins\jenkins-slave\workspace\x_maven-plugin-tools_master-XKS4EHY3PSXHGP4DHIXUDAAM6TMAKT3YNFP2XDSSXFM24ZMKWIXQ@2\windows-jdk9-m3.5.x_build\maven-plugin-plugin\target\it\asm-failure\build.log, f:\jenkins\jenkins-slave\workspace\x_maven-plugin-tools_master-XKS4EHY3PSXHGP4DHIXUDAAM6TMAKT3YNFP2XDSSXFM24ZMKWIXQ@2\windows-jdk9-m3.5.x_build\maven-plugin-plugin\target\it\beanshell-simple\build.log, f:\jenkins\jenkins-slave\workspace\x_maven-plugin-tools_master-XKS4EHY3PSXHGP4DHIXUDAAM6TMAKT3YNFP2XDSSXFM24ZMKWIXQ@2\windows-jdk9-m3.5.x_build\maven-plugin-plugin\target\it\fix-maven-since-3.x\build.log, f:\jenkins\jenkins-slave\workspace\x_maven-plugin-tools_master-XKS4EHY3PSXHGP4DHIXUDAAM6TMAKT3YNFP2XDSSXFM24ZMKWIXQ@2\windows-jdk9-m3.5.x_build\maven-plugin-plugin\target\it\help-basic\build.log, f:\jenkins\jenkins-slave\workspace\x_maven-plugin-tools_master-XKS4EHY3PSXHGP4DHIXUDAAM6TMAKT3YNFP2XDSSXFM24ZMKWIXQ@2\windows-jdk9-m3.5.x_build\maven-plugin-plugin\target\it\help-package\build.log, f:\jenkins\jenkins-slave\workspace\x_maven-plugin-tools_master-XKS4EHY3PSXHGP4DHIXUDAAM6TMAKT3YNFP2XDSSXFM24ZMKWIXQ@2\windows-jdk9-m3.5.x_build\maven-plugin-plugin\target\it\ignore-plugin-class-realm\build.log, f:\jenkins\jenkins-slave\workspace\x_maven-plugin-tools_master-XKS4EHY3PSXHGP4DHIXUDAAM6TMAKT3YNFP2XDSSXFM24ZMKWIXQ@2\windows-jdk9-m3.5.x_build\maven-plugin-plugin\target\it\java-basic-annotations-jdk8\build.log, f:\jenkins\jenkins-slave\workspace\x_maven-plugin-tools_master-XKS4EHY3PSXHGP4DHIXUDAAM6TMAKT3YNFP2XDSSXFM24ZMKWIXQ@2\windows-jdk9-m3.5.x_build\maven-plugin-plugin\target\it\java-basic-annotations\build.log, f:\jenkins\jenkins-slave\workspace\x_maven-plugin-tools_master-XKS4EHY3PSXHGP4DHIXUDAAM6TMAKT3YNFP2XDSSXFM24ZMKWIXQ@2\windows-jdk9-m3.5.x_build\maven-plugin-plugin\target\it\java-basic\build.log, f:\jenkins\jenkins-slave\workspace\x_maven-plugin-tools_master-XKS4EHY3PSXHGP4DHIXUDAAM6TMAKT3YNFP2XDSSXFM24ZMKWIXQ@2\windows-jdk9-m3.5.x_build\maven-plugin-plugin\target\it\mplugin-187\build.log, f:\jenkins\jenkins-slave\workspace\x_maven-plugin-tools_master-XKS4EHY3PSXHGP4DHIXUDAAM6TMAKT3YNFP2XDSSXFM24ZMKWIXQ@2\windows-jdk9-m3.5.x_build\maven-plugin-plugin\target\it\mplugin-191\build.log, f:\jenkins\jenkins-slave\workspace\x_maven-plugin-tools_master-XKS4EHY3PSXHGP4DHIXUDAAM6TMAKT3YNFP2XDSSXFM24ZMKWIXQ@2\windows-jdk9-m3.5.x_build\maven-plugin-plugin\target\it\mplugin-223\build.log, f:\jenkins\jenkins-slave\workspace\x_maven-plugin-tools_master-XKS4EHY3PSXHGP4DHIXUDAAM6TMAKT3YNFP2XDSSXFM24ZMKWIXQ@2\windows-jdk9-m3.5.x_build\maven-plugin-plugin\target\it\mplugin-272_java8\build.log, f:\jenkins\jenkins-slave\workspace\x_maven-plugin-tools_master-XKS4EHY3PSXHGP4DHIXUDAAM6TMAKT3YNFP2XDSSXFM24ZMKWIXQ@2\windows-jdk9-m3.5.x_build\maven-plugin-plugin\target\it\mplugin-299_no-configuration\build.log, f:\jenkins\jenkins-slave\workspace\x_maven-plugin-tools_master-XKS4EHY3PSXHGP4DHIXUDAAM6TMAKT3YNFP2XDSSXFM24ZMKWIXQ@2\windows-jdk9-m3.5.x_build\maven-plugin-plugin\target\it\mplugin-305_defaultMojoDependencies\build.log, f:\jenkins\jenkins-slave\workspace\x_maven-plugin-tools_master-XKS4EHY3PSXHGP4DHIXUDAAM6TMAKT3YNFP2XDSSXFM24ZMKWIXQ@2\windows-jdk9-m3.5.x_build\maven-plugin-plugin\target\it\mplugin-305_emptyMojoDependencies\build.log, f:\jenkins\jenkins-slave\workspace\x_maven-plugin-tools_master-XKS4EHY3PSXHGP4DHIXUDAAM6TMAKT3YNFP2XDSSXFM24ZMKWIXQ@2\windows-jdk9-m3.5.x_build\maven-plugin-plugin\target\it\mplugin-305_singleMojoDependencies\build.log, f:\jenkins\jenkins-slave\workspace\x_maven-plugin-tools_master-XKS4EHY3PSXHGP4DHIXUDAAM6TMAKT3YNFP2XDSSXFM24ZMKWIXQ@2\windows-jdk9-m3.5.x_build\maven-plugin-plugin\target\it\mplugin-319_report-since\build.log, f:\jenkins\jenkins-slave\workspace\x_maven-plugin-tools_master-XKS4EHY3PSXHGP4DHIXUDAAM6TMAKT3YNFP2XDSSXFM24ZMKWIXQ@2\windows-jdk9-m3.5.x_build\maven-plugin-plugin\target\it\mplugin-324_javadoc\build.log, f:\jenkins\jenkins-slave\workspace\x_maven-plugin-tools_master-XKS4EHY3PSXHGP4DHIXUDAAM6TMAKT3YNFP2XDSSXFM24ZMKWIXQ@2\windows-jdk9-m3.5.x_build\maven-plugin-plugin\target\it\packaging-jar\build.log, f:\jenkins\jenkins-slave\workspace\x_maven-plugin-tools_master-XKS4EHY3PSXHGP4DHIXUDAAM6TMAKT3YNFP2XDSSXFM24ZMKWIXQ@2\windows-jdk9-m3.5.x_build\maven-plugin-plugin\target\it\plugin-info-jdk-default-version\build.log, f:\jenkins\jenkins-slave\workspace\x_maven-plugin-tools_master-XKS4EHY3PSXHGP4DHIXUDAAM6TMAKT3YNFP2XDSSXFM24ZMKWIXQ@2\windows-jdk9-m3.5.x_build\maven-plugin-plugin\target\it\plugin-info-jdk\build.log, f:\jenkins\jenkins-slave\workspace\x_maven-plugin-tools_master-XKS4EHY3PSXHGP4DHIXUDAAM6TMAKT3YNFP2XDSSXFM24ZMKWIXQ@2\windows-jdk9-m3.5.x_build\maven-plugin-plugin\target\it\plugin-report-annotations\build.log, f:\jenkins\jenkins-slave\workspace\x_maven-plugin-tools_master-XKS4EHY3PSXHGP4DHIXUDAAM6TMAKT3YNFP2XDSSXFM24ZMKWIXQ@2\windows-jdk9-m3.5.x_build\maven-plugin-plugin\target\it\plugin-report\build.log, f:\jenkins\jenkins-slave\workspace\x_maven-plugin-tools_master-XKS4EHY3PSXHGP4DHIXUDAAM6TMAKT3YNFP2XDSSXFM24ZMKWIXQ@2\windows-jdk9-m3.5.x_build\maven-plugin-plugin\target\it\skip\build.log, f:\jenkins\jenkins-slave\workspace\x_maven-plugin-tools_master-XKS4EHY3PSXHGP4DHIXUDAAM6TMAKT3YNFP2XDSSXFM24ZMKWIXQ@2\windows-jdk9-m3.5.x_build\maven-plugin-plugin\target\it\source-encoding\build.log]
[windows-jdk9-m3.5.x_build] Finished parsing Maven Invoker results (found 35)
[windows-jdk9-m3.5.x_build] [withMaven] junitPublisher - Archive test results for Maven artifact org.apache.maven.plugin-tools:maven-plugin-tools-api:3.6.0-SNAPSHOT generated by maven-surefire-plugin:test (default-test): windows-jdk9-m3.5.x_build\maven-plugin-tools-api\target\surefire-reports\*.xml
[windows-jdk9-m3.5.x_build] Recording test results
[windows-jdk9-m3.5.x_build] [withMaven] junitPublisher - Archive test results for Maven artifact org.apache.maven.plugin-tools:maven-plugin-tools-generators:3.6.0-SNAPSHOT generated by maven-surefire-plugin:test (default-test): windows-jdk9-m3.5.x_build\maven-plugin-tools-generators\target\surefire-reports\*.xml
[windows-jdk9-m3.5.x_build] Recording test results
[windows-jdk9-m3.5.x_build] [withMaven] junitPublisher - Archive test results for Maven artifact org.apache.maven.plugin-tools:maven-plugin-tools-java:3.6.0-SNAPSHOT generated by maven-surefire-plugin:test (default-test): windows-jdk9-m3.5.x_build\maven-plugin-tools-java\target\surefire-reports\*.xml
[windows-jdk9-m3.5.x_build] Recording test results
[windows-jdk9-m3.5.x_build] [withMaven] junitPublisher - Archive test results for Maven artifact org.apache.maven.plugin-tools:maven-plugin-annotations:3.6.0-SNAPSHOT generated by maven-surefire-plugin:test (default-test): windows-jdk9-m3.5.x_build\maven-plugin-annotations\target\surefire-reports\*.xml
[windows-jdk9-m3.5.x_build] Recording test results
[windows-jdk9-m3.5.x_build] None of the test reports contained any result
[windows-jdk9-m3.5.x_build] [withMaven] junitPublisher - Archive test results for Maven artifact org.apache.maven.plugin-tools:maven-plugin-tools-annotations:3.6.0-SNAPSHOT generated by maven-surefire-plugin:test (default-test): windows-jdk9-m3.5.x_build\maven-plugin-tools-annotations\target\surefire-reports\*.xml
[windows-jdk9-m3.5.x_build] Recording test results
[windows-jdk9-m3.5.x_build] [withMaven] junitPublisher - Archive test results for Maven artifact org.apache.maven.plugin-tools:maven-plugin-tools-model:3.6.0-SNAPSHOT generated by maven-surefire-plugin:test (default-test): windows-jdk9-m3.5.x_build\maven-script\maven-plugin-tools-model\target\surefire-reports\*.xml
[windows-jdk9-m3.5.x_build] Recording test results
[windows-jdk9-m3.5.x_build] [withMaven] junitPublisher - Archive test results for Maven artifact org.apache.maven.plugin-tools:maven-plugin-tools-ant:3.6.0-SNAPSHOT generated by maven-surefire-plugin:test (default-test): windows-jdk9-m3.5.x_build\maven-script\maven-plugin-tools-ant\target\surefire-reports\*.xml
[windows-jdk9-m3.5.x_build] Recording test results
[windows-jdk9-m3.5.x_build] [withMaven] junitPublisher - Archive test results for Maven artifact org.apache.maven.plugin-tools:maven-script-ant:3.6.0-SNAPSHOT generated by maven-surefire-plugin:test (default-test): windows-jdk9-m3.5.x_build\maven-script\maven-script-ant\target\surefire-reports\*.xml
[windows-jdk9-m3.5.x_build] Recording test results
[windows-jdk9-m3.5.x_build] [withMaven] junitPublisher - Archive test results for Maven artifact org.apache.maven.plugin-tools:maven-plugin-tools-beanshell:3.6.0-SNAPSHOT generated by maven-surefire-plugin:test (default-test): windows-jdk9-m3.5.x_build\maven-script\maven-plugin-tools-beanshell\target\surefire-reports\*.xml
[windows-jdk9-m3.5.x_build] Recording test results
[windows-jdk9-m3.5.x_build] None of the test reports contained any result
[windows-jdk9-m3.5.x_build] [withMaven] junitPublisher - Archive test results for Maven artifact org.apache.maven.plugin-tools:maven-script-beanshell:3.6.0-SNAPSHOT generated by maven-surefire-plugin:test (default-test): windows-jdk9-m3.5.x_build\maven-script\maven-script-beanshell\target\surefire-reports\*.xml
[windows-jdk9-m3.5.x_build] Recording test results
[windows-jdk9-m3.5.x_build] None of the test reports contained any result
[windows-jdk9-m3.5.x_build] [withMaven] junitPublisher - Archive test results for Maven artifact org.apache.maven.plugins:maven-plugin-plugin:3.6.0-SNAPSHOT generated by maven-surefire-plugin:test (default-test): windows-jdk9-m3.5.x_build\maven-plugin-plugin\target\surefire-reports\*.xml
[windows-jdk9-m3.5.x_build] Recording test results
[windows-jdk9-m3.5.x_build] None of the test reports contained any result
[windows-jdk9-m3.5.x_build] [withMaven] openTasksPublisher - Scan Tasks for Maven artifact org.apache.maven.plugin-tools:maven-plugin-tools-api:3.6.0-SNAPSHOT in source directory windows-jdk9-m3.5.x_build\maven-plugin-tools-api\src\main\java
[windows-jdk9-m3.5.x_build] [withMaven] openTasksPublisher - Scan Tasks for Maven artifact org.apache.maven.plugin-tools:maven-plugin-tools-generators:3.6.0-SNAPSHOT in source directory windows-jdk9-m3.5.x_build\maven-plugin-tools-generators\src\main\java
[windows-jdk9-m3.5.x_build] [withMaven] openTasksPublisher - Scan Tasks for Maven artifact org.apache.maven.plugin-tools:maven-plugin-tools-java:3.6.0-SNAPSHOT in source directory windows-jdk9-m3.5.x_build\maven-plugin-tools-java\src\main\java
[windows-jdk9-m3.5.x_build] [withMaven] openTasksPublisher - Scan Tasks for Maven artifact org.apache.maven.plugin-tools:maven-plugin-annotations:3.6.0-SNAPSHOT in source directory windows-jdk9-m3.5.x_build\maven-plugin-annotations\src\main\java
[windows-jdk9-m3.5.x_build] [withMaven] openTasksPublisher - Scan Tasks for Maven artifact org.apache.maven.plugin-tools:maven-plugin-tools-annotations:3.6.0-SNAPSHOT in source directory windows-jdk9-m3.5.x_build\maven-plugin-tools-annotations\src\main\java
[windows-jdk9-m3.5.x_build] [withMaven] openTasksPublisher - Scan Tasks for Maven artifact org.apache.maven.plugin-tools:maven-plugin-tools-model:3.6.0-SNAPSHOT in source directory windows-jdk9-m3.5.x_build\maven-script\maven-plugin-tools-model\src\main\java
[windows-jdk9-m3.5.x_build] [withMaven] openTasksPublisher - Scan Tasks for Maven artifact org.apache.maven.plugin-tools:maven-plugin-tools-ant:3.6.0-SNAPSHOT in source directory windows-jdk9-m3.5.x_build\maven-script\maven-plugin-tools-ant\src\main\java
[windows-jdk9-m3.5.x_build] [withMaven] openTasksPublisher - Scan Tasks for Maven artifact org.apache.maven.plugin-tools:maven-script-ant:3.6.0-SNAPSHOT in source directory windows-jdk9-m3.5.x_build\maven-script\maven-script-ant\src\main\java
[windows-jdk9-m3.5.x_build] [withMaven] openTasksPublisher - Scan Tasks for Maven artifact org.apache.maven.plugin-tools:maven-plugin-tools-beanshell:3.6.0-SNAPSHOT in source directory windows-jdk9-m3.5.x_build\maven-script\maven-plugin-tools-beanshell\src\main\java
[windows-jdk9-m3.5.x_build] [withMaven] openTasksPublisher - Scan Tasks for Maven artifact org.apache.maven.plugin-tools:maven-script-beanshell:3.6.0-SNAPSHOT in source directory windows-jdk9-m3.5.x_build\maven-script\maven-script-beanshell\src\main\java
[windows-jdk9-m3.5.x_build] [withMaven] openTasksPublisher - Scan Tasks for Maven artifact org.apache.maven.plugins:maven-plugin-plugin:3.6.0-SNAPSHOT in source directory windows-jdk9-m3.5.x_build\maven-plugin-plugin\src\main\java
[windows-jdk9-m3.5.x_build] [TASKS] Scanning folder 'f:\jenkins\jenkins-slave\workspace\x_maven-plugin-tools_master-XKS4EHY3PSXHGP4DHIXUDAAM6TMAKT3YNFP2XDSSXFM24ZMKWIXQ@2' for files matching the pattern 'windows-jdk9-m3.5.x_build\maven-plugin-tools-api\src\main\java\**\*,windows-jdk9-m3.5.x_build\maven-plugin-tools-generators\src\main\java\**\*,windows-jdk9-m3.5.x_build\maven-plugin-tools-java\src\main\java\**\*,windows-jdk9-m3.5.x_build\maven-plugin-annotations\src\main\java\**\*,windows-jdk9-m3.5.x_build\maven-plugin-tools-annotations\src\main\java\**\*,windows-jdk9-m3.5.x_build\maven-script\maven-plugin-tools-model\src\main\java\**\*,windows-jdk9-m3.5.x_build\maven-script\maven-plugin-tools-ant\src\main\java\**\*,windows-jdk9-m3.5.x_build\maven-script\maven-script-ant\src\main\java\**\*,windows-jdk9-m3.5.x_build\maven-script\maven-plugin-tools-beanshell\src\main\java\**\*,windows-jdk9-m3.5.x_build\maven-script\maven-script-beanshell\src\main\java\**\*,windows-jdk9-m3.5.x_build\maven-plugin-plugin\src\main\java\**\*' - excludes: null
[windows-jdk9-m3.5.x_build] [TASKS] Found 52 files to scan for tasks
[windows-jdk9-m3.5.x_build] [TASKS] Found 11 open tasks.
[windows-jdk9-m3.5.x_build] Skipping warnings blame since pipelines do not have an SCM link.%n
[windows-jdk9-m3.5.x_build] [TASKS] Computing warning deltas based on reference build #46
[Pipeline] [windows-jdk8-m3.5.x_build] }
[Pipeline] [windows-jdk10-m3.5.x_build] }
[Pipeline] [linux-jdk8-m3.5.x_build] // ws
[Pipeline] [linux-jdk9-m3.5.x_build] // ws
[Pipeline] [linux-jdk11-m3.5.x_build] // ws
[Pipeline] [windows-jdk7-m3.2.x_build] // withMaven
[Pipeline] [windows-jdk7-m3.3.x_build] // withMaven
[Pipeline] [windows-jdk9-m3.5.x_build] // withMaven
[Pipeline] [linux-jdk8-m3.5.x_build] }
[Pipeline] [linux-jdk9-m3.5.x_build] }
[Pipeline] [linux-jdk11-m3.5.x_build] }
[Pipeline] [linux-jdk10-m3.5.x_build] }
[Pipeline] [linux-jdk7-m3.3.x_build] }
[Pipeline] [linux-jdk7-m3.5.x_build] }
[Pipeline] [windows-jdk7-m3.5.x_build] }
[Pipeline] [windows-jdk11-m3.5.x_build] }
[Pipeline] [windows-jdk7-m3.2.x_build] cleanWs
[Pipeline] [windows-jdk7-m3.3.x_build] cleanWs
[Pipeline] [windows-jdk9-m3.5.x_build] cleanWs
[Pipeline] [windows-jdk8-m3.5.x_build] // stage
[Pipeline] [windows-jdk8-m3.5.x_build] }
[Pipeline] [windows-jdk10-m3.5.x_build] // stage
[Pipeline] [windows-jdk10-m3.5.x_build] }
[Pipeline] [linux-jdk8-m3.5.x_build] // node
[windows-jdk9-m3.5.x_build] [WS-CLEANUP] Deleting project workspace...[WS-CLEANUP] done
[Pipeline] [linux-jdk9-m3.5.x_build] // node
[windows-jdk7-m3.2.x_build] [WS-CLEANUP] Deleting project workspace...[WS-CLEANUP] done
[windows-jdk7-m3.3.x_build] [WS-CLEANUP] Deleting project workspace...[WS-CLEANUP] done
[Pipeline] [linux-jdk11-m3.5.x_build] // node
[Pipeline] [linux-jdk10-m3.5.x_build] // stage
[Pipeline] [linux-jdk7-m3.3.x_build] // stage
[Pipeline] [linux-jdk7-m3.5.x_build] // stage
[Pipeline] [windows-jdk7-m3.5.x_build] // stage
[Pipeline] [windows-jdk11-m3.5.x_build] // stage
[Pipeline] [linux-jdk8-m3.5.x_build] }
[Pipeline] [linux-jdk9-m3.5.x_build] }
[Pipeline] [linux-jdk11-m3.5.x_build] }
[Pipeline] [linux-jdk7-m3.3.x_build] }
[Pipeline] [linux-jdk7-m3.5.x_build] }
[Pipeline] [linux-jdk10-m3.5.x_build] }
[Pipeline] [windows-jdk7-m3.5.x_build] }
[Pipeline] [windows-jdk11-m3.5.x_build] }
[Pipeline] [windows-jdk8-m3.5.x_build] // ws
[Pipeline] [windows-jdk8-m3.5.x_build] }
[Pipeline] [windows-jdk10-m3.5.x_build] // ws
[Pipeline] [windows-jdk10-m3.5.x_build] }
[Pipeline] [windows-jdk9-m3.5.x_build] }
[Pipeline] [windows-jdk7-m3.2.x_build] }
[Pipeline] [windows-jdk7-m3.3.x_build] }
[Pipeline] [linux-jdk7-m3.3.x_build] // ws
[Pipeline] [linux-jdk7-m3.5.x_build] // ws
[Pipeline] [linux-jdk10-m3.5.x_build] // ws
[Pipeline] [windows-jdk7-m3.5.x_build] // ws
[Pipeline] [windows-jdk11-m3.5.x_build] // ws
[Pipeline] [linux-jdk7-m3.3.x_build] }
[Pipeline] [linux-jdk7-m3.5.x_build] }
[Pipeline] [linux-jdk10-m3.5.x_build] }
[Pipeline] [windows-jdk7-m3.5.x_build] }
[Pipeline] [windows-jdk11-m3.5.x_build] }
[Pipeline] [windows-jdk8-m3.5.x_build] // node
[Pipeline] [windows-jdk8-m3.5.x_build] }
[Pipeline] [windows-jdk10-m3.5.x_build] // node
[Pipeline] [windows-jdk10-m3.5.x_build] }
[Pipeline] [windows-jdk9-m3.5.x_build] // stage
[Pipeline] [windows-jdk9-m3.5.x_build] }
[Pipeline] [windows-jdk7-m3.2.x_build] // stage
[Pipeline] [windows-jdk7-m3.3.x_build] // stage
[Pipeline] [windows-jdk7-m3.2.x_build] }
[Pipeline] [windows-jdk7-m3.3.x_build] }
[Pipeline] [linux-jdk7-m3.3.x_build] // node
[Pipeline] [linux-jdk7-m3.5.x_build] // node
[Pipeline] [linux-jdk10-m3.5.x_build] // node
[Pipeline] [windows-jdk7-m3.5.x_build] // node
[Pipeline] [windows-jdk11-m3.5.x_build] // node
[Pipeline] [linux-jdk7-m3.3.x_build] }
[Pipeline] [linux-jdk7-m3.5.x_build] }
[Pipeline] [linux-jdk10-m3.5.x_build] }
[Pipeline] [windows-jdk7-m3.5.x_build] }
[Pipeline] [windows-jdk11-m3.5.x_build] }
[Pipeline] [windows-jdk9-m3.5.x_build] // ws
[Pipeline] [windows-jdk9-m3.5.x_build] }
[Pipeline] [windows-jdk7-m3.2.x_build] // ws
[Pipeline] [windows-jdk7-m3.3.x_build] // ws
[Pipeline] [windows-jdk7-m3.2.x_build] }
[Pipeline] [windows-jdk7-m3.3.x_build] }
[Pipeline] [windows-jdk9-m3.5.x_build] // node
[Pipeline] [windows-jdk9-m3.5.x_build] }
[Pipeline] [windows-jdk7-m3.2.x_build] // node
[Pipeline] [windows-jdk7-m3.3.x_build] // node
[Pipeline] [windows-jdk7-m3.2.x_build] }
[Pipeline] [windows-jdk7-m3.3.x_build] }
[Pipeline] // parallel
[Pipeline] stage
[Pipeline] { (Notifications)
[Pipeline] echo
Build result: UNSTABLE
[Pipeline] jiraIssueSelector
[Pipeline] jiraComment
[Pipeline] emailext
Mime
  • Unnamed multipart/mixed (inline, None, 0 bytes)
View raw message