maven-notifications mailing list archives

Site index · List index
Message view « Date » · « Thread »
Top « Date » · « Thread »
From Apache Jenkins Server <jenk...@builds.apache.org>
Subject Build unstable in Jenkins: Maven TLP » maven-archetype » ARCHETYPE-553 #26
Date Sat, 06 Oct 2018 09:43:58 GMT
See https://builds.apache.org/job/maven-box/job/maven-archetype/job/ARCHETYPE-553/26/

Changes:

* Use def

56 tests failed.
FAILED:  org.apache.maven.archetype.creator.DefaultArchetypeCreatorIT.testIncludeFileWithNoExtension

Error Message:
Error while executing process.

Stack Trace:
org.codehaus.plexus.util.cli.CommandLineException: Error while executing process.
	at org.apache.maven.archetype.creator.DefaultArchetypeCreatorIT.createFilesetArchetype(DefaultArchetypeCreatorIT.java:136)
	at org.apache.maven.archetype.creator.DefaultArchetypeCreatorIT.testIncludeFileWithNoExtension(DefaultArchetypeCreatorIT.java:189)
Caused by: java.io.IOException: Cannot run program "F:\jenkins\tools\maven\apache-maven-3.5.2\bin\mvn.cmd" (in directory "F:\jenkins\jenkins-slave\workspace\ven-archetype_ARCHETYPE-553-J4FOCNZGBVSFDFI4P3DBC7GXGJK62NFN5QH7Q5I46GZ5AP3FIVLQ@tmp@2\windows-jdk11-m3.5.x_build\archetype-testing\archetype-final\target\test-classes\projects\include-file-with-no-extension\target\generated-sources\archetype"): CreateProcess error=267, The directory name is invalid
	at org.apache.maven.archetype.creator.DefaultArchetypeCreatorIT.createFilesetArchetype(DefaultArchetypeCreatorIT.java:136)
	at org.apache.maven.archetype.creator.DefaultArchetypeCreatorIT.testIncludeFileWithNoExtension(DefaultArchetypeCreatorIT.java:189)
Caused by: java.io.IOException: CreateProcess error=267, The directory name is invalid
	at org.apache.maven.archetype.creator.DefaultArchetypeCreatorIT.createFilesetArchetype(DefaultArchetypeCreatorIT.java:136)
	at org.apache.maven.archetype.creator.DefaultArchetypeCreatorIT.testIncludeFileWithNoExtension(DefaultArchetypeCreatorIT.java:189)


FAILED:  org.apache.maven.archetype.creator.DefaultArchetypeCreatorIT.testSystemPropertiesAreIncluded

Error Message:
Error while executing process.

Stack Trace:
org.codehaus.plexus.util.cli.CommandLineException: Error while executing process.
	at org.apache.maven.archetype.creator.DefaultArchetypeCreatorIT.createFilesetArchetype(DefaultArchetypeCreatorIT.java:136)
	at org.apache.maven.archetype.creator.DefaultArchetypeCreatorIT.testSystemPropertiesAreIncluded(DefaultArchetypeCreatorIT.java:200)
Caused by: java.io.IOException: Cannot run program "F:\jenkins\tools\maven\apache-maven-3.5.2\bin\mvn.cmd" (in directory "F:\jenkins\jenkins-slave\workspace\ven-archetype_ARCHETYPE-553-J4FOCNZGBVSFDFI4P3DBC7GXGJK62NFN5QH7Q5I46GZ5AP3FIVLQ@tmp@2\windows-jdk11-m3.5.x_build\archetype-testing\archetype-final\target\test-classes\projects\included-system-properties\target\generated-sources\archetype"): CreateProcess error=267, The directory name is invalid
	at org.apache.maven.archetype.creator.DefaultArchetypeCreatorIT.createFilesetArchetype(DefaultArchetypeCreatorIT.java:136)
	at org.apache.maven.archetype.creator.DefaultArchetypeCreatorIT.testSystemPropertiesAreIncluded(DefaultArchetypeCreatorIT.java:200)
Caused by: java.io.IOException: CreateProcess error=267, The directory name is invalid
	at org.apache.maven.archetype.creator.DefaultArchetypeCreatorIT.createFilesetArchetype(DefaultArchetypeCreatorIT.java:136)
	at org.apache.maven.archetype.creator.DefaultArchetypeCreatorIT.testSystemPropertiesAreIncluded(DefaultArchetypeCreatorIT.java:200)


FAILED:  org.apache.maven.archetype.creator.DefaultArchetypeCreatorIT.testExcludePatternsMustExcludeDirectory

Error Message:
Error while executing process.

Stack Trace:
org.codehaus.plexus.util.cli.CommandLineException: Error while executing process.
	at org.apache.maven.archetype.creator.DefaultArchetypeCreatorIT.createFilesetArchetype(DefaultArchetypeCreatorIT.java:136)
	at org.apache.maven.archetype.creator.DefaultArchetypeCreatorIT.testExcludePatternsMustExcludeDirectory(DefaultArchetypeCreatorIT.java:163)
Caused by: java.io.IOException: Cannot run program "F:\jenkins\tools\maven\apache-maven-3.5.2\bin\mvn.cmd" (in directory "F:\jenkins\jenkins-slave\workspace\ven-archetype_ARCHETYPE-553-J4FOCNZGBVSFDFI4P3DBC7GXGJK62NFN5QH7Q5I46GZ5AP3FIVLQ@tmp@2\windows-jdk11-m3.5.x_build\archetype-testing\archetype-final\target\test-classes\projects\exclude-patterns\target\generated-sources\archetype"): CreateProcess error=267, The directory name is invalid
	at org.apache.maven.archetype.creator.DefaultArchetypeCreatorIT.createFilesetArchetype(DefaultArchetypeCreatorIT.java:136)
	at org.apache.maven.archetype.creator.DefaultArchetypeCreatorIT.testExcludePatternsMustExcludeDirectory(DefaultArchetypeCreatorIT.java:163)
Caused by: java.io.IOException: CreateProcess error=267, The directory name is invalid
	at org.apache.maven.archetype.creator.DefaultArchetypeCreatorIT.createFilesetArchetype(DefaultArchetypeCreatorIT.java:136)
	at org.apache.maven.archetype.creator.DefaultArchetypeCreatorIT.testExcludePatternsMustExcludeDirectory(DefaultArchetypeCreatorIT.java:163)


FAILED:  org.apache.maven.archetype.creator.DefaultArchetypeCreatorIT.testExcludePatternsContainingFilesSameExtension

Error Message:
Error while executing process.

Stack Trace:
org.codehaus.plexus.util.cli.CommandLineException: Error while executing process.
	at org.apache.maven.archetype.creator.DefaultArchetypeCreatorIT.createFilesetArchetype(DefaultArchetypeCreatorIT.java:136)
	at org.apache.maven.archetype.creator.DefaultArchetypeCreatorIT.testExcludePatternsContainingFilesSameExtension(DefaultArchetypeCreatorIT.java:177)
Caused by: java.io.IOException: Cannot run program "F:\jenkins\tools\maven\apache-maven-3.5.2\bin\mvn.cmd" (in directory "F:\jenkins\jenkins-slave\workspace\ven-archetype_ARCHETYPE-553-J4FOCNZGBVSFDFI4P3DBC7GXGJK62NFN5QH7Q5I46GZ5AP3FIVLQ@tmp@2\windows-jdk11-m3.5.x_build\archetype-testing\archetype-final\target\test-classes\projects\exclude-patterns-2\target\generated-sources\archetype"): CreateProcess error=267, The directory name is invalid
	at org.apache.maven.archetype.creator.DefaultArchetypeCreatorIT.createFilesetArchetype(DefaultArchetypeCreatorIT.java:136)
	at org.apache.maven.archetype.creator.DefaultArchetypeCreatorIT.testExcludePatternsContainingFilesSameExtension(DefaultArchetypeCreatorIT.java:177)
Caused by: java.io.IOException: CreateProcess error=267, The directory name is invalid
	at org.apache.maven.archetype.creator.DefaultArchetypeCreatorIT.createFilesetArchetype(DefaultArchetypeCreatorIT.java:136)
	at org.apache.maven.archetype.creator.DefaultArchetypeCreatorIT.testExcludePatternsContainingFilesSameExtension(DefaultArchetypeCreatorIT.java:177)


FAILED:  org.apache.maven.archetype.creator.DefaultArchetypeCreatorIT.testChangeJavaFilenameWhenCustomPropertyEqualsClassName

Error Message:
Error while executing process.

Stack Trace:
org.codehaus.plexus.util.cli.CommandLineException: Error while executing process.
	at org.apache.maven.archetype.creator.DefaultArchetypeCreatorIT.createFilesetArchetype(DefaultArchetypeCreatorIT.java:136)
	at org.apache.maven.archetype.creator.DefaultArchetypeCreatorIT.testChangeJavaFilenameWhenCustomPropertyEqualsClassName(DefaultArchetypeCreatorIT.java:151)
Caused by: java.io.IOException: Cannot run program "F:\jenkins\tools\maven\apache-maven-3.5.2\bin\mvn.cmd" (in directory "F:\jenkins\jenkins-slave\workspace\ven-archetype_ARCHETYPE-553-J4FOCNZGBVSFDFI4P3DBC7GXGJK62NFN5QH7Q5I46GZ5AP3FIVLQ@tmp@2\windows-jdk11-m3.5.x_build\archetype-testing\archetype-final\target\test-classes\projects\change-file-with-property\target\generated-sources\archetype"): CreateProcess error=267, The directory name is invalid
	at org.apache.maven.archetype.creator.DefaultArchetypeCreatorIT.createFilesetArchetype(DefaultArchetypeCreatorIT.java:136)
	at org.apache.maven.archetype.creator.DefaultArchetypeCreatorIT.testChangeJavaFilenameWhenCustomPropertyEqualsClassName(DefaultArchetypeCreatorIT.java:151)
Caused by: java.io.IOException: CreateProcess error=267, The directory name is invalid
	at org.apache.maven.archetype.creator.DefaultArchetypeCreatorIT.createFilesetArchetype(DefaultArchetypeCreatorIT.java:136)
	at org.apache.maven.archetype.creator.DefaultArchetypeCreatorIT.testChangeJavaFilenameWhenCustomPropertyEqualsClassName(DefaultArchetypeCreatorIT.java:151)


FAILED:  org.apache.maven.archetype.creator.DefaultArchetypeCreatorIT.testIncludeFileWithNoExtension

Error Message:
Error while executing process.

Stack Trace:
org.codehaus.plexus.util.cli.CommandLineException: Error while executing process.
	at org.apache.maven.archetype.creator.DefaultArchetypeCreatorIT.createFilesetArchetype(DefaultArchetypeCreatorIT.java:136)
	at org.apache.maven.archetype.creator.DefaultArchetypeCreatorIT.testIncludeFileWithNoExtension(DefaultArchetypeCreatorIT.java:189)
Caused by: java.io.IOException: Cannot run program "F:\jenkins\tools\maven\apache-maven-3.2.5\bin\mvn.bat" (in directory "F:\jenkins\jenkins-slave\workspace\ven-archetype_ARCHETYPE-553-J4FOCNZGBVSFDFI4P3DBC7GXGJK62NFN5QH7Q5I46GZ5AP3FIVLQ@tmp@3\windows-jdk7-m3.2.x_build\archetype-testing\archetype-final\target\test-classes\projects\include-file-with-no-extension\target\generated-sources\archetype"): CreateProcess error=267, The directory name is invalid
	at org.apache.maven.archetype.creator.DefaultArchetypeCreatorIT.createFilesetArchetype(DefaultArchetypeCreatorIT.java:136)
	at org.apache.maven.archetype.creator.DefaultArchetypeCreatorIT.testIncludeFileWithNoExtension(DefaultArchetypeCreatorIT.java:189)
Caused by: java.io.IOException: CreateProcess error=267, The directory name is invalid
	at org.apache.maven.archetype.creator.DefaultArchetypeCreatorIT.createFilesetArchetype(DefaultArchetypeCreatorIT.java:136)
	at org.apache.maven.archetype.creator.DefaultArchetypeCreatorIT.testIncludeFileWithNoExtension(DefaultArchetypeCreatorIT.java:189)


FAILED:  org.apache.maven.archetype.creator.DefaultArchetypeCreatorIT.testSystemPropertiesAreIncluded

Error Message:
Error while executing process.

Stack Trace:
org.codehaus.plexus.util.cli.CommandLineException: Error while executing process.
	at org.apache.maven.archetype.creator.DefaultArchetypeCreatorIT.createFilesetArchetype(DefaultArchetypeCreatorIT.java:136)
	at org.apache.maven.archetype.creator.DefaultArchetypeCreatorIT.testSystemPropertiesAreIncluded(DefaultArchetypeCreatorIT.java:200)
Caused by: java.io.IOException: Cannot run program "F:\jenkins\tools\maven\apache-maven-3.2.5\bin\mvn.bat" (in directory "F:\jenkins\jenkins-slave\workspace\ven-archetype_ARCHETYPE-553-J4FOCNZGBVSFDFI4P3DBC7GXGJK62NFN5QH7Q5I46GZ5AP3FIVLQ@tmp@3\windows-jdk7-m3.2.x_build\archetype-testing\archetype-final\target\test-classes\projects\included-system-properties\target\generated-sources\archetype"): CreateProcess error=267, The directory name is invalid
	at org.apache.maven.archetype.creator.DefaultArchetypeCreatorIT.createFilesetArchetype(DefaultArchetypeCreatorIT.java:136)
	at org.apache.maven.archetype.creator.DefaultArchetypeCreatorIT.testSystemPropertiesAreIncluded(DefaultArchetypeCreatorIT.java:200)
Caused by: java.io.IOException: CreateProcess error=267, The directory name is invalid
	at org.apache.maven.archetype.creator.DefaultArchetypeCreatorIT.createFilesetArchetype(DefaultArchetypeCreatorIT.java:136)
	at org.apache.maven.archetype.creator.DefaultArchetypeCreatorIT.testSystemPropertiesAreIncluded(DefaultArchetypeCreatorIT.java:200)


FAILED:  org.apache.maven.archetype.creator.DefaultArchetypeCreatorIT.testExcludePatternsMustExcludeDirectory

Error Message:
Error while executing process.

Stack Trace:
org.codehaus.plexus.util.cli.CommandLineException: Error while executing process.
	at org.apache.maven.archetype.creator.DefaultArchetypeCreatorIT.createFilesetArchetype(DefaultArchetypeCreatorIT.java:136)
	at org.apache.maven.archetype.creator.DefaultArchetypeCreatorIT.testExcludePatternsMustExcludeDirectory(DefaultArchetypeCreatorIT.java:163)
Caused by: java.io.IOException: Cannot run program "F:\jenkins\tools\maven\apache-maven-3.2.5\bin\mvn.bat" (in directory "F:\jenkins\jenkins-slave\workspace\ven-archetype_ARCHETYPE-553-J4FOCNZGBVSFDFI4P3DBC7GXGJK62NFN5QH7Q5I46GZ5AP3FIVLQ@tmp@3\windows-jdk7-m3.2.x_build\archetype-testing\archetype-final\target\test-classes\projects\exclude-patterns\target\generated-sources\archetype"): CreateProcess error=267, The directory name is invalid
	at org.apache.maven.archetype.creator.DefaultArchetypeCreatorIT.createFilesetArchetype(DefaultArchetypeCreatorIT.java:136)
	at org.apache.maven.archetype.creator.DefaultArchetypeCreatorIT.testExcludePatternsMustExcludeDirectory(DefaultArchetypeCreatorIT.java:163)
Caused by: java.io.IOException: CreateProcess error=267, The directory name is invalid
	at org.apache.maven.archetype.creator.DefaultArchetypeCreatorIT.createFilesetArchetype(DefaultArchetypeCreatorIT.java:136)
	at org.apache.maven.archetype.creator.DefaultArchetypeCreatorIT.testExcludePatternsMustExcludeDirectory(DefaultArchetypeCreatorIT.java:163)


FAILED:  org.apache.maven.archetype.creator.DefaultArchetypeCreatorIT.testExcludePatternsContainingFilesSameExtension

Error Message:
Error while executing process.

Stack Trace:
org.codehaus.plexus.util.cli.CommandLineException: Error while executing process.
	at org.apache.maven.archetype.creator.DefaultArchetypeCreatorIT.createFilesetArchetype(DefaultArchetypeCreatorIT.java:136)
	at org.apache.maven.archetype.creator.DefaultArchetypeCreatorIT.testExcludePatternsContainingFilesSameExtension(DefaultArchetypeCreatorIT.java:177)
Caused by: java.io.IOException: Cannot run program "F:\jenkins\tools\maven\apache-maven-3.2.5\bin\mvn.bat" (in directory "F:\jenkins\jenkins-slave\workspace\ven-archetype_ARCHETYPE-553-J4FOCNZGBVSFDFI4P3DBC7GXGJK62NFN5QH7Q5I46GZ5AP3FIVLQ@tmp@3\windows-jdk7-m3.2.x_build\archetype-testing\archetype-final\target\test-classes\projects\exclude-patterns-2\target\generated-sources\archetype"): CreateProcess error=267, The directory name is invalid
	at org.apache.maven.archetype.creator.DefaultArchetypeCreatorIT.createFilesetArchetype(DefaultArchetypeCreatorIT.java:136)
	at org.apache.maven.archetype.creator.DefaultArchetypeCreatorIT.testExcludePatternsContainingFilesSameExtension(DefaultArchetypeCreatorIT.java:177)
Caused by: java.io.IOException: CreateProcess error=267, The directory name is invalid
	at org.apache.maven.archetype.creator.DefaultArchetypeCreatorIT.createFilesetArchetype(DefaultArchetypeCreatorIT.java:136)
	at org.apache.maven.archetype.creator.DefaultArchetypeCreatorIT.testExcludePatternsContainingFilesSameExtension(DefaultArchetypeCreatorIT.java:177)


FAILED:  org.apache.maven.archetype.creator.DefaultArchetypeCreatorIT.testChangeJavaFilenameWhenCustomPropertyEqualsClassName

Error Message:
Error while executing process.

Stack Trace:
org.codehaus.plexus.util.cli.CommandLineException: Error while executing process.
	at org.apache.maven.archetype.creator.DefaultArchetypeCreatorIT.createFilesetArchetype(DefaultArchetypeCreatorIT.java:136)
	at org.apache.maven.archetype.creator.DefaultArchetypeCreatorIT.testChangeJavaFilenameWhenCustomPropertyEqualsClassName(DefaultArchetypeCreatorIT.java:151)
Caused by: java.io.IOException: Cannot run program "F:\jenkins\tools\maven\apache-maven-3.2.5\bin\mvn.bat" (in directory "F:\jenkins\jenkins-slave\workspace\ven-archetype_ARCHETYPE-553-J4FOCNZGBVSFDFI4P3DBC7GXGJK62NFN5QH7Q5I46GZ5AP3FIVLQ@tmp@3\windows-jdk7-m3.2.x_build\archetype-testing\archetype-final\target\test-classes\projects\change-file-with-property\target\generated-sources\archetype"): CreateProcess error=267, The directory name is invalid
	at org.apache.maven.archetype.creator.DefaultArchetypeCreatorIT.createFilesetArchetype(DefaultArchetypeCreatorIT.java:136)
	at org.apache.maven.archetype.creator.DefaultArchetypeCreatorIT.testChangeJavaFilenameWhenCustomPropertyEqualsClassName(DefaultArchetypeCreatorIT.java:151)
Caused by: java.io.IOException: CreateProcess error=267, The directory name is invalid
	at org.apache.maven.archetype.creator.DefaultArchetypeCreatorIT.createFilesetArchetype(DefaultArchetypeCreatorIT.java:136)
	at org.apache.maven.archetype.creator.DefaultArchetypeCreatorIT.testChangeJavaFilenameWhenCustomPropertyEqualsClassName(DefaultArchetypeCreatorIT.java:151)


FAILED:  org.apache.maven.archetype.creator.DefaultArchetypeCreatorIT.testIncludeFileWithNoExtension

Error Message:
Error while executing process.

Stack Trace:
org.codehaus.plexus.util.cli.CommandLineException: Error while executing process.
	at org.apache.maven.archetype.creator.DefaultArchetypeCreatorIT.createFilesetArchetype(DefaultArchetypeCreatorIT.java:136)
	at org.apache.maven.archetype.creator.DefaultArchetypeCreatorIT.testIncludeFileWithNoExtension(DefaultArchetypeCreatorIT.java:189)
Caused by: java.io.IOException: Cannot run program "F:\jenkins\tools\maven\apache-maven-3.5.2\bin\mvn.cmd" (in directory "F:\jenkins\jenkins-slave\workspace\ven-archetype_ARCHETYPE-553-J4FOCNZGBVSFDFI4P3DBC7GXGJK62NFN5QH7Q5I46GZ5AP3FIVLQ@2@tmp\windows-jdk10-m3.5.x_build\archetype-testing\archetype-final\target\test-classes\projects\include-file-with-no-extension\target\generated-sources\archetype"): CreateProcess error=267, The directory name is invalid
	at org.apache.maven.archetype.creator.DefaultArchetypeCreatorIT.createFilesetArchetype(DefaultArchetypeCreatorIT.java:136)
	at org.apache.maven.archetype.creator.DefaultArchetypeCreatorIT.testIncludeFileWithNoExtension(DefaultArchetypeCreatorIT.java:189)
Caused by: java.io.IOException: CreateProcess error=267, The directory name is invalid
	at org.apache.maven.archetype.creator.DefaultArchetypeCreatorIT.createFilesetArchetype(DefaultArchetypeCreatorIT.java:136)
	at org.apache.maven.archetype.creator.DefaultArchetypeCreatorIT.testIncludeFileWithNoExtension(DefaultArchetypeCreatorIT.java:189)


FAILED:  org.apache.maven.archetype.creator.DefaultArchetypeCreatorIT.testSystemPropertiesAreIncluded

Error Message:
Error while executing process.

Stack Trace:
org.codehaus.plexus.util.cli.CommandLineException: Error while executing process.
	at org.apache.maven.archetype.creator.DefaultArchetypeCreatorIT.createFilesetArchetype(DefaultArchetypeCreatorIT.java:136)
	at org.apache.maven.archetype.creator.DefaultArchetypeCreatorIT.testSystemPropertiesAreIncluded(DefaultArchetypeCreatorIT.java:200)
Caused by: java.io.IOException: Cannot run program "F:\jenkins\tools\maven\apache-maven-3.5.2\bin\mvn.cmd" (in directory "F:\jenkins\jenkins-slave\workspace\ven-archetype_ARCHETYPE-553-J4FOCNZGBVSFDFI4P3DBC7GXGJK62NFN5QH7Q5I46GZ5AP3FIVLQ@2@tmp\windows-jdk10-m3.5.x_build\archetype-testing\archetype-final\target\test-classes\projects\included-system-properties\target\generated-sources\archetype"): CreateProcess error=267, The directory name is invalid
	at org.apache.maven.archetype.creator.DefaultArchetypeCreatorIT.createFilesetArchetype(DefaultArchetypeCreatorIT.java:136)
	at org.apache.maven.archetype.creator.DefaultArchetypeCreatorIT.testSystemPropertiesAreIncluded(DefaultArchetypeCreatorIT.java:200)
Caused by: java.io.IOException: CreateProcess error=267, The directory name is invalid
	at org.apache.maven.archetype.creator.DefaultArchetypeCreatorIT.createFilesetArchetype(DefaultArchetypeCreatorIT.java:136)
	at org.apache.maven.archetype.creator.DefaultArchetypeCreatorIT.testSystemPropertiesAreIncluded(DefaultArchetypeCreatorIT.java:200)


FAILED:  org.apache.maven.archetype.creator.DefaultArchetypeCreatorIT.testExcludePatternsMustExcludeDirectory

Error Message:
Error while executing process.

Stack Trace:
org.codehaus.plexus.util.cli.CommandLineException: Error while executing process.
	at org.apache.maven.archetype.creator.DefaultArchetypeCreatorIT.createFilesetArchetype(DefaultArchetypeCreatorIT.java:136)
	at org.apache.maven.archetype.creator.DefaultArchetypeCreatorIT.testExcludePatternsMustExcludeDirectory(DefaultArchetypeCreatorIT.java:163)
Caused by: java.io.IOException: Cannot run program "F:\jenkins\tools\maven\apache-maven-3.5.2\bin\mvn.cmd" (in directory "F:\jenkins\jenkins-slave\workspace\ven-archetype_ARCHETYPE-553-J4FOCNZGBVSFDFI4P3DBC7GXGJK62NFN5QH7Q5I46GZ5AP3FIVLQ@2@tmp\windows-jdk10-m3.5.x_build\archetype-testing\archetype-final\target\test-classes\projects\exclude-patterns\target\generated-sources\archetype"): CreateProcess error=267, The directory name is invalid
	at org.apache.maven.archetype.creator.DefaultArchetypeCreatorIT.createFilesetArchetype(DefaultArchetypeCreatorIT.java:136)
	at org.apache.maven.archetype.creator.DefaultArchetypeCreatorIT.testExcludePatternsMustExcludeDirectory(DefaultArchetypeCreatorIT.java:163)
Caused by: java.io.IOException: CreateProcess error=267, The directory name is invalid
	at org.apache.maven.archetype.creator.DefaultArchetypeCreatorIT.createFilesetArchetype(DefaultArchetypeCreatorIT.java:136)
	at org.apache.maven.archetype.creator.DefaultArchetypeCreatorIT.testExcludePatternsMustExcludeDirectory(DefaultArchetypeCreatorIT.java:163)


FAILED:  org.apache.maven.archetype.creator.DefaultArchetypeCreatorIT.testExcludePatternsContainingFilesSameExtension

Error Message:
Error while executing process.

Stack Trace:
org.codehaus.plexus.util.cli.CommandLineException: Error while executing process.
	at org.apache.maven.archetype.creator.DefaultArchetypeCreatorIT.createFilesetArchetype(DefaultArchetypeCreatorIT.java:136)
	at org.apache.maven.archetype.creator.DefaultArchetypeCreatorIT.testExcludePatternsContainingFilesSameExtension(DefaultArchetypeCreatorIT.java:177)
Caused by: java.io.IOException: Cannot run program "F:\jenkins\tools\maven\apache-maven-3.5.2\bin\mvn.cmd" (in directory "F:\jenkins\jenkins-slave\workspace\ven-archetype_ARCHETYPE-553-J4FOCNZGBVSFDFI4P3DBC7GXGJK62NFN5QH7Q5I46GZ5AP3FIVLQ@2@tmp\windows-jdk10-m3.5.x_build\archetype-testing\archetype-final\target\test-classes\projects\exclude-patterns-2\target\generated-sources\archetype"): CreateProcess error=267, The directory name is invalid
	at org.apache.maven.archetype.creator.DefaultArchetypeCreatorIT.createFilesetArchetype(DefaultArchetypeCreatorIT.java:136)
	at org.apache.maven.archetype.creator.DefaultArchetypeCreatorIT.testExcludePatternsContainingFilesSameExtension(DefaultArchetypeCreatorIT.java:177)
Caused by: java.io.IOException: CreateProcess error=267, The directory name is invalid
	at org.apache.maven.archetype.creator.DefaultArchetypeCreatorIT.createFilesetArchetype(DefaultArchetypeCreatorIT.java:136)
	at org.apache.maven.archetype.creator.DefaultArchetypeCreatorIT.testExcludePatternsContainingFilesSameExtension(DefaultArchetypeCreatorIT.java:177)


FAILED:  org.apache.maven.archetype.creator.DefaultArchetypeCreatorIT.testChangeJavaFilenameWhenCustomPropertyEqualsClassName

Error Message:
Error while executing process.

Stack Trace:
org.codehaus.plexus.util.cli.CommandLineException: Error while executing process.
	at org.apache.maven.archetype.creator.DefaultArchetypeCreatorIT.createFilesetArchetype(DefaultArchetypeCreatorIT.java:136)
	at org.apache.maven.archetype.creator.DefaultArchetypeCreatorIT.testChangeJavaFilenameWhenCustomPropertyEqualsClassName(DefaultArchetypeCreatorIT.java:151)
Caused by: java.io.IOException: Cannot run program "F:\jenkins\tools\maven\apache-maven-3.5.2\bin\mvn.cmd" (in directory "F:\jenkins\jenkins-slave\workspace\ven-archetype_ARCHETYPE-553-J4FOCNZGBVSFDFI4P3DBC7GXGJK62NFN5QH7Q5I46GZ5AP3FIVLQ@2@tmp\windows-jdk10-m3.5.x_build\archetype-testing\archetype-final\target\test-classes\projects\change-file-with-property\target\generated-sources\archetype"): CreateProcess error=267, The directory name is invalid
	at org.apache.maven.archetype.creator.DefaultArchetypeCreatorIT.createFilesetArchetype(DefaultArchetypeCreatorIT.java:136)
	at org.apache.maven.archetype.creator.DefaultArchetypeCreatorIT.testChangeJavaFilenameWhenCustomPropertyEqualsClassName(DefaultArchetypeCreatorIT.java:151)
Caused by: java.io.IOException: CreateProcess error=267, The directory name is invalid
	at org.apache.maven.archetype.creator.DefaultArchetypeCreatorIT.createFilesetArchetype(DefaultArchetypeCreatorIT.java:136)
	at org.apache.maven.archetype.creator.DefaultArchetypeCreatorIT.testChangeJavaFilenameWhenCustomPropertyEqualsClassName(DefaultArchetypeCreatorIT.java:151)


FAILED:  org.apache.maven.archetype.creator.DefaultArchetypeCreatorIT.testIncludeFileWithNoExtension

Error Message:
Error while executing process.

Stack Trace:
org.codehaus.plexus.util.cli.CommandLineException: Error while executing process.
	at org.apache.maven.archetype.creator.DefaultArchetypeCreatorIT.createFilesetArchetype(DefaultArchetypeCreatorIT.java:136)
	at org.apache.maven.archetype.creator.DefaultArchetypeCreatorIT.testIncludeFileWithNoExtension(DefaultArchetypeCreatorIT.java:189)
Caused by: java.io.IOException: Cannot run program "F:\jenkins\tools\maven\apache-maven-3.5.2\bin\mvn.cmd" (in directory "F:\jenkins\jenkins-slave\workspace\ven-archetype_ARCHETYPE-553-J4FOCNZGBVSFDFI4P3DBC7GXGJK62NFN5QH7Q5I46GZ5AP3FIVLQ@tmp@9\windows-jdk7-m3.5.x_build\archetype-testing\archetype-final\target\test-classes\projects\include-file-with-no-extension\target\generated-sources\archetype"): CreateProcess error=267, The directory name is invalid
	at org.apache.maven.archetype.creator.DefaultArchetypeCreatorIT.createFilesetArchetype(DefaultArchetypeCreatorIT.java:136)
	at org.apache.maven.archetype.creator.DefaultArchetypeCreatorIT.testIncludeFileWithNoExtension(DefaultArchetypeCreatorIT.java:189)
Caused by: java.io.IOException: CreateProcess error=267, The directory name is invalid
	at org.apache.maven.archetype.creator.DefaultArchetypeCreatorIT.createFilesetArchetype(DefaultArchetypeCreatorIT.java:136)
	at org.apache.maven.archetype.creator.DefaultArchetypeCreatorIT.testIncludeFileWithNoExtension(DefaultArchetypeCreatorIT.java:189)


FAILED:  org.apache.maven.archetype.creator.DefaultArchetypeCreatorIT.testSystemPropertiesAreIncluded

Error Message:
Error while executing process.

Stack Trace:
org.codehaus.plexus.util.cli.CommandLineException: Error while executing process.
	at org.apache.maven.archetype.creator.DefaultArchetypeCreatorIT.createFilesetArchetype(DefaultArchetypeCreatorIT.java:136)
	at org.apache.maven.archetype.creator.DefaultArchetypeCreatorIT.testSystemPropertiesAreIncluded(DefaultArchetypeCreatorIT.java:200)
Caused by: java.io.IOException: Cannot run program "F:\jenkins\tools\maven\apache-maven-3.5.2\bin\mvn.cmd" (in directory "F:\jenkins\jenkins-slave\workspace\ven-archetype_ARCHETYPE-553-J4FOCNZGBVSFDFI4P3DBC7GXGJK62NFN5QH7Q5I46GZ5AP3FIVLQ@tmp@9\windows-jdk7-m3.5.x_build\archetype-testing\archetype-final\target\test-classes\projects\included-system-properties\target\generated-sources\archetype"): CreateProcess error=267, The directory name is invalid
	at org.apache.maven.archetype.creator.DefaultArchetypeCreatorIT.createFilesetArchetype(DefaultArchetypeCreatorIT.java:136)
	at org.apache.maven.archetype.creator.DefaultArchetypeCreatorIT.testSystemPropertiesAreIncluded(DefaultArchetypeCreatorIT.java:200)
Caused by: java.io.IOException: CreateProcess error=267, The directory name is invalid
	at org.apache.maven.archetype.creator.DefaultArchetypeCreatorIT.createFilesetArchetype(DefaultArchetypeCreatorIT.java:136)
	at org.apache.maven.archetype.creator.DefaultArchetypeCreatorIT.testSystemPropertiesAreIncluded(DefaultArchetypeCreatorIT.java:200)


FAILED:  org.apache.maven.archetype.creator.DefaultArchetypeCreatorIT.testExcludePatternsMustExcludeDirectory

Error Message:
Error while executing process.

Stack Trace:
org.codehaus.plexus.util.cli.CommandLineException: Error while executing process.
	at org.apache.maven.archetype.creator.DefaultArchetypeCreatorIT.createFilesetArchetype(DefaultArchetypeCreatorIT.java:136)
	at org.apache.maven.archetype.creator.DefaultArchetypeCreatorIT.testExcludePatternsMustExcludeDirectory(DefaultArchetypeCreatorIT.java:163)
Caused by: java.io.IOException: Cannot run program "F:\jenkins\tools\maven\apache-maven-3.5.2\bin\mvn.cmd" (in directory "F:\jenkins\jenkins-slave\workspace\ven-archetype_ARCHETYPE-553-J4FOCNZGBVSFDFI4P3DBC7GXGJK62NFN5QH7Q5I46GZ5AP3FIVLQ@tmp@9\windows-jdk7-m3.5.x_build\archetype-testing\archetype-final\target\test-classes\projects\exclude-patterns\target\generated-sources\archetype"): CreateProcess error=267, The directory name is invalid
	at org.apache.maven.archetype.creator.DefaultArchetypeCreatorIT.createFilesetArchetype(DefaultArchetypeCreatorIT.java:136)
	at org.apache.maven.archetype.creator.DefaultArchetypeCreatorIT.testExcludePatternsMustExcludeDirectory(DefaultArchetypeCreatorIT.java:163)
Caused by: java.io.IOException: CreateProcess error=267, The directory name is invalid
	at org.apache.maven.archetype.creator.DefaultArchetypeCreatorIT.createFilesetArchetype(DefaultArchetypeCreatorIT.java:136)
	at org.apache.maven.archetype.creator.DefaultArchetypeCreatorIT.testExcludePatternsMustExcludeDirectory(DefaultArchetypeCreatorIT.java:163)


FAILED:  org.apache.maven.archetype.creator.DefaultArchetypeCreatorIT.testExcludePatternsContainingFilesSameExtension

Error Message:
Error while executing process.

Stack Trace:
org.codehaus.plexus.util.cli.CommandLineException: Error while executing process.
	at org.apache.maven.archetype.creator.DefaultArchetypeCreatorIT.createFilesetArchetype(DefaultArchetypeCreatorIT.java:136)
	at org.apache.maven.archetype.creator.DefaultArchetypeCreatorIT.testExcludePatternsContainingFilesSameExtension(DefaultArchetypeCreatorIT.java:177)
Caused by: java.io.IOException: Cannot run program "F:\jenkins\tools\maven\apache-maven-3.5.2\bin\mvn.cmd" (in directory "F:\jenkins\jenkins-slave\workspace\ven-archetype_ARCHETYPE-553-J4FOCNZGBVSFDFI4P3DBC7GXGJK62NFN5QH7Q5I46GZ5AP3FIVLQ@tmp@9\windows-jdk7-m3.5.x_build\archetype-testing\archetype-final\target\test-classes\projects\exclude-patterns-2\target\generated-sources\archetype"): CreateProcess error=267, The directory name is invalid
	at org.apache.maven.archetype.creator.DefaultArchetypeCreatorIT.createFilesetArchetype(DefaultArchetypeCreatorIT.java:136)
	at org.apache.maven.archetype.creator.DefaultArchetypeCreatorIT.testExcludePatternsContainingFilesSameExtension(DefaultArchetypeCreatorIT.java:177)
Caused by: java.io.IOException: CreateProcess error=267, The directory name is invalid
	at org.apache.maven.archetype.creator.DefaultArchetypeCreatorIT.createFilesetArchetype(DefaultArchetypeCreatorIT.java:136)
	at org.apache.maven.archetype.creator.DefaultArchetypeCreatorIT.testExcludePatternsContainingFilesSameExtension(DefaultArchetypeCreatorIT.java:177)


FAILED:  org.apache.maven.archetype.creator.DefaultArchetypeCreatorIT.testChangeJavaFilenameWhenCustomPropertyEqualsClassName

Error Message:
Error while executing process.

Stack Trace:
org.codehaus.plexus.util.cli.CommandLineException: Error while executing process.
	at org.apache.maven.archetype.creator.DefaultArchetypeCreatorIT.createFilesetArchetype(DefaultArchetypeCreatorIT.java:136)
	at org.apache.maven.archetype.creator.DefaultArchetypeCreatorIT.testChangeJavaFilenameWhenCustomPropertyEqualsClassName(DefaultArchetypeCreatorIT.java:151)
Caused by: java.io.IOException: Cannot run program "F:\jenkins\tools\maven\apache-maven-3.5.2\bin\mvn.cmd" (in directory "F:\jenkins\jenkins-slave\workspace\ven-archetype_ARCHETYPE-553-J4FOCNZGBVSFDFI4P3DBC7GXGJK62NFN5QH7Q5I46GZ5AP3FIVLQ@tmp@9\windows-jdk7-m3.5.x_build\archetype-testing\archetype-final\target\test-classes\projects\change-file-with-property\target\generated-sources\archetype"): CreateProcess error=267, The directory name is invalid
	at org.apache.maven.archetype.creator.DefaultArchetypeCreatorIT.createFilesetArchetype(DefaultArchetypeCreatorIT.java:136)
	at org.apache.maven.archetype.creator.DefaultArchetypeCreatorIT.testChangeJavaFilenameWhenCustomPropertyEqualsClassName(DefaultArchetypeCreatorIT.java:151)
Caused by: java.io.IOException: CreateProcess error=267, The directory name is invalid
	at org.apache.maven.archetype.creator.DefaultArchetypeCreatorIT.createFilesetArchetype(DefaultArchetypeCreatorIT.java:136)
	at org.apache.maven.archetype.creator.DefaultArchetypeCreatorIT.testChangeJavaFilenameWhenCustomPropertyEqualsClassName(DefaultArchetypeCreatorIT.java:151)


FAILED:  org.apache.maven.archetype.creator.DefaultArchetypeCreatorIT.testIncludeFileWithNoExtension

Error Message:
Error while executing process.

Stack Trace:
org.codehaus.plexus.util.cli.CommandLineException: Error while executing process.
	at org.apache.maven.archetype.creator.DefaultArchetypeCreatorIT.createFilesetArchetype(DefaultArchetypeCreatorIT.java:136)
	at org.apache.maven.archetype.creator.DefaultArchetypeCreatorIT.testIncludeFileWithNoExtension(DefaultArchetypeCreatorIT.java:189)
Caused by: java.io.IOException: Cannot run program "F:\jenkins\tools\maven\apache-maven-3.3.9\bin\mvn.cmd" (in directory "F:\jenkins\jenkins-slave\workspace\ven-archetype_ARCHETYPE-553-J4FOCNZGBVSFDFI4P3DBC7GXGJK62NFN5QH7Q5I46GZ5AP3FIVLQ@2@tmp\windows-jdk7-m3.3.x_build\archetype-testing\archetype-final\target\test-classes\projects\include-file-with-no-extension\target\generated-sources\archetype"): CreateProcess error=267, The directory name is invalid
	at org.apache.maven.archetype.creator.DefaultArchetypeCreatorIT.createFilesetArchetype(DefaultArchetypeCreatorIT.java:136)
	at org.apache.maven.archetype.creator.DefaultArchetypeCreatorIT.testIncludeFileWithNoExtension(DefaultArchetypeCreatorIT.java:189)
Caused by: java.io.IOException: CreateProcess error=267, The directory name is invalid
	at org.apache.maven.archetype.creator.DefaultArchetypeCreatorIT.createFilesetArchetype(DefaultArchetypeCreatorIT.java:136)
	at org.apache.maven.archetype.creator.DefaultArchetypeCreatorIT.testIncludeFileWithNoExtension(DefaultArchetypeCreatorIT.java:189)


FAILED:  org.apache.maven.archetype.creator.DefaultArchetypeCreatorIT.testSystemPropertiesAreIncluded

Error Message:
Error while executing process.

Stack Trace:
org.codehaus.plexus.util.cli.CommandLineException: Error while executing process.
	at org.apache.maven.archetype.creator.DefaultArchetypeCreatorIT.createFilesetArchetype(DefaultArchetypeCreatorIT.java:136)
	at org.apache.maven.archetype.creator.DefaultArchetypeCreatorIT.testSystemPropertiesAreIncluded(DefaultArchetypeCreatorIT.java:200)
Caused by: java.io.IOException: Cannot run program "F:\jenkins\tools\maven\apache-maven-3.3.9\bin\mvn.cmd" (in directory "F:\jenkins\jenkins-slave\workspace\ven-archetype_ARCHETYPE-553-J4FOCNZGBVSFDFI4P3DBC7GXGJK62NFN5QH7Q5I46GZ5AP3FIVLQ@2@tmp\windows-jdk7-m3.3.x_build\archetype-testing\archetype-final\target\test-classes\projects\included-system-properties\target\generated-sources\archetype"): CreateProcess error=267, The directory name is invalid
	at org.apache.maven.archetype.creator.DefaultArchetypeCreatorIT.createFilesetArchetype(DefaultArchetypeCreatorIT.java:136)
	at org.apache.maven.archetype.creator.DefaultArchetypeCreatorIT.testSystemPropertiesAreIncluded(DefaultArchetypeCreatorIT.java:200)
Caused by: java.io.IOException: CreateProcess error=267, The directory name is invalid
	at org.apache.maven.archetype.creator.DefaultArchetypeCreatorIT.createFilesetArchetype(DefaultArchetypeCreatorIT.java:136)
	at org.apache.maven.archetype.creator.DefaultArchetypeCreatorIT.testSystemPropertiesAreIncluded(DefaultArchetypeCreatorIT.java:200)


FAILED:  org.apache.maven.archetype.creator.DefaultArchetypeCreatorIT.testExcludePatternsMustExcludeDirectory

Error Message:
Error while executing process.

Stack Trace:
org.codehaus.plexus.util.cli.CommandLineException: Error while executing process.
	at org.apache.maven.archetype.creator.DefaultArchetypeCreatorIT.createFilesetArchetype(DefaultArchetypeCreatorIT.java:136)
	at org.apache.maven.archetype.creator.DefaultArchetypeCreatorIT.testExcludePatternsMustExcludeDirectory(DefaultArchetypeCreatorIT.java:163)
Caused by: java.io.IOException: Cannot run program "F:\jenkins\tools\maven\apache-maven-3.3.9\bin\mvn.cmd" (in directory "F:\jenkins\jenkins-slave\workspace\ven-archetype_ARCHETYPE-553-J4FOCNZGBVSFDFI4P3DBC7GXGJK62NFN5QH7Q5I46GZ5AP3FIVLQ@2@tmp\windows-jdk7-m3.3.x_build\archetype-testing\archetype-final\target\test-classes\projects\exclude-patterns\target\generated-sources\archetype"): CreateProcess error=267, The directory name is invalid
	at org.apache.maven.archetype.creator.DefaultArchetypeCreatorIT.createFilesetArchetype(DefaultArchetypeCreatorIT.java:136)
	at org.apache.maven.archetype.creator.DefaultArchetypeCreatorIT.testExcludePatternsMustExcludeDirectory(DefaultArchetypeCreatorIT.java:163)
Caused by: java.io.IOException: CreateProcess error=267, The directory name is invalid
	at org.apache.maven.archetype.creator.DefaultArchetypeCreatorIT.createFilesetArchetype(DefaultArchetypeCreatorIT.java:136)
	at org.apache.maven.archetype.creator.DefaultArchetypeCreatorIT.testExcludePatternsMustExcludeDirectory(DefaultArchetypeCreatorIT.java:163)


FAILED:  org.apache.maven.archetype.creator.DefaultArchetypeCreatorIT.testExcludePatternsContainingFilesSameExtension

Error Message:
Error while executing process.

Stack Trace:
org.codehaus.plexus.util.cli.CommandLineException: Error while executing process.
	at org.apache.maven.archetype.creator.DefaultArchetypeCreatorIT.createFilesetArchetype(DefaultArchetypeCreatorIT.java:136)
	at org.apache.maven.archetype.creator.DefaultArchetypeCreatorIT.testExcludePatternsContainingFilesSameExtension(DefaultArchetypeCreatorIT.java:177)
Caused by: java.io.IOException: Cannot run program "F:\jenkins\tools\maven\apache-maven-3.3.9\bin\mvn.cmd" (in directory "F:\jenkins\jenkins-slave\workspace\ven-archetype_ARCHETYPE-553-J4FOCNZGBVSFDFI4P3DBC7GXGJK62NFN5QH7Q5I46GZ5AP3FIVLQ@2@tmp\windows-jdk7-m3.3.x_build\archetype-testing\archetype-final\target\test-classes\projects\exclude-patterns-2\target\generated-sources\archetype"): CreateProcess error=267, The directory name is invalid
	at org.apache.maven.archetype.creator.DefaultArchetypeCreatorIT.createFilesetArchetype(DefaultArchetypeCreatorIT.java:136)
	at org.apache.maven.archetype.creator.DefaultArchetypeCreatorIT.testExcludePatternsContainingFilesSameExtension(DefaultArchetypeCreatorIT.java:177)
Caused by: java.io.IOException: CreateProcess error=267, The directory name is invalid
	at org.apache.maven.archetype.creator.DefaultArchetypeCreatorIT.createFilesetArchetype(DefaultArchetypeCreatorIT.java:136)
	at org.apache.maven.archetype.creator.DefaultArchetypeCreatorIT.testExcludePatternsContainingFilesSameExtension(DefaultArchetypeCreatorIT.java:177)


FAILED:  org.apache.maven.archetype.creator.DefaultArchetypeCreatorIT.testChangeJavaFilenameWhenCustomPropertyEqualsClassName

Error Message:
Error while executing process.

Stack Trace:
org.codehaus.plexus.util.cli.CommandLineException: Error while executing process.
	at org.apache.maven.archetype.creator.DefaultArchetypeCreatorIT.createFilesetArchetype(DefaultArchetypeCreatorIT.java:136)
	at org.apache.maven.archetype.creator.DefaultArchetypeCreatorIT.testChangeJavaFilenameWhenCustomPropertyEqualsClassName(DefaultArchetypeCreatorIT.java:151)
Caused by: java.io.IOException: Cannot run program "F:\jenkins\tools\maven\apache-maven-3.3.9\bin\mvn.cmd" (in directory "F:\jenkins\jenkins-slave\workspace\ven-archetype_ARCHETYPE-553-J4FOCNZGBVSFDFI4P3DBC7GXGJK62NFN5QH7Q5I46GZ5AP3FIVLQ@2@tmp\windows-jdk7-m3.3.x_build\archetype-testing\archetype-final\target\test-classes\projects\change-file-with-property\target\generated-sources\archetype"): CreateProcess error=267, The directory name is invalid
	at org.apache.maven.archetype.creator.DefaultArchetypeCreatorIT.createFilesetArchetype(DefaultArchetypeCreatorIT.java:136)
	at org.apache.maven.archetype.creator.DefaultArchetypeCreatorIT.testChangeJavaFilenameWhenCustomPropertyEqualsClassName(DefaultArchetypeCreatorIT.java:151)
Caused by: java.io.IOException: CreateProcess error=267, The directory name is invalid
	at org.apache.maven.archetype.creator.DefaultArchetypeCreatorIT.createFilesetArchetype(DefaultArchetypeCreatorIT.java:136)
	at org.apache.maven.archetype.creator.DefaultArchetypeCreatorIT.testChangeJavaFilenameWhenCustomPropertyEqualsClassName(DefaultArchetypeCreatorIT.java:151)


FAILED:  org.apache.maven.archetype.creator.DefaultArchetypeCreatorIT.testIncludeFileWithNoExtension

Error Message:
Error while executing process.

Stack Trace:
org.codehaus.plexus.util.cli.CommandLineException: Error while executing process.
	at org.apache.maven.archetype.creator.DefaultArchetypeCreatorIT.createFilesetArchetype(DefaultArchetypeCreatorIT.java:136)
	at org.apache.maven.archetype.creator.DefaultArchetypeCreatorIT.testIncludeFileWithNoExtension(DefaultArchetypeCreatorIT.java:189)
Caused by: java.io.IOException: Cannot run program "F:\jenkins\tools\maven\apache-maven-3.5.2\bin\mvn.cmd" (in directory "F:\jenkins\jenkins-slave\workspace\ven-archetype_ARCHETYPE-553-J4FOCNZGBVSFDFI4P3DBC7GXGJK62NFN5QH7Q5I46GZ5AP3FIVLQ@tmp\windows-jdk9-m3.5.x_build\archetype-testing\archetype-final\target\test-classes\projects\include-file-with-no-extension\target\generated-sources\archetype"): CreateProcess error=267, The directory name is invalid
	at org.apache.maven.archetype.creator.DefaultArchetypeCreatorIT.createFilesetArchetype(DefaultArchetypeCreatorIT.java:136)
	at org.apache.maven.archetype.creator.DefaultArchetypeCreatorIT.testIncludeFileWithNoExtension(DefaultArchetypeCreatorIT.java:189)
Caused by: java.io.IOException: CreateProcess error=267, The directory name is invalid
	at org.apache.maven.archetype.creator.DefaultArchetypeCreatorIT.createFilesetArchetype(DefaultArchetypeCreatorIT.java:136)
	at org.apache.maven.archetype.creator.DefaultArchetypeCreatorIT.testIncludeFileWithNoExtension(DefaultArchetypeCreatorIT.java:189)


FAILED:  org.apache.maven.archetype.creator.DefaultArchetypeCreatorIT.testSystemPropertiesAreIncluded

Error Message:
Error while executing process.

Stack Trace:
org.codehaus.plexus.util.cli.CommandLineException: Error while executing process.
	at org.apache.maven.archetype.creator.DefaultArchetypeCreatorIT.createFilesetArchetype(DefaultArchetypeCreatorIT.java:136)
	at org.apache.maven.archetype.creator.DefaultArchetypeCreatorIT.testSystemPropertiesAreIncluded(DefaultArchetypeCreatorIT.java:200)
Caused by: java.io.IOException: Cannot run program "F:\jenkins\tools\maven\apache-maven-3.5.2\bin\mvn.cmd" (in directory "F:\jenkins\jenkins-slave\workspace\ven-archetype_ARCHETYPE-553-J4FOCNZGBVSFDFI4P3DBC7GXGJK62NFN5QH7Q5I46GZ5AP3FIVLQ@tmp\windows-jdk9-m3.5.x_build\archetype-testing\archetype-final\target\test-classes\projects\included-system-properties\target\generated-sources\archetype"): CreateProcess error=267, The directory name is invalid
	at org.apache.maven.archetype.creator.DefaultArchetypeCreatorIT.createFilesetArchetype(DefaultArchetypeCreatorIT.java:136)
	at org.apache.maven.archetype.creator.DefaultArchetypeCreatorIT.testSystemPropertiesAreIncluded(DefaultArchetypeCreatorIT.java:200)
Caused by: java.io.IOException: CreateProcess error=267, The directory name is invalid
	at org.apache.maven.archetype.creator.DefaultArchetypeCreatorIT.createFilesetArchetype(DefaultArchetypeCreatorIT.java:136)
	at org.apache.maven.archetype.creator.DefaultArchetypeCreatorIT.testSystemPropertiesAreIncluded(DefaultArchetypeCreatorIT.java:200)


FAILED:  org.apache.maven.archetype.creator.DefaultArchetypeCreatorIT.testExcludePatternsMustExcludeDirectory

Error Message:
Error while executing process.

Stack Trace:
org.codehaus.plexus.util.cli.CommandLineException: Error while executing process.
	at org.apache.maven.archetype.creator.DefaultArchetypeCreatorIT.createFilesetArchetype(DefaultArchetypeCreatorIT.java:136)
	at org.apache.maven.archetype.creator.DefaultArchetypeCreatorIT.testExcludePatternsMustExcludeDirectory(DefaultArchetypeCreatorIT.java:163)
Caused by: java.io.IOException: Cannot run program "F:\jenkins\tools\maven\apache-maven-3.5.2\bin\mvn.cmd" (in directory "F:\jenkins\jenkins-slave\workspace\ven-archetype_ARCHETYPE-553-J4FOCNZGBVSFDFI4P3DBC7GXGJK62NFN5QH7Q5I46GZ5AP3FIVLQ@tmp\windows-jdk9-m3.5.x_build\archetype-testing\archetype-final\target\test-classes\projects\exclude-patterns\target\generated-sources\archetype"): CreateProcess error=267, The directory name is invalid
	at org.apache.maven.archetype.creator.DefaultArchetypeCreatorIT.createFilesetArchetype(DefaultArchetypeCreatorIT.java:136)
	at org.apache.maven.archetype.creator.DefaultArchetypeCreatorIT.testExcludePatternsMustExcludeDirectory(DefaultArchetypeCreatorIT.java:163)
Caused by: java.io.IOException: CreateProcess error=267, The directory name is invalid
	at org.apache.maven.archetype.creator.DefaultArchetypeCreatorIT.createFilesetArchetype(DefaultArchetypeCreatorIT.java:136)
	at org.apache.maven.archetype.creator.DefaultArchetypeCreatorIT.testExcludePatternsMustExcludeDirectory(DefaultArchetypeCreatorIT.java:163)


FAILED:  org.apache.maven.archetype.creator.DefaultArchetypeCreatorIT.testExcludePatternsContainingFilesSameExtension

Error Message:
Error while executing process.

Stack Trace:
org.codehaus.plexus.util.cli.CommandLineException: Error while executing process.
	at org.apache.maven.archetype.creator.DefaultArchetypeCreatorIT.createFilesetArchetype(DefaultArchetypeCreatorIT.java:136)
	at org.apache.maven.archetype.creator.DefaultArchetypeCreatorIT.testExcludePatternsContainingFilesSameExtension(DefaultArchetypeCreatorIT.java:177)
Caused by: java.io.IOException: Cannot run program "F:\jenkins\tools\maven\apache-maven-3.5.2\bin\mvn.cmd" (in directory "F:\jenkins\jenkins-slave\workspace\ven-archetype_ARCHETYPE-553-J4FOCNZGBVSFDFI4P3DBC7GXGJK62NFN5QH7Q5I46GZ5AP3FIVLQ@tmp\windows-jdk9-m3.5.x_build\archetype-testing\archetype-final\target\test-classes\projects\exclude-patterns-2\target\generated-sources\archetype"): CreateProcess error=267, The directory name is invalid
	at org.apache.maven.archetype.creator.DefaultArchetypeCreatorIT.createFilesetArchetype(DefaultArchetypeCreatorIT.java:136)
	at org.apache.maven.archetype.creator.DefaultArchetypeCreatorIT.testExcludePatternsContainingFilesSameExtension(DefaultArchetypeCreatorIT.java:177)
Caused by: java.io.IOException: CreateProcess error=267, The directory name is invalid
	at org.apache.maven.archetype.creator.DefaultArchetypeCreatorIT.createFilesetArchetype(DefaultArchetypeCreatorIT.java:136)
	at org.apache.maven.archetype.creator.DefaultArchetypeCreatorIT.testExcludePatternsContainingFilesSameExtension(DefaultArchetypeCreatorIT.java:177)


FAILED:  org.apache.maven.archetype.creator.DefaultArchetypeCreatorIT.testChangeJavaFilenameWhenCustomPropertyEqualsClassName

Error Message:
Error while executing process.

Stack Trace:
org.codehaus.plexus.util.cli.CommandLineException: Error while executing process.
	at org.apache.maven.archetype.creator.DefaultArchetypeCreatorIT.createFilesetArchetype(DefaultArchetypeCreatorIT.java:136)
	at org.apache.maven.archetype.creator.DefaultArchetypeCreatorIT.testChangeJavaFilenameWhenCustomPropertyEqualsClassName(DefaultArchetypeCreatorIT.java:151)
Caused by: java.io.IOException: Cannot run program "F:\jenkins\tools\maven\apache-maven-3.5.2\bin\mvn.cmd" (in directory "F:\jenkins\jenkins-slave\workspace\ven-archetype_ARCHETYPE-553-J4FOCNZGBVSFDFI4P3DBC7GXGJK62NFN5QH7Q5I46GZ5AP3FIVLQ@tmp\windows-jdk9-m3.5.x_build\archetype-testing\archetype-final\target\test-classes\projects\change-file-with-property\target\generated-sources\archetype"): CreateProcess error=267, The directory name is invalid
	at org.apache.maven.archetype.creator.DefaultArchetypeCreatorIT.createFilesetArchetype(DefaultArchetypeCreatorIT.java:136)
	at org.apache.maven.archetype.creator.DefaultArchetypeCreatorIT.testChangeJavaFilenameWhenCustomPropertyEqualsClassName(DefaultArchetypeCreatorIT.java:151)
Caused by: java.io.IOException: CreateProcess error=267, The directory name is invalid
	at org.apache.maven.archetype.creator.DefaultArchetypeCreatorIT.createFilesetArchetype(DefaultArchetypeCreatorIT.java:136)
	at org.apache.maven.archetype.creator.DefaultArchetypeCreatorIT.testChangeJavaFilenameWhenCustomPropertyEqualsClassName(DefaultArchetypeCreatorIT.java:151)


FAILED:  org.apache.maven.archetype.creator.DefaultArchetypeCreatorIT.testIncludeFileWithNoExtension

Error Message:
Error while executing process.

Stack Trace:
org.codehaus.plexus.util.cli.CommandLineException: Error while executing process.
	at org.apache.maven.archetype.creator.DefaultArchetypeCreatorIT.createFilesetArchetype(DefaultArchetypeCreatorIT.java:136)
	at org.apache.maven.archetype.creator.DefaultArchetypeCreatorIT.testIncludeFileWithNoExtension(DefaultArchetypeCreatorIT.java:189)
Caused by: java.io.IOException: Cannot run program "F:\jenkins\tools\maven\apache-maven-3.5.2\bin\mvn.cmd" (in directory "F:\jenkins\jenkins-slave\workspace\ven-archetype_ARCHETYPE-553-J4FOCNZGBVSFDFI4P3DBC7GXGJK62NFN5QH7Q5I46GZ5AP3FIVLQ@tmp@2\windows-jdk8-m3.5.x_build\archetype-testing\archetype-final\target\test-classes\projects\include-file-with-no-extension\target\generated-sources\archetype"): CreateProcess error=267, The directory name is invalid
	at org.apache.maven.archetype.creator.DefaultArchetypeCreatorIT.createFilesetArchetype(DefaultArchetypeCreatorIT.java:136)
	at org.apache.maven.archetype.creator.DefaultArchetypeCreatorIT.testIncludeFileWithNoExtension(DefaultArchetypeCreatorIT.java:189)
Caused by: java.io.IOException: CreateProcess error=267, The directory name is invalid
	at org.apache.maven.archetype.creator.DefaultArchetypeCreatorIT.createFilesetArchetype(DefaultArchetypeCreatorIT.java:136)
	at org.apache.maven.archetype.creator.DefaultArchetypeCreatorIT.testIncludeFileWithNoExtension(DefaultArchetypeCreatorIT.java:189)


FAILED:  org.apache.maven.archetype.creator.DefaultArchetypeCreatorIT.testSystemPropertiesAreIncluded

Error Message:
Error while executing process.

Stack Trace:
org.codehaus.plexus.util.cli.CommandLineException: Error while executing process.
	at org.apache.maven.archetype.creator.DefaultArchetypeCreatorIT.createFilesetArchetype(DefaultArchetypeCreatorIT.java:136)
	at org.apache.maven.archetype.creator.DefaultArchetypeCreatorIT.testSystemPropertiesAreIncluded(DefaultArchetypeCreatorIT.java:200)
Caused by: java.io.IOException: Cannot run program "F:\jenkins\tools\maven\apache-maven-3.5.2\bin\mvn.cmd" (in directory "F:\jenkins\jenkins-slave\workspace\ven-archetype_ARCHETYPE-553-J4FOCNZGBVSFDFI4P3DBC7GXGJK62NFN5QH7Q5I46GZ5AP3FIVLQ@tmp@2\windows-jdk8-m3.5.x_build\archetype-testing\archetype-final\target\test-classes\projects\included-system-properties\target\generated-sources\archetype"): CreateProcess error=267, The directory name is invalid
	at org.apache.maven.archetype.creator.DefaultArchetypeCreatorIT.createFilesetArchetype(DefaultArchetypeCreatorIT.java:136)
	at org.apache.maven.archetype.creator.DefaultArchetypeCreatorIT.testSystemPropertiesAreIncluded(DefaultArchetypeCreatorIT.java:200)
Caused by: java.io.IOException: CreateProcess error=267, The directory name is invalid
	at org.apache.maven.archetype.creator.DefaultArchetypeCreatorIT.createFilesetArchetype(DefaultArchetypeCreatorIT.java:136)
	at org.apache.maven.archetype.creator.DefaultArchetypeCreatorIT.testSystemPropertiesAreIncluded(DefaultArchetypeCreatorIT.java:200)


FAILED:  org.apache.maven.archetype.creator.DefaultArchetypeCreatorIT.testExcludePatternsMustExcludeDirectory

Error Message:
Error while executing process.

Stack Trace:
org.codehaus.plexus.util.cli.CommandLineException: Error while executing process.
	at org.apache.maven.archetype.creator.DefaultArchetypeCreatorIT.createFilesetArchetype(DefaultArchetypeCreatorIT.java:136)
	at org.apache.maven.archetype.creator.DefaultArchetypeCreatorIT.testExcludePatternsMustExcludeDirectory(DefaultArchetypeCreatorIT.java:163)
Caused by: java.io.IOException: Cannot run program "F:\jenkins\tools\maven\apache-maven-3.5.2\bin\mvn.cmd" (in directory "F:\jenkins\jenkins-slave\workspace\ven-archetype_ARCHETYPE-553-J4FOCNZGBVSFDFI4P3DBC7GXGJK62NFN5QH7Q5I46GZ5AP3FIVLQ@tmp@2\windows-jdk8-m3.5.x_build\archetype-testing\archetype-final\target\test-classes\projects\exclude-patterns\target\generated-sources\archetype"): CreateProcess error=267, The directory name is invalid
	at org.apache.maven.archetype.creator.DefaultArchetypeCreatorIT.createFilesetArchetype(DefaultArchetypeCreatorIT.java:136)
	at org.apache.maven.archetype.creator.DefaultArchetypeCreatorIT.testExcludePatternsMustExcludeDirectory(DefaultArchetypeCreatorIT.java:163)
Caused by: java.io.IOException: CreateProcess error=267, The directory name is invalid
	at org.apache.maven.archetype.creator.DefaultArchetypeCreatorIT.createFilesetArchetype(DefaultArchetypeCreatorIT.java:136)
	at org.apache.maven.archetype.creator.DefaultArchetypeCreatorIT.testExcludePatternsMustExcludeDirectory(DefaultArchetypeCreatorIT.java:163)


FAILED:  org.apache.maven.archetype.creator.DefaultArchetypeCreatorIT.testExcludePatternsContainingFilesSameExtension

Error Message:
Error while executing process.

Stack Trace:
org.codehaus.plexus.util.cli.CommandLineException: Error while executing process.
	at org.apache.maven.archetype.creator.DefaultArchetypeCreatorIT.createFilesetArchetype(DefaultArchetypeCreatorIT.java:136)
	at org.apache.maven.archetype.creator.DefaultArchetypeCreatorIT.testExcludePatternsContainingFilesSameExtension(DefaultArchetypeCreatorIT.java:177)
Caused by: java.io.IOException: Cannot run program "F:\jenkins\tools\maven\apache-maven-3.5.2\bin\mvn.cmd" (in directory "F:\jenkins\jenkins-slave\workspace\ven-archetype_ARCHETYPE-553-J4FOCNZGBVSFDFI4P3DBC7GXGJK62NFN5QH7Q5I46GZ5AP3FIVLQ@tmp@2\windows-jdk8-m3.5.x_build\archetype-testing\archetype-final\target\test-classes\projects\exclude-patterns-2\target\generated-sources\archetype"): CreateProcess error=267, The directory name is invalid
	at org.apache.maven.archetype.creator.DefaultArchetypeCreatorIT.createFilesetArchetype(DefaultArchetypeCreatorIT.java:136)
	at org.apache.maven.archetype.creator.DefaultArchetypeCreatorIT.testExcludePatternsContainingFilesSameExtension(DefaultArchetypeCreatorIT.java:177)
Caused by: java.io.IOException: CreateProcess error=267, The directory name is invalid
	at org.apache.maven.archetype.creator.DefaultArchetypeCreatorIT.createFilesetArchetype(DefaultArchetypeCreatorIT.java:136)
	at org.apache.maven.archetype.creator.DefaultArchetypeCreatorIT.testExcludePatternsContainingFilesSameExtension(DefaultArchetypeCreatorIT.java:177)


FAILED:  org.apache.maven.archetype.creator.DefaultArchetypeCreatorIT.testChangeJavaFilenameWhenCustomPropertyEqualsClassName

Error Message:
Error while executing process.

Stack Trace:
org.codehaus.plexus.util.cli.CommandLineException: Error while executing process.
	at org.apache.maven.archetype.creator.DefaultArchetypeCreatorIT.createFilesetArchetype(DefaultArchetypeCreatorIT.java:136)
	at org.apache.maven.archetype.creator.DefaultArchetypeCreatorIT.testChangeJavaFilenameWhenCustomPropertyEqualsClassName(DefaultArchetypeCreatorIT.java:151)
Caused by: java.io.IOException: Cannot run program "F:\jenkins\tools\maven\apache-maven-3.5.2\bin\mvn.cmd" (in directory "F:\jenkins\jenkins-slave\workspace\ven-archetype_ARCHETYPE-553-J4FOCNZGBVSFDFI4P3DBC7GXGJK62NFN5QH7Q5I46GZ5AP3FIVLQ@tmp@2\windows-jdk8-m3.5.x_build\archetype-testing\archetype-final\target\test-classes\projects\change-file-with-property\target\generated-sources\archetype"): CreateProcess error=267, The directory name is invalid
	at org.apache.maven.archetype.creator.DefaultArchetypeCreatorIT.createFilesetArchetype(DefaultArchetypeCreatorIT.java:136)
	at org.apache.maven.archetype.creator.DefaultArchetypeCreatorIT.testChangeJavaFilenameWhenCustomPropertyEqualsClassName(DefaultArchetypeCreatorIT.java:151)
Caused by: java.io.IOException: CreateProcess error=267, The directory name is invalid
	at org.apache.maven.archetype.creator.DefaultArchetypeCreatorIT.createFilesetArchetype(DefaultArchetypeCreatorIT.java:136)
	at org.apache.maven.archetype.creator.DefaultArchetypeCreatorIT.testChangeJavaFilenameWhenCustomPropertyEqualsClassName(DefaultArchetypeCreatorIT.java:151)


FAILED:  org.apache.maven.archetype.test.ArchetyperRoundtripIT.testArchetyper

Error Message:
Error while executing process.

Stack Trace:
org.codehaus.plexus.util.cli.CommandLineException: Error while executing process.
	at org.apache.maven.archetype.test.ArchetyperRoundtripIT.testArchetyper(ArchetyperRoundtripIT.java:121)
Caused by: java.io.IOException: Cannot run program "F:\jenkins\tools\maven\apache-maven-3.5.2\bin\mvn.cmd" (in directory "F:\jenkins\jenkins-slave\workspace\ven-archetype_ARCHETYPE-553-J4FOCNZGBVSFDFI4P3DBC7GXGJK62NFN5QH7Q5I46GZ5AP3FIVLQ@tmp@2\windows-jdk11-m3.5.x_build\archetype-testing\archetype-final\target\test-classes\projects\roundtrip-1-project\target\generated-sources\archetype"): CreateProcess error=267, The directory name is invalid
	at org.apache.maven.archetype.test.ArchetyperRoundtripIT.testArchetyper(ArchetyperRoundtripIT.java:121)
Caused by: java.io.IOException: CreateProcess error=267, The directory name is invalid
	at org.apache.maven.archetype.test.ArchetyperRoundtripIT.testArchetyper(ArchetyperRoundtripIT.java:121)


FAILED:  org.apache.maven.archetype.test.ArchetyperRoundtripIT.testArchetyper

Error Message:
Error while executing process.

Stack Trace:
org.codehaus.plexus.util.cli.CommandLineException: Error while executing process.
	at org.apache.maven.archetype.test.ArchetyperRoundtripIT.testArchetyper(ArchetyperRoundtripIT.java:121)
Caused by: java.io.IOException: Cannot run program "F:\jenkins\tools\maven\apache-maven-3.2.5\bin\mvn.bat" (in directory "F:\jenkins\jenkins-slave\workspace\ven-archetype_ARCHETYPE-553-J4FOCNZGBVSFDFI4P3DBC7GXGJK62NFN5QH7Q5I46GZ5AP3FIVLQ@tmp@3\windows-jdk7-m3.2.x_build\archetype-testing\archetype-final\target\test-classes\projects\roundtrip-1-project\target\generated-sources\archetype"): CreateProcess error=267, The directory name is invalid
	at org.apache.maven.archetype.test.ArchetyperRoundtripIT.testArchetyper(ArchetyperRoundtripIT.java:121)
Caused by: java.io.IOException: CreateProcess error=267, The directory name is invalid
	at org.apache.maven.archetype.test.ArchetyperRoundtripIT.testArchetyper(ArchetyperRoundtripIT.java:121)


FAILED:  org.apache.maven.archetype.test.ArchetyperRoundtripIT.testArchetyper

Error Message:
Error while executing process.

Stack Trace:
org.codehaus.plexus.util.cli.CommandLineException: Error while executing process.
	at org.apache.maven.archetype.test.ArchetyperRoundtripIT.testArchetyper(ArchetyperRoundtripIT.java:121)
Caused by: java.io.IOException: Cannot run program "F:\jenkins\tools\maven\apache-maven-3.5.2\bin\mvn.cmd" (in directory "F:\jenkins\jenkins-slave\workspace\ven-archetype_ARCHETYPE-553-J4FOCNZGBVSFDFI4P3DBC7GXGJK62NFN5QH7Q5I46GZ5AP3FIVLQ@2@tmp\windows-jdk10-m3.5.x_build\archetype-testing\archetype-final\target\test-classes\projects\roundtrip-1-project\target\generated-sources\archetype"): CreateProcess error=267, The directory name is invalid
	at org.apache.maven.archetype.test.ArchetyperRoundtripIT.testArchetyper(ArchetyperRoundtripIT.java:121)
Caused by: java.io.IOException: CreateProcess error=267, The directory name is invalid
	at org.apache.maven.archetype.test.ArchetyperRoundtripIT.testArchetyper(ArchetyperRoundtripIT.java:121)


FAILED:  org.apache.maven.archetype.test.ArchetyperRoundtripIT.testArchetyper

Error Message:
Error while executing process.

Stack Trace:
org.codehaus.plexus.util.cli.CommandLineException: Error while executing process.
	at org.apache.maven.archetype.test.ArchetyperRoundtripIT.testArchetyper(ArchetyperRoundtripIT.java:121)
Caused by: java.io.IOException: Cannot run program "F:\jenkins\tools\maven\apache-maven-3.5.2\bin\mvn.cmd" (in directory "F:\jenkins\jenkins-slave\workspace\ven-archetype_ARCHETYPE-553-J4FOCNZGBVSFDFI4P3DBC7GXGJK62NFN5QH7Q5I46GZ5AP3FIVLQ@tmp@9\windows-jdk7-m3.5.x_build\archetype-testing\archetype-final\target\test-classes\projects\roundtrip-1-project\target\generated-sources\archetype"): CreateProcess error=267, The directory name is invalid
	at org.apache.maven.archetype.test.ArchetyperRoundtripIT.testArchetyper(ArchetyperRoundtripIT.java:121)
Caused by: java.io.IOException: CreateProcess error=267, The directory name is invalid
	at org.apache.maven.archetype.test.ArchetyperRoundtripIT.testArchetyper(ArchetyperRoundtripIT.java:121)


FAILED:  org.apache.maven.archetype.test.ArchetyperRoundtripIT.testArchetyper

Error Message:
Error while executing process.

Stack Trace:
org.codehaus.plexus.util.cli.CommandLineException: Error while executing process.
	at org.apache.maven.archetype.test.ArchetyperRoundtripIT.testArchetyper(ArchetyperRoundtripIT.java:121)
Caused by: java.io.IOException: Cannot run program "F:\jenkins\tools\maven\apache-maven-3.3.9\bin\mvn.cmd" (in directory "F:\jenkins\jenkins-slave\workspace\ven-archetype_ARCHETYPE-553-J4FOCNZGBVSFDFI4P3DBC7GXGJK62NFN5QH7Q5I46GZ5AP3FIVLQ@2@tmp\windows-jdk7-m3.3.x_build\archetype-testing\archetype-final\target\test-classes\projects\roundtrip-1-project\target\generated-sources\archetype"): CreateProcess error=267, The directory name is invalid
	at org.apache.maven.archetype.test.ArchetyperRoundtripIT.testArchetyper(ArchetyperRoundtripIT.java:121)
Caused by: java.io.IOException: CreateProcess error=267, The directory name is invalid
	at org.apache.maven.archetype.test.ArchetyperRoundtripIT.testArchetyper(ArchetyperRoundtripIT.java:121)


FAILED:  org.apache.maven.archetype.test.ArchetyperRoundtripIT.testArchetyper

Error Message:
Error while executing process.

Stack Trace:
org.codehaus.plexus.util.cli.CommandLineException: Error while executing process.
	at org.apache.maven.archetype.test.ArchetyperRoundtripIT.testArchetyper(ArchetyperRoundtripIT.java:121)
Caused by: java.io.IOException: Cannot run program "F:\jenkins\tools\maven\apache-maven-3.5.2\bin\mvn.cmd" (in directory "F:\jenkins\jenkins-slave\workspace\ven-archetype_ARCHETYPE-553-J4FOCNZGBVSFDFI4P3DBC7GXGJK62NFN5QH7Q5I46GZ5AP3FIVLQ@tmp\windows-jdk9-m3.5.x_build\archetype-testing\archetype-final\target\test-classes\projects\roundtrip-1-project\target\generated-sources\archetype"): CreateProcess error=267, The directory name is invalid
	at org.apache.maven.archetype.test.ArchetyperRoundtripIT.testArchetyper(ArchetyperRoundtripIT.java:121)
Caused by: java.io.IOException: CreateProcess error=267, The directory name is invalid
	at org.apache.maven.archetype.test.ArchetyperRoundtripIT.testArchetyper(ArchetyperRoundtripIT.java:121)


FAILED:  org.apache.maven.archetype.test.ArchetyperRoundtripIT.testArchetyper

Error Message:
Error while executing process.

Stack Trace:
org.codehaus.plexus.util.cli.CommandLineException: Error while executing process.
	at org.apache.maven.archetype.test.ArchetyperRoundtripIT.testArchetyper(ArchetyperRoundtripIT.java:121)
Caused by: java.io.IOException: Cannot run program "F:\jenkins\tools\maven\apache-maven-3.5.2\bin\mvn.cmd" (in directory "F:\jenkins\jenkins-slave\workspace\ven-archetype_ARCHETYPE-553-J4FOCNZGBVSFDFI4P3DBC7GXGJK62NFN5QH7Q5I46GZ5AP3FIVLQ@tmp@2\windows-jdk8-m3.5.x_build\archetype-testing\archetype-final\target\test-classes\projects\roundtrip-1-project\target\generated-sources\archetype"): CreateProcess error=267, The directory name is invalid
	at org.apache.maven.archetype.test.ArchetyperRoundtripIT.testArchetyper(ArchetyperRoundtripIT.java:121)
Caused by: java.io.IOException: CreateProcess error=267, The directory name is invalid
	at org.apache.maven.archetype.test.ArchetyperRoundtripIT.testArchetyper(ArchetyperRoundtripIT.java:121)


FAILED:  org.apache.maven.archetype.test.ArchetyperRoundtripWithProxyIT.testArchetyper

Error Message:
Error while executing process.

Stack Trace:
org.codehaus.plexus.util.cli.CommandLineException: Error while executing process.
	at org.apache.maven.archetype.test.ArchetyperRoundtripWithProxyIT.testArchetyper(ArchetyperRoundtripWithProxyIT.java:126)
Caused by: java.io.IOException: Cannot run program "F:\jenkins\tools\maven\apache-maven-3.5.2\bin\mvn.cmd" (in directory "F:\jenkins\jenkins-slave\workspace\ven-archetype_ARCHETYPE-553-J4FOCNZGBVSFDFI4P3DBC7GXGJK62NFN5QH7Q5I46GZ5AP3FIVLQ@tmp@2\windows-jdk11-m3.5.x_build\archetype-testing\archetype-final\target\test-classes\projects\roundtrip-2-project\target\generated-sources\archetype"): CreateProcess error=267, The directory name is invalid
	at org.apache.maven.archetype.test.ArchetyperRoundtripWithProxyIT.testArchetyper(ArchetyperRoundtripWithProxyIT.java:126)
Caused by: java.io.IOException: CreateProcess error=267, The directory name is invalid
	at org.apache.maven.archetype.test.ArchetyperRoundtripWithProxyIT.testArchetyper(ArchetyperRoundtripWithProxyIT.java:126)


FAILED:  org.apache.maven.archetype.test.ArchetyperRoundtripWithProxyIT.testArchetyper

Error Message:
Error while executing process.

Stack Trace:
org.codehaus.plexus.util.cli.CommandLineException: Error while executing process.
	at org.apache.maven.archetype.test.ArchetyperRoundtripWithProxyIT.testArchetyper(ArchetyperRoundtripWithProxyIT.java:126)
Caused by: java.io.IOException: Cannot run program "F:\jenkins\tools\maven\apache-maven-3.2.5\bin\mvn.bat" (in directory "F:\jenkins\jenkins-slave\workspace\ven-archetype_ARCHETYPE-553-J4FOCNZGBVSFDFI4P3DBC7GXGJK62NFN5QH7Q5I46GZ5AP3FIVLQ@tmp@3\windows-jdk7-m3.2.x_build\archetype-testing\archetype-final\target\test-classes\projects\roundtrip-2-project\target\generated-sources\archetype"): CreateProcess error=267, The directory name is invalid
	at org.apache.maven.archetype.test.ArchetyperRoundtripWithProxyIT.testArchetyper(ArchetyperRoundtripWithProxyIT.java:126)
Caused by: java.io.IOException: CreateProcess error=267, The directory name is invalid
	at org.apache.maven.archetype.test.ArchetyperRoundtripWithProxyIT.testArchetyper(ArchetyperRoundtripWithProxyIT.java:126)


FAILED:  org.apache.maven.archetype.test.ArchetyperRoundtripWithProxyIT.testArchetyper

Error Message:
Error while executing process.

Stack Trace:
org.codehaus.plexus.util.cli.CommandLineException: Error while executing process.
	at org.apache.maven.archetype.test.ArchetyperRoundtripWithProxyIT.testArchetyper(ArchetyperRoundtripWithProxyIT.java:126)
Caused by: java.io.IOException: Cannot run program "F:\jenkins\tools\maven\apache-maven-3.5.2\bin\mvn.cmd" (in directory "F:\jenkins\jenkins-slave\workspace\ven-archetype_ARCHETYPE-553-J4FOCNZGBVSFDFI4P3DBC7GXGJK62NFN5QH7Q5I46GZ5AP3FIVLQ@2@tmp\windows-jdk10-m3.5.x_build\archetype-testing\archetype-final\target\test-classes\projects\roundtrip-2-project\target\generated-sources\archetype"): CreateProcess error=267, The directory name is invalid
	at org.apache.maven.archetype.test.ArchetyperRoundtripWithProxyIT.testArchetyper(ArchetyperRoundtripWithProxyIT.java:126)
Caused by: java.io.IOException: CreateProcess error=267, The directory name is invalid
	at org.apache.maven.archetype.test.ArchetyperRoundtripWithProxyIT.testArchetyper(ArchetyperRoundtripWithProxyIT.java:126)


FAILED:  org.apache.maven.archetype.test.ArchetyperRoundtripWithProxyIT.testArchetyper

Error Message:
Error while executing process.

Stack Trace:
org.codehaus.plexus.util.cli.CommandLineException: Error while executing process.
	at org.apache.maven.archetype.test.ArchetyperRoundtripWithProxyIT.testArchetyper(ArchetyperRoundtripWithProxyIT.java:126)
Caused by: java.io.IOException: Cannot run program "F:\jenkins\tools\maven\apache-maven-3.5.2\bin\mvn.cmd" (in directory "F:\jenkins\jenkins-slave\workspace\ven-archetype_ARCHETYPE-553-J4FOCNZGBVSFDFI4P3DBC7GXGJK62NFN5QH7Q5I46GZ5AP3FIVLQ@tmp@9\windows-jdk7-m3.5.x_build\archetype-testing\archetype-final\target\test-classes\projects\roundtrip-2-project\target\generated-sources\archetype"): CreateProcess error=267, The directory name is invalid
	at org.apache.maven.archetype.test.ArchetyperRoundtripWithProxyIT.testArchetyper(ArchetyperRoundtripWithProxyIT.java:126)
Caused by: java.io.IOException: CreateProcess error=267, The directory name is invalid
	at org.apache.maven.archetype.test.ArchetyperRoundtripWithProxyIT.testArchetyper(ArchetyperRoundtripWithProxyIT.java:126)


FAILED:  org.apache.maven.archetype.test.ArchetyperRoundtripWithProxyIT.testArchetyper

Error Message:
Error while executing process.

Stack Trace:
org.codehaus.plexus.util.cli.CommandLineException: Error while executing process.
	at org.apache.maven.archetype.test.ArchetyperRoundtripWithProxyIT.testArchetyper(ArchetyperRoundtripWithProxyIT.java:126)
Caused by: java.io.IOException: Cannot run program "F:\jenkins\tools\maven\apache-maven-3.3.9\bin\mvn.cmd" (in directory "F:\jenkins\jenkins-slave\workspace\ven-archetype_ARCHETYPE-553-J4FOCNZGBVSFDFI4P3DBC7GXGJK62NFN5QH7Q5I46GZ5AP3FIVLQ@2@tmp\windows-jdk7-m3.3.x_build\archetype-testing\archetype-final\target\test-classes\projects\roundtrip-2-project\target\generated-sources\archetype"): CreateProcess error=267, The directory name is invalid
	at org.apache.maven.archetype.test.ArchetyperRoundtripWithProxyIT.testArchetyper(ArchetyperRoundtripWithProxyIT.java:126)
Caused by: java.io.IOException: CreateProcess error=267, The directory name is invalid
	at org.apache.maven.archetype.test.ArchetyperRoundtripWithProxyIT.testArchetyper(ArchetyperRoundtripWithProxyIT.java:126)


FAILED:  org.apache.maven.archetype.test.ArchetyperRoundtripWithProxyIT.testArchetyper

Error Message:
Error while executing process.

Stack Trace:
org.codehaus.plexus.util.cli.CommandLineException: Error while executing process.
	at org.apache.maven.archetype.test.ArchetyperRoundtripWithProxyIT.testArchetyper(ArchetyperRoundtripWithProxyIT.java:126)
Caused by: java.io.IOException: Cannot run program "F:\jenkins\tools\maven\apache-maven-3.5.2\bin\mvn.cmd" (in directory "F:\jenkins\jenkins-slave\workspace\ven-archetype_ARCHETYPE-553-J4FOCNZGBVSFDFI4P3DBC7GXGJK62NFN5QH7Q5I46GZ5AP3FIVLQ@tmp\windows-jdk9-m3.5.x_build\archetype-testing\archetype-final\target\test-classes\projects\roundtrip-2-project\target\generated-sources\archetype"): CreateProcess error=267, The directory name is invalid
	at org.apache.maven.archetype.test.ArchetyperRoundtripWithProxyIT.testArchetyper(ArchetyperRoundtripWithProxyIT.java:126)
Caused by: java.io.IOException: CreateProcess error=267, The directory name is invalid
	at org.apache.maven.archetype.test.ArchetyperRoundtripWithProxyIT.testArchetyper(ArchetyperRoundtripWithProxyIT.java:126)


FAILED:  org.apache.maven.archetype.test.ArchetyperRoundtripWithProxyIT.testArchetyper

Error Message:
Error while executing process.

Stack Trace:
org.codehaus.plexus.util.cli.CommandLineException: Error while executing process.
	at org.apache.maven.archetype.test.ArchetyperRoundtripWithProxyIT.testArchetyper(ArchetyperRoundtripWithProxyIT.java:126)
Caused by: java.io.IOException: Cannot run program "F:\jenkins\tools\maven\apache-maven-3.5.2\bin\mvn.cmd" (in directory "F:\jenkins\jenkins-slave\workspace\ven-archetype_ARCHETYPE-553-J4FOCNZGBVSFDFI4P3DBC7GXGJK62NFN5QH7Q5I46GZ5AP3FIVLQ@tmp@2\windows-jdk8-m3.5.x_build\archetype-testing\archetype-final\target\test-classes\projects\roundtrip-2-project\target\generated-sources\archetype"): CreateProcess error=267, The directory name is invalid
	at org.apache.maven.archetype.test.ArchetyperRoundtripWithProxyIT.testArchetyper(ArchetyperRoundtripWithProxyIT.java:126)
Caused by: java.io.IOException: CreateProcess error=267, The directory name is invalid
	at org.apache.maven.archetype.test.ArchetyperRoundtripWithProxyIT.testArchetyper(ArchetyperRoundtripWithProxyIT.java:126)


FAILED:  org.apache.maven.archetype.test.RoundtripMultiModuleIT.testArchetyper

Error Message:
Error while executing process.

Stack Trace:
org.codehaus.plexus.util.cli.CommandLineException: Error while executing process.
	at org.apache.maven.archetype.test.RoundtripMultiModuleIT.testArchetyper(RoundtripMultiModuleIT.java:126)
Caused by: java.io.IOException: Cannot run program "F:\jenkins\tools\maven\apache-maven-3.5.2\bin\mvn.cmd" (in directory "F:\jenkins\jenkins-slave\workspace\ven-archetype_ARCHETYPE-553-J4FOCNZGBVSFDFI4P3DBC7GXGJK62NFN5QH7Q5I46GZ5AP3FIVLQ@tmp@2\windows-jdk11-m3.5.x_build\archetype-testing\archetype-final\target\test-classes\projects\roundtrip-multi\target\generated-sources\archetype"): CreateProcess error=267, The directory name is invalid
	at org.apache.maven.archetype.test.RoundtripMultiModuleIT.testArchetyper(RoundtripMultiModuleIT.java:126)
Caused by: java.io.IOException: CreateProcess error=267, The directory name is invalid
	at org.apache.maven.archetype.test.RoundtripMultiModuleIT.testArchetyper(RoundtripMultiModuleIT.java:126)


FAILED:  org.apache.maven.archetype.test.RoundtripMultiModuleIT.testArchetyper

Error Message:
Error while executing process.

Stack Trace:
org.codehaus.plexus.util.cli.CommandLineException: Error while executing process.
	at org.apache.maven.archetype.test.RoundtripMultiModuleIT.testArchetyper(RoundtripMultiModuleIT.java:126)
Caused by: java.io.IOException: Cannot run program "F:\jenkins\tools\maven\apache-maven-3.2.5\bin\mvn.bat" (in directory "F:\jenkins\jenkins-slave\workspace\ven-archetype_ARCHETYPE-553-J4FOCNZGBVSFDFI4P3DBC7GXGJK62NFN5QH7Q5I46GZ5AP3FIVLQ@tmp@3\windows-jdk7-m3.2.x_build\archetype-testing\archetype-final\target\test-classes\projects\roundtrip-multi\target\generated-sources\archetype"): CreateProcess error=267, The directory name is invalid
	at org.apache.maven.archetype.test.RoundtripMultiModuleIT.testArchetyper(RoundtripMultiModuleIT.java:126)
Caused by: java.io.IOException: CreateProcess error=267, The directory name is invalid
	at org.apache.maven.archetype.test.RoundtripMultiModuleIT.testArchetyper(RoundtripMultiModuleIT.java:126)


FAILED:  org.apache.maven.archetype.test.RoundtripMultiModuleIT.testArchetyper

Error Message:
Error while executing process.

Stack Trace:
org.codehaus.plexus.util.cli.CommandLineException: Error while executing process.
	at org.apache.maven.archetype.test.RoundtripMultiModuleIT.testArchetyper(RoundtripMultiModuleIT.java:126)
Caused by: java.io.IOException: Cannot run program "F:\jenkins\tools\maven\apache-maven-3.5.2\bin\mvn.cmd" (in directory "F:\jenkins\jenkins-slave\workspace\ven-archetype_ARCHETYPE-553-J4FOCNZGBVSFDFI4P3DBC7GXGJK62NFN5QH7Q5I46GZ5AP3FIVLQ@2@tmp\windows-jdk10-m3.5.x_build\archetype-testing\archetype-final\target\test-classes\projects\roundtrip-multi\target\generated-sources\archetype"): CreateProcess error=267, The directory name is invalid
	at org.apache.maven.archetype.test.RoundtripMultiModuleIT.testArchetyper(RoundtripMultiModuleIT.java:126)
Caused by: java.io.IOException: CreateProcess error=267, The directory name is invalid
	at org.apache.maven.archetype.test.RoundtripMultiModuleIT.testArchetyper(RoundtripMultiModuleIT.java:126)


FAILED:  org.apache.maven.archetype.test.RoundtripMultiModuleIT.testArchetyper

Error Message:
Error while executing process.

Stack Trace:
org.codehaus.plexus.util.cli.CommandLineException: Error while executing process.
	at org.apache.maven.archetype.test.RoundtripMultiModuleIT.testArchetyper(RoundtripMultiModuleIT.java:126)
Caused by: java.io.IOException: Cannot run program "F:\jenkins\tools\maven\apache-maven-3.5.2\bin\mvn.cmd" (in directory "F:\jenkins\jenkins-slave\workspace\ven-archetype_ARCHETYPE-553-J4FOCNZGBVSFDFI4P3DBC7GXGJK62NFN5QH7Q5I46GZ5AP3FIVLQ@tmp@9\windows-jdk7-m3.5.x_build\archetype-testing\archetype-final\target\test-classes\projects\roundtrip-multi\target\generated-sources\archetype"): CreateProcess error=267, The directory name is invalid
	at org.apache.maven.archetype.test.RoundtripMultiModuleIT.testArchetyper(RoundtripMultiModuleIT.java:126)
Caused by: java.io.IOException: CreateProcess error=267, The directory name is invalid
	at org.apache.maven.archetype.test.RoundtripMultiModuleIT.testArchetyper(RoundtripMultiModuleIT.java:126)


FAILED:  org.apache.maven.archetype.test.RoundtripMultiModuleIT.testArchetyper

Error Message:
Error while executing process.

Stack Trace:
org.codehaus.plexus.util.cli.CommandLineException: Error while executing process.
	at org.apache.maven.archetype.test.RoundtripMultiModuleIT.testArchetyper(RoundtripMultiModuleIT.java:126)
Caused by: java.io.IOException: Cannot run program "F:\jenkins\tools\maven\apache-maven-3.3.9\bin\mvn.cmd" (in directory "F:\jenkins\jenkins-slave\workspace\ven-archetype_ARCHETYPE-553-J4FOCNZGBVSFDFI4P3DBC7GXGJK62NFN5QH7Q5I46GZ5AP3FIVLQ@2@tmp\windows-jdk7-m3.3.x_build\archetype-testing\archetype-final\target\test-classes\projects\roundtrip-multi\target\generated-sources\archetype"): CreateProcess error=267, The directory name is invalid
	at org.apache.maven.archetype.test.RoundtripMultiModuleIT.testArchetyper(RoundtripMultiModuleIT.java:126)
Caused by: java.io.IOException: CreateProcess error=267, The directory name is invalid
	at org.apache.maven.archetype.test.RoundtripMultiModuleIT.testArchetyper(RoundtripMultiModuleIT.java:126)


FAILED:  org.apache.maven.archetype.test.RoundtripMultiModuleIT.testArchetyper

Error Message:
Error while executing process.

Stack Trace:
org.codehaus.plexus.util.cli.CommandLineException: Error while executing process.
	at org.apache.maven.archetype.test.RoundtripMultiModuleIT.testArchetyper(RoundtripMultiModuleIT.java:126)
Caused by: java.io.IOException: Cannot run program "F:\jenkins\tools\maven\apache-maven-3.5.2\bin\mvn.cmd" (in directory "F:\jenkins\jenkins-slave\workspace\ven-archetype_ARCHETYPE-553-J4FOCNZGBVSFDFI4P3DBC7GXGJK62NFN5QH7Q5I46GZ5AP3FIVLQ@tmp\windows-jdk9-m3.5.x_build\archetype-testing\archetype-final\target\test-classes\projects\roundtrip-multi\target\generated-sources\archetype"): CreateProcess error=267, The directory name is invalid
	at org.apache.maven.archetype.test.RoundtripMultiModuleIT.testArchetyper(RoundtripMultiModuleIT.java:126)
Caused by: java.io.IOException: CreateProcess error=267, The directory name is invalid
	at org.apache.maven.archetype.test.RoundtripMultiModuleIT.testArchetyper(RoundtripMultiModuleIT.java:126)


FAILED:  org.apache.maven.archetype.test.RoundtripMultiModuleIT.testArchetyper

Error Message:
Error while executing process.

Stack Trace:
org.codehaus.plexus.util.cli.CommandLineException: Error while executing process.
	at org.apache.maven.archetype.test.RoundtripMultiModuleIT.testArchetyper(RoundtripMultiModuleIT.java:126)
Caused by: java.io.IOException: Cannot run program "F:\jenkins\tools\maven\apache-maven-3.5.2\bin\mvn.cmd" (in directory "F:\jenkins\jenkins-slave\workspace\ven-archetype_ARCHETYPE-553-J4FOCNZGBVSFDFI4P3DBC7GXGJK62NFN5QH7Q5I46GZ5AP3FIVLQ@tmp@2\windows-jdk8-m3.5.x_build\archetype-testing\archetype-final\target\test-classes\projects\roundtrip-multi\target\generated-sources\archetype"): CreateProcess error=267, The directory name is invalid
	at org.apache.maven.archetype.test.RoundtripMultiModuleIT.testArchetyper(RoundtripMultiModuleIT.java:126)
Caused by: java.io.IOException: CreateProcess error=267, The directory name is invalid
	at org.apache.maven.archetype.test.RoundtripMultiModuleIT.testArchetyper(RoundtripMultiModuleIT.java:126)




Build log:
[...truncated 9.53 MB...]
[linux-jdk9-m3.5.x_build] None of the test reports contained any result
[linux-jdk9-m3.5.x_build] [withMaven] junitPublisher - Archive test results for Maven artifact org.apache.maven.archetype:archetype-proxy:3.0.2-SNAPSHOT generated by maven-surefire-plugin:test (default-test): linux-jdk9-m3.5.x_build/archetype-testing/archetype-proxy/target/surefire-reports/*.xml
[linux-jdk9-m3.5.x_build] Recording test results
[linux-jdk9-m3.5.x_build] None of the test reports contained any result
[linux-jdk9-m3.5.x_build] [withMaven] junitPublisher - Archive test results for Maven artifact org.apache.maven.archetype:archetype-common:3.0.2-SNAPSHOT generated by maven-surefire-plugin:test (default-test): linux-jdk9-m3.5.x_build/archetype-common/target/surefire-reports/*.xml
[linux-jdk9-m3.5.x_build] Recording test results
[linux-jdk9-m3.5.x_build] [withMaven] junitPublisher - Archive test results for Maven artifact org.apache.maven.archetype:archetype-packaging:3.0.2-SNAPSHOT generated by maven-surefire-plugin:test (default-test): linux-jdk9-m3.5.x_build/archetype-packaging/target/surefire-reports/*.xml
[linux-jdk9-m3.5.x_build] Recording test results
[linux-jdk9-m3.5.x_build] None of the test reports contained any result
[linux-jdk9-m3.5.x_build] [withMaven] junitPublisher - Archive test results for Maven artifact org.apache.maven.plugins:maven-archetype-plugin:3.0.2-SNAPSHOT generated by maven-surefire-plugin:test (default-test): linux-jdk9-m3.5.x_build/maven-archetype-plugin/target/surefire-reports/*.xml
[linux-jdk9-m3.5.x_build] Recording test results
[linux-jdk9-m3.5.x_build] [withMaven] junitPublisher - Archive test results for Maven artifact org.apache.maven.archetype:archetype-final:3.0.2-SNAPSHOT generated by maven-surefire-plugin:test (default-test): linux-jdk9-m3.5.x_build/archetype-testing/archetype-final/target/surefire-reports/*.xml
[linux-jdk9-m3.5.x_build] Recording test results
[linux-jdk9-m3.5.x_build] None of the test reports contained any result
[linux-jdk9-m3.5.x_build] [withMaven] junitPublisher - Archive test results for Maven artifact org.apache.maven.archetype:archetype-final:3.0.2-SNAPSHOT generated by maven-failsafe-plugin:integration-test (default): linux-jdk9-m3.5.x_build/archetype-testing/archetype-final/target/failsafe-reports/*.xml
[linux-jdk9-m3.5.x_build] Recording test results
[linux-jdk9-m3.5.x_build] [withMaven] openTasksPublisher - Scan Tasks for Maven artifact org.apache.maven.archetype:archetype-repository:3.0.2-SNAPSHOT in source directory linux-jdk9-m3.5.x_build/archetype-testing/archetype-repository/src/main/java
[linux-jdk9-m3.5.x_build] [withMaven] openTasksPublisher - Scan Tasks for Maven artifact org.apache.maven.archetype:archetype-proxy:3.0.2-SNAPSHOT in source directory linux-jdk9-m3.5.x_build/archetype-testing/archetype-proxy/src/main/java
[linux-jdk9-m3.5.x_build] [withMaven] openTasksPublisher - Scan Tasks for Maven artifact org.apache.maven.archetype:archetype-common:3.0.2-SNAPSHOT in source directory linux-jdk9-m3.5.x_build/archetype-common/src/main/java
[linux-jdk9-m3.5.x_build] [withMaven] openTasksPublisher - Scan Tasks for Maven artifact org.apache.maven.plugins:maven-archetype-plugin:3.0.2-SNAPSHOT in source directory linux-jdk9-m3.5.x_build/maven-archetype-plugin/src/main/java
[linux-jdk9-m3.5.x_build] [TASKS] Scanning folder '/home/jenkins/jenkins-slave/workspace/ven-archetype_ARCHETYPE-553-J4FOCNZGBVSFDFI4P3DBC7GXGJK62NFN5QH7Q5I46GZ5AP3FIVLQ@2' for files matching the pattern 'linux-jdk9-m3.5.x_build/archetype-testing/archetype-repository/src/main/java/**/*,linux-jdk9-m3.5.x_build/archetype-testing/archetype-proxy/src/main/java/**/*,linux-jdk9-m3.5.x_build/archetype-common/src/main/java/**/*,linux-jdk9-m3.5.x_build/maven-archetype-plugin/src/main/java/**/*' - excludes: null
[linux-jdk9-m3.5.x_build] [TASKS] Found 91 files to scan for tasks
[linux-jdk9-m3.5.x_build] [TASKS] Found 27 open tasks.
[linux-jdk9-m3.5.x_build] Skipping warnings blame since pipelines do not have an SCM link.%n
[linux-jdk9-m3.5.x_build] [TASKS] Computing warning deltas based on reference build #24
[Pipeline] [linux-jdk10-m3.5.x_build] }
[linux-jdk10-m3.5.x_build] [withMaven] artifactsPublisher - Archive artifact linux-jdk10-m3.5.x_build/pom.xml under org/apache/maven/archetype/maven-archetype/3.0.2-SNAPSHOT/maven-archetype-3.0.2-SNAPSHOT.pom
[linux-jdk10-m3.5.x_build] [withMaven] artifactsPublisher - Archive artifact linux-jdk10-m3.5.x_build/target/maven-archetype-3.0.2-SNAPSHOT-site.xml under org/apache/maven/archetype/maven-archetype/3.0.2-SNAPSHOT/maven-archetype-3.0.2-SNAPSHOT-site.xml
[linux-jdk10-m3.5.x_build] [withMaven] artifactsPublisher - Archive artifact linux-jdk10-m3.5.x_build/archetype-models/pom.xml under org/apache/maven/archetype/archetype-models/3.0.2-SNAPSHOT/archetype-models-3.0.2-SNAPSHOT.pom
[linux-jdk10-m3.5.x_build] [withMaven] artifactsPublisher - Archive artifact linux-jdk10-m3.5.x_build/archetype-models/target/archetype-models-3.0.2-SNAPSHOT-site.xml under org/apache/maven/archetype/archetype-models/3.0.2-SNAPSHOT/archetype-models-3.0.2-SNAPSHOT-site.xml
[linux-jdk10-m3.5.x_build] [withMaven] artifactsPublisher - Archive artifact linux-jdk10-m3.5.x_build/archetype-models/archetype-catalog/pom.xml under org/apache/maven/archetype/archetype-catalog/3.0.2-SNAPSHOT/archetype-catalog-3.0.2-SNAPSHOT.pom
[linux-jdk10-m3.5.x_build] [withMaven] artifactsPublisher - Archive artifact linux-jdk10-m3.5.x_build/archetype-models/archetype-catalog/target/archetype-catalog-3.0.2-SNAPSHOT.jar under org/apache/maven/archetype/archetype-catalog/3.0.2-SNAPSHOT/archetype-catalog-3.0.2-SNAPSHOT.jar
[linux-jdk10-m3.5.x_build] [withMaven] artifactsPublisher - Archive artifact linux-jdk10-m3.5.x_build/archetype-models/archetype-descriptor/pom.xml under org/apache/maven/archetype/archetype-descriptor/3.0.2-SNAPSHOT/archetype-descriptor-3.0.2-SNAPSHOT.pom
[linux-jdk10-m3.5.x_build] [withMaven] artifactsPublisher - Archive artifact linux-jdk10-m3.5.x_build/archetype-models/archetype-descriptor/target/archetype-descriptor-3.0.2-SNAPSHOT.jar under org/apache/maven/archetype/archetype-descriptor/3.0.2-SNAPSHOT/archetype-descriptor-3.0.2-SNAPSHOT.jar
[linux-jdk10-m3.5.x_build] [withMaven] artifactsPublisher - Archive artifact linux-jdk10-m3.5.x_build/archetype-testing/pom.xml under org/apache/maven/archetype/archetype-testing/3.0.2-SNAPSHOT/archetype-testing-3.0.2-SNAPSHOT.pom
[linux-jdk10-m3.5.x_build] [withMaven] artifactsPublisher - Archive artifact linux-jdk10-m3.5.x_build/archetype-testing/target/archetype-testing-3.0.2-SNAPSHOT-site.xml under org/apache/maven/archetype/archetype-testing/3.0.2-SNAPSHOT/archetype-testing-3.0.2-SNAPSHOT-site.xml
[linux-jdk10-m3.5.x_build] [withMaven] artifactsPublisher - Archive artifact linux-jdk10-m3.5.x_build/archetype-testing/archetype-repository/pom.xml under org/apache/maven/archetype/archetype-repository/3.0.2-SNAPSHOT/archetype-repository-3.0.2-SNAPSHOT.pom
[linux-jdk10-m3.5.x_build] [withMaven] artifactsPublisher - Archive artifact linux-jdk10-m3.5.x_build/archetype-testing/archetype-repository/target/archetype-repository-3.0.2-SNAPSHOT.war under org/apache/maven/archetype/archetype-repository/3.0.2-SNAPSHOT/archetype-repository-3.0.2-SNAPSHOT.war
[linux-jdk10-m3.5.x_build] [withMaven] artifactsPublisher - Archive artifact linux-jdk10-m3.5.x_build/archetype-testing/archetype-proxy/pom.xml under org/apache/maven/archetype/archetype-proxy/3.0.2-SNAPSHOT/archetype-proxy-3.0.2-SNAPSHOT.pom
[linux-jdk10-m3.5.x_build] [withMaven] artifactsPublisher - Archive artifact linux-jdk10-m3.5.x_build/archetype-testing/archetype-proxy/target/archetype-proxy-3.0.2-SNAPSHOT.war under org/apache/maven/archetype/archetype-proxy/3.0.2-SNAPSHOT/archetype-proxy-3.0.2-SNAPSHOT.war
[linux-jdk10-m3.5.x_build] [withMaven] artifactsPublisher - Archive artifact linux-jdk10-m3.5.x_build/archetype-common/pom.xml under org/apache/maven/archetype/archetype-common/3.0.2-SNAPSHOT/archetype-common-3.0.2-SNAPSHOT.pom
[linux-jdk10-m3.5.x_build] [withMaven] artifactsPublisher - Archive artifact linux-jdk10-m3.5.x_build/archetype-common/target/archetype-common-3.0.2-SNAPSHOT.jar under org/apache/maven/archetype/archetype-common/3.0.2-SNAPSHOT/archetype-common-3.0.2-SNAPSHOT.jar
[linux-jdk10-m3.5.x_build] [withMaven] artifactsPublisher - Archive artifact linux-jdk10-m3.5.x_build/archetype-packaging/pom.xml under org/apache/maven/archetype/archetype-packaging/3.0.2-SNAPSHOT/archetype-packaging-3.0.2-SNAPSHOT.pom
[linux-jdk10-m3.5.x_build] [withMaven] artifactsPublisher - Archive artifact linux-jdk10-m3.5.x_build/archetype-packaging/target/archetype-packaging-3.0.2-SNAPSHOT.jar under org/apache/maven/archetype/archetype-packaging/3.0.2-SNAPSHOT/archetype-packaging-3.0.2-SNAPSHOT.jar
[linux-jdk10-m3.5.x_build] [withMaven] artifactsPublisher - Archive artifact linux-jdk10-m3.5.x_build/maven-archetype-plugin/pom.xml under org/apache/maven/plugins/maven-archetype-plugin/3.0.2-SNAPSHOT/maven-archetype-plugin-3.0.2-SNAPSHOT.pom
[linux-jdk10-m3.5.x_build] [withMaven] artifactsPublisher - Archive artifact linux-jdk10-m3.5.x_build/maven-archetype-plugin/target/maven-archetype-plugin-3.0.2-SNAPSHOT.jar under org/apache/maven/plugins/maven-archetype-plugin/3.0.2-SNAPSHOT/maven-archetype-plugin-3.0.2-SNAPSHOT.jar
[linux-jdk10-m3.5.x_build] [withMaven] artifactsPublisher - Archive artifact linux-jdk10-m3.5.x_build/archetype-testing/archetype-final/pom.xml under org/apache/maven/archetype/archetype-final/3.0.2-SNAPSHOT/archetype-final-3.0.2-SNAPSHOT.pom
[linux-jdk10-m3.5.x_build] [withMaven] artifactsPublisher - Archive artifact linux-jdk10-m3.5.x_build/archetype-testing/archetype-final/target/archetype-final-3.0.2-SNAPSHOT.jar under org/apache/maven/archetype/archetype-final/3.0.2-SNAPSHOT/archetype-final-3.0.2-SNAPSHOT.jar
[linux-jdk10-m3.5.x_build] [Fast Archiver] Compressed 723.95 KB of artifacts by 35.4% relative to #24
[linux-jdk10-m3.5.x_build] [withMaven] invokerPublisher - Archive invoker results for Maven artifact MavenArtifact{org.apache.maven.plugins:maven-archetype-plugin::3.0.2-SNAPSHOT(version: 3.0.2-SNAPSHOT, snapshot:false) } generated by PluginInvocation{org.apache.maven.plugins:maven-invoker-plugin:3.1.0@run  integration-test}: linux-jdk10-m3.5.x_build/maven-archetype-plugin/target/invoker-reports/*.xml
[linux-jdk10-m3.5.x_build] performing MavenInvokerRecorder, reportsFilenamePattern:'**/linux-jdk10-m3.5.x_build/maven-archetype-plugin/target/invoker-reports/BUILD*.xml', invokerBuildDir:'**/linux-jdk10-m3.5.x_build/maven-archetype-plugin/target/it/projects'
[linux-jdk10-m3.5.x_build] Found reports:[/home/jenkins/jenkins-slave/workspace/ven-archetype_ARCHETYPE-553-J4FOCNZGBVSFDFI4P3DBC7GXGJK62NFN5QH7Q5I46GZ5AP3FIVLQ@2/linux-jdk10-m3.5.x_build/maven-archetype-plugin/target/invoker-reports/BUILD-ARCHETYPE-241_filter-directory.xml, /home/jenkins/jenkins-slave/workspace/ven-archetype_ARCHETYPE-553-J4FOCNZGBVSFDFI4P3DBC7GXGJK62NFN5QH7Q5I46GZ5AP3FIVLQ@2/linux-jdk10-m3.5.x_build/maven-archetype-plugin/target/invoker-reports/BUILD-ARCHETYPE-517_failing-goals.xml, /home/jenkins/jenkins-slave/workspace/ven-archetype_ARCHETYPE-553-J4FOCNZGBVSFDFI4P3DBC7GXGJK62NFN5QH7Q5I46GZ5AP3FIVLQ@2/linux-jdk10-m3.5.x_build/maven-archetype-plugin/target/invoker-reports/BUILD-ARCHETYPE-520_mirror.xml, /home/jenkins/jenkins-slave/workspace/ven-archetype_ARCHETYPE-553-J4FOCNZGBVSFDFI4P3DBC7GXGJK62NFN5QH7Q5I46GZ5AP3FIVLQ@2/linux-jdk10-m3.5.x_build/maven-archetype-plugin/target/invoker-reports/BUILD-ARCHETYPE-521_archetype-repo.xml, /home/jenkins/jenkins-slave/workspace/ven-archetype_ARCHETYPE-553-J4FOCNZGBVSFDFI4P3DBC7GXGJK62NFN5QH7Q5I46GZ5AP3FIVLQ@2/linux-jdk10-m3.5.x_build/maven-archetype-plugin/target/invoker-reports/BUILD-build-and-run-its.xml, /home/jenkins/jenkins-slave/workspace/ven-archetype_ARCHETYPE-553-J4FOCNZGBVSFDFI4P3DBC7GXGJK62NFN5QH7Q5I46GZ5AP3FIVLQ@2/linux-jdk10-m3.5.x_build/maven-archetype-plugin/target/invoker-reports/BUILD-build-archetype.xml, /home/jenkins/jenkins-slave/workspace/ven-archetype_ARCHETYPE-553-J4FOCNZGBVSFDFI4P3DBC7GXGJK62NFN5QH7Q5I46GZ5AP3FIVLQ@2/linux-jdk10-m3.5.x_build/maven-archetype-plugin/target/invoker-reports/BUILD-build-ignore-eol.xml, /home/jenkins/jenkins-slave/workspace/ven-archetype_ARCHETYPE-553-J4FOCNZGBVSFDFI4P3DBC7GXGJK62NFN5QH7Q5I46GZ5AP3FIVLQ@2/linux-jdk10-m3.5.x_build/maven-archetype-plugin/target/invoker-reports/BUILD-create-from-project-exclude-patterns.xml, /home/jenkins/jenkins-slave/workspace/ven-archetype_ARCHETYPE-553-J4FOCNZGBVSFDFI4P3DBC7GXGJK62NFN5QH7Q5I46GZ5AP3FIVLQ@2/linux-jdk10-m3.5.x_build/maven-archetype-plugin/target/invoker-reports/BUILD-create-from-project.xml, /home/jenkins/jenkins-slave/workspace/ven-archetype_ARCHETYPE-553-J4FOCNZGBVSFDFI4P3DBC7GXGJK62NFN5QH7Q5I46GZ5AP3FIVLQ@2/linux-jdk10-m3.5.x_build/maven-archetype-plugin/target/invoker-reports/BUILD-generate-basic.xml, /home/jenkins/jenkins-slave/workspace/ven-archetype_ARCHETYPE-553-J4FOCNZGBVSFDFI4P3DBC7GXGJK62NFN5QH7Q5I46GZ5AP3FIVLQ@2/linux-jdk10-m3.5.x_build/maven-archetype-plugin/target/invoker-reports/BUILD-property-setting-cli.xml]
[linux-jdk10-m3.5.x_build] Found logs:[/home/jenkins/jenkins-slave/workspace/ven-archetype_ARCHETYPE-553-J4FOCNZGBVSFDFI4P3DBC7GXGJK62NFN5QH7Q5I46GZ5AP3FIVLQ@2/linux-jdk10-m3.5.x_build/maven-archetype-plugin/target/it/projects/ARCHETYPE-241_filter-directory/build.log, /home/jenkins/jenkins-slave/workspace/ven-archetype_ARCHETYPE-553-J4FOCNZGBVSFDFI4P3DBC7GXGJK62NFN5QH7Q5I46GZ5AP3FIVLQ@2/linux-jdk10-m3.5.x_build/maven-archetype-plugin/target/it/projects/ARCHETYPE-517_failing-goals/build.log, /home/jenkins/jenkins-slave/workspace/ven-archetype_ARCHETYPE-553-J4FOCNZGBVSFDFI4P3DBC7GXGJK62NFN5QH7Q5I46GZ5AP3FIVLQ@2/linux-jdk10-m3.5.x_build/maven-archetype-plugin/target/it/projects/ARCHETYPE-520_mirror/build.log, /home/jenkins/jenkins-slave/workspace/ven-archetype_ARCHETYPE-553-J4FOCNZGBVSFDFI4P3DBC7GXGJK62NFN5QH7Q5I46GZ5AP3FIVLQ@2/linux-jdk10-m3.5.x_build/maven-archetype-plugin/target/it/projects/ARCHETYPE-521_archetype-repo/build.log, /home/jenkins/jenkins-slave/workspace/ven-archetype_ARCHETYPE-553-J4FOCNZGBVSFDFI4P3DBC7GXGJK62NFN5QH7Q5I46GZ5AP3FIVLQ@2/linux-jdk10-m3.5.x_build/maven-archetype-plugin/target/it/projects/build-and-run-its/build.log, /home/jenkins/jenkins-slave/workspace/ven-archetype_ARCHETYPE-553-J4FOCNZGBVSFDFI4P3DBC7GXGJK62NFN5QH7Q5I46GZ5AP3FIVLQ@2/linux-jdk10-m3.5.x_build/maven-archetype-plugin/target/it/projects/build-and-run-its/target/test-classes/projects/basic/project/project/basic/build.log, /home/jenkins/jenkins-slave/workspace/ven-archetype_ARCHETYPE-553-J4FOCNZGBVSFDFI4P3DBC7GXGJK62NFN5QH7Q5I46GZ5AP3FIVLQ@2/linux-jdk10-m3.5.x_build/maven-archetype-plugin/target/it/projects/build-archetype/build.log, /home/jenkins/jenkins-slave/workspace/ven-archetype_ARCHETYPE-553-J4FOCNZGBVSFDFI4P3DBC7GXGJK62NFN5QH7Q5I46GZ5AP3FIVLQ@2/linux-jdk10-m3.5.x_build/maven-archetype-plugin/target/it/projects/build-archetype/target/test-classes/projects/basic/project/basic/build.log, /home/jenkins/jenkins-slave/workspace/ven-archetype_ARCHETYPE-553-J4FOCNZGBVSFDFI4P3DBC7GXGJK62NFN5QH7Q5I46GZ5AP3FIVLQ@2/linux-jdk10-m3.5.x_build/maven-archetype-plugin/target/it/projects/build-ignore-eol/build.log, /home/jenkins/jenkins-slave/workspace/ven-archetype_ARCHETYPE-553-J4FOCNZGBVSFDFI4P3DBC7GXGJK62NFN5QH7Q5I46GZ5AP3FIVLQ@2/linux-jdk10-m3.5.x_build/maven-archetype-plugin/target/it/projects/build-ignore-eol/target/test-classes/projects/basic/project/basic/build.log, /home/jenkins/jenkins-slave/workspace/ven-archetype_ARCHETYPE-553-J4FOCNZGBVSFDFI4P3DBC7GXGJK62NFN5QH7Q5I46GZ5AP3FIVLQ@2/linux-jdk10-m3.5.x_build/maven-archetype-plugin/target/it/projects/create-from-project-exclude-patterns/build.log, /home/jenkins/jenkins-slave/workspace/ven-archetype_ARCHETYPE-553-J4FOCNZGBVSFDFI4P3DBC7GXGJK62NFN5QH7Q5I46GZ5AP3FIVLQ@2/linux-jdk10-m3.5.x_build/maven-archetype-plugin/target/it/projects/create-from-project-exclude-patterns/target/generated-sources/archetype/src/main/resources/archetype-resources/build.log, /home/jenkins/jenkins-slave/workspace/ven-archetype_ARCHETYPE-553-J4FOCNZGBVSFDFI4P3DBC7GXGJK62NFN5QH7Q5I46GZ5AP3FIVLQ@2/linux-jdk10-m3.5.x_build/maven-archetype-plugin/target/it/projects/create-from-project-exclude-patterns/target/generated-sources/archetype/target/classes/archetype-resources/build.log, /home/jenkins/jenkins-slave/workspace/ven-archetype_ARCHETYPE-553-J4FOCNZGBVSFDFI4P3DBC7GXGJK62NFN5QH7Q5I46GZ5AP3FIVLQ@2/linux-jdk10-m3.5.x_build/maven-archetype-plugin/target/it/projects/create-from-project/build.log, /home/jenkins/jenkins-slave/workspace/ven-archetype_ARCHETYPE-553-J4FOCNZGBVSFDFI4P3DBC7GXGJK62NFN5QH7Q5I46GZ5AP3FIVLQ@2/linux-jdk10-m3.5.x_build/maven-archetype-plugin/target/it/projects/create-from-project/target/generated-sources/archetype/src/main/resources/archetype-resources/build.log, /home/jenkins/jenkins-slave/workspace/ven-archetype_ARCHETYPE-553-J4FOCNZGBVSFDFI4P3DBC7GXGJK62NFN5QH7Q5I46GZ5AP3FIVLQ@2/linux-jdk10-m3.5.x_build/maven-archetype-plugin/target/it/projects/create-from-project/target/generated-sources/archetype/target/classes/archetype-resources/build.log, /home/jenkins/jenkins-slave/workspace/ven-archetype_ARCHETYPE-553-J4FOCNZGBVSFDFI4P3DBC7GXGJK62NFN5QH7Q5I46GZ5AP3FIVLQ@2/linux-jdk10-m3.5.x_build/maven-archetype-plugin/target/it/projects/generate-basic/build.log, /home/jenkins/jenkins-slave/workspace/ven-archetype_ARCHETYPE-553-J4FOCNZGBVSFDFI4P3DBC7GXGJK62NFN5QH7Q5I46GZ5AP3FIVLQ@2/linux-jdk10-m3.5.x_build/maven-archetype-plugin/target/it/projects/property-setting-cli/build.log]
[linux-jdk10-m3.5.x_build] Finished parsing Maven Invoker results (found 11)
[linux-jdk10-m3.5.x_build] [withMaven] junitPublisher - Archive test results for Maven artifact org.apache.maven.archetype:archetype-catalog:3.0.2-SNAPSHOT generated by maven-surefire-plugin:test (default-test): linux-jdk10-m3.5.x_build/archetype-models/archetype-catalog/target/surefire-reports/*.xml
[linux-jdk10-m3.5.x_build] Recording test results
[linux-jdk10-m3.5.x_build] None of the test reports contained any result
[linux-jdk10-m3.5.x_build] [withMaven] junitPublisher - Archive test results for Maven artifact org.apache.maven.archetype:archetype-descriptor:3.0.2-SNAPSHOT generated by maven-surefire-plugin:test (default-test): linux-jdk10-m3.5.x_build/archetype-models/archetype-descriptor/target/surefire-reports/*.xml
[linux-jdk10-m3.5.x_build] Recording test results
[linux-jdk10-m3.5.x_build] None of the test reports contained any result
[linux-jdk10-m3.5.x_build] [withMaven] junitPublisher - Archive test results for Maven artifact org.apache.maven.archetype:archetype-repository:3.0.2-SNAPSHOT generated by maven-surefire-plugin:test (default-test): linux-jdk10-m3.5.x_build/archetype-testing/archetype-repository/target/surefire-reports/*.xml
[linux-jdk10-m3.5.x_build] Recording test results
[linux-jdk10-m3.5.x_build] None of the test reports contained any result
[linux-jdk10-m3.5.x_build] [withMaven] junitPublisher - Archive test results for Maven artifact org.apache.maven.archetype:archetype-proxy:3.0.2-SNAPSHOT generated by maven-surefire-plugin:test (default-test): linux-jdk10-m3.5.x_build/archetype-testing/archetype-proxy/target/surefire-reports/*.xml
[linux-jdk10-m3.5.x_build] Recording test results
[linux-jdk10-m3.5.x_build] None of the test reports contained any result
[linux-jdk10-m3.5.x_build] [withMaven] junitPublisher - Archive test results for Maven artifact org.apache.maven.archetype:archetype-common:3.0.2-SNAPSHOT generated by maven-surefire-plugin:test (default-test): linux-jdk10-m3.5.x_build/archetype-common/target/surefire-reports/*.xml
[linux-jdk10-m3.5.x_build] Recording test results
[linux-jdk10-m3.5.x_build] [withMaven] junitPublisher - Archive test results for Maven artifact org.apache.maven.archetype:archetype-packaging:3.0.2-SNAPSHOT generated by maven-surefire-plugin:test (default-test): linux-jdk10-m3.5.x_build/archetype-packaging/target/surefire-reports/*.xml
[linux-jdk10-m3.5.x_build] Recording test results
[linux-jdk10-m3.5.x_build] None of the test reports contained any result
[linux-jdk10-m3.5.x_build] [withMaven] junitPublisher - Archive test results for Maven artifact org.apache.maven.plugins:maven-archetype-plugin:3.0.2-SNAPSHOT generated by maven-surefire-plugin:test (default-test): linux-jdk10-m3.5.x_build/maven-archetype-plugin/target/surefire-reports/*.xml
[linux-jdk10-m3.5.x_build] Recording test results
[linux-jdk10-m3.5.x_build] [withMaven] junitPublisher - Archive test results for Maven artifact org.apache.maven.archetype:archetype-final:3.0.2-SNAPSHOT generated by maven-surefire-plugin:test (default-test): linux-jdk10-m3.5.x_build/archetype-testing/archetype-final/target/surefire-reports/*.xml
[linux-jdk10-m3.5.x_build] Recording test results
[linux-jdk10-m3.5.x_build] None of the test reports contained any result
[linux-jdk10-m3.5.x_build] [withMaven] junitPublisher - Archive test results for Maven artifact org.apache.maven.archetype:archetype-final:3.0.2-SNAPSHOT generated by maven-failsafe-plugin:integration-test (default): linux-jdk10-m3.5.x_build/archetype-testing/archetype-final/target/failsafe-reports/*.xml
[linux-jdk10-m3.5.x_build] Recording test results
[linux-jdk10-m3.5.x_build] [withMaven] openTasksPublisher - Scan Tasks for Maven artifact org.apache.maven.archetype:archetype-repository:3.0.2-SNAPSHOT in source directory linux-jdk10-m3.5.x_build/archetype-testing/archetype-repository/src/main/java
[linux-jdk10-m3.5.x_build] [withMaven] openTasksPublisher - Scan Tasks for Maven artifact org.apache.maven.archetype:archetype-proxy:3.0.2-SNAPSHOT in source directory linux-jdk10-m3.5.x_build/archetype-testing/archetype-proxy/src/main/java
[linux-jdk10-m3.5.x_build] [withMaven] openTasksPublisher - Scan Tasks for Maven artifact org.apache.maven.archetype:archetype-common:3.0.2-SNAPSHOT in source directory linux-jdk10-m3.5.x_build/archetype-common/src/main/java
[linux-jdk10-m3.5.x_build] [withMaven] openTasksPublisher - Scan Tasks for Maven artifact org.apache.maven.plugins:maven-archetype-plugin:3.0.2-SNAPSHOT in source directory linux-jdk10-m3.5.x_build/maven-archetype-plugin/src/main/java
[linux-jdk10-m3.5.x_build] [TASKS] Scanning folder '/home/jenkins/jenkins-slave/workspace/ven-archetype_ARCHETYPE-553-J4FOCNZGBVSFDFI4P3DBC7GXGJK62NFN5QH7Q5I46GZ5AP3FIVLQ@2' for files matching the pattern 'linux-jdk10-m3.5.x_build/archetype-testing/archetype-repository/src/main/java/**/*,linux-jdk10-m3.5.x_build/archetype-testing/archetype-proxy/src/main/java/**/*,linux-jdk10-m3.5.x_build/archetype-common/src/main/java/**/*,linux-jdk10-m3.5.x_build/maven-archetype-plugin/src/main/java/**/*' - excludes: null
[linux-jdk10-m3.5.x_build] [TASKS] Found 91 files to scan for tasks
[linux-jdk10-m3.5.x_build] [TASKS] Found 27 open tasks.
[linux-jdk10-m3.5.x_build] Skipping warnings blame since pipelines do not have an SCM link.%n
[linux-jdk10-m3.5.x_build] [TASKS] Computing warning deltas based on reference build #24
[Pipeline] [windows-jdk8-m3.5.x_build] }
[windows-jdk8-m3.5.x_build] [withMaven] artifactsPublisher - Archive artifact windows-jdk8-m3.5.x_build\pom.xml under org\apache\maven\archetype\maven-archetype\3.0.2-SNAPSHOT\maven-archetype-3.0.2-SNAPSHOT.pom
[windows-jdk8-m3.5.x_build] [withMaven] artifactsPublisher - Archive artifact windows-jdk8-m3.5.x_build\target\maven-archetype-3.0.2-SNAPSHOT-site.xml under org\apache\maven\archetype\maven-archetype\3.0.2-SNAPSHOT\maven-archetype-3.0.2-SNAPSHOT-site.xml
[windows-jdk8-m3.5.x_build] [withMaven] artifactsPublisher - Archive artifact windows-jdk8-m3.5.x_build\archetype-models\pom.xml under org\apache\maven\archetype\archetype-models\3.0.2-SNAPSHOT\archetype-models-3.0.2-SNAPSHOT.pom
[windows-jdk8-m3.5.x_build] [withMaven] artifactsPublisher - Archive artifact windows-jdk8-m3.5.x_build\archetype-models\target\archetype-models-3.0.2-SNAPSHOT-site.xml under org\apache\maven\archetype\archetype-models\3.0.2-SNAPSHOT\archetype-models-3.0.2-SNAPSHOT-site.xml
[windows-jdk8-m3.5.x_build] [withMaven] artifactsPublisher - Archive artifact windows-jdk8-m3.5.x_build\archetype-models\archetype-catalog\pom.xml under org\apache\maven\archetype\archetype-catalog\3.0.2-SNAPSHOT\archetype-catalog-3.0.2-SNAPSHOT.pom
[windows-jdk8-m3.5.x_build] [withMaven] artifactsPublisher - Archive artifact windows-jdk8-m3.5.x_build\archetype-models\archetype-catalog\target\archetype-catalog-3.0.2-SNAPSHOT.jar under org\apache\maven\archetype\archetype-catalog\3.0.2-SNAPSHOT\archetype-catalog-3.0.2-SNAPSHOT.jar
[windows-jdk8-m3.5.x_build] [withMaven] artifactsPublisher - Archive artifact windows-jdk8-m3.5.x_build\archetype-models\archetype-descriptor\pom.xml under org\apache\maven\archetype\archetype-descriptor\3.0.2-SNAPSHOT\archetype-descriptor-3.0.2-SNAPSHOT.pom
[windows-jdk8-m3.5.x_build] [withMaven] artifactsPublisher - Archive artifact windows-jdk8-m3.5.x_build\archetype-models\archetype-descriptor\target\archetype-descriptor-3.0.2-SNAPSHOT.jar under org\apache\maven\archetype\archetype-descriptor\3.0.2-SNAPSHOT\archetype-descriptor-3.0.2-SNAPSHOT.jar
[windows-jdk8-m3.5.x_build] [withMaven] artifactsPublisher - Archive artifact windows-jdk8-m3.5.x_build\archetype-testing\pom.xml under org\apache\maven\archetype\archetype-testing\3.0.2-SNAPSHOT\archetype-testing-3.0.2-SNAPSHOT.pom
[windows-jdk8-m3.5.x_build] [withMaven] artifactsPublisher - Archive artifact windows-jdk8-m3.5.x_build\archetype-testing\target\archetype-testing-3.0.2-SNAPSHOT-site.xml under org\apache\maven\archetype\archetype-testing\3.0.2-SNAPSHOT\archetype-testing-3.0.2-SNAPSHOT-site.xml
[windows-jdk8-m3.5.x_build] [withMaven] artifactsPublisher - Archive artifact windows-jdk8-m3.5.x_build\archetype-testing\archetype-repository\pom.xml under org\apache\maven\archetype\archetype-repository\3.0.2-SNAPSHOT\archetype-repository-3.0.2-SNAPSHOT.pom
[windows-jdk8-m3.5.x_build] [withMaven] artifactsPublisher - Archive artifact windows-jdk8-m3.5.x_build\archetype-testing\archetype-repository\target\archetype-repository-3.0.2-SNAPSHOT.war under org\apache\maven\archetype\archetype-repository\3.0.2-SNAPSHOT\archetype-repository-3.0.2-SNAPSHOT.war
[windows-jdk8-m3.5.x_build] [withMaven] artifactsPublisher - Archive artifact windows-jdk8-m3.5.x_build\archetype-testing\archetype-proxy\pom.xml under org\apache\maven\archetype\archetype-proxy\3.0.2-SNAPSHOT\archetype-proxy-3.0.2-SNAPSHOT.pom
[windows-jdk8-m3.5.x_build] [withMaven] artifactsPublisher - Archive artifact windows-jdk8-m3.5.x_build\archetype-testing\archetype-proxy\target\archetype-proxy-3.0.2-SNAPSHOT.war under org\apache\maven\archetype\archetype-proxy\3.0.2-SNAPSHOT\archetype-proxy-3.0.2-SNAPSHOT.war
[windows-jdk8-m3.5.x_build] [withMaven] artifactsPublisher - Archive artifact windows-jdk8-m3.5.x_build\archetype-common\pom.xml under org\apache\maven\archetype\archetype-common\3.0.2-SNAPSHOT\archetype-common-3.0.2-SNAPSHOT.pom
[windows-jdk8-m3.5.x_build] [withMaven] artifactsPublisher - Archive artifact windows-jdk8-m3.5.x_build\archetype-common\target\archetype-common-3.0.2-SNAPSHOT.jar under org\apache\maven\archetype\archetype-common\3.0.2-SNAPSHOT\archetype-common-3.0.2-SNAPSHOT.jar
[windows-jdk8-m3.5.x_build] [withMaven] artifactsPublisher - Archive artifact windows-jdk8-m3.5.x_build\archetype-packaging\pom.xml under org\apache\maven\archetype\archetype-packaging\3.0.2-SNAPSHOT\archetype-packaging-3.0.2-SNAPSHOT.pom
[windows-jdk8-m3.5.x_build] [withMaven] artifactsPublisher - Archive artifact windows-jdk8-m3.5.x_build\archetype-packaging\target\archetype-packaging-3.0.2-SNAPSHOT.jar under org\apache\maven\archetype\archetype-packaging\3.0.2-SNAPSHOT\archetype-packaging-3.0.2-SNAPSHOT.jar
[windows-jdk8-m3.5.x_build] [withMaven] artifactsPublisher - Archive artifact windows-jdk8-m3.5.x_build\maven-archetype-plugin\pom.xml under org\apache\maven\plugins\maven-archetype-plugin\3.0.2-SNAPSHOT\maven-archetype-plugin-3.0.2-SNAPSHOT.pom
[windows-jdk8-m3.5.x_build] [withMaven] artifactsPublisher - Archive artifact windows-jdk8-m3.5.x_build\maven-archetype-plugin\target\maven-archetype-plugin-3.0.2-SNAPSHOT.jar under org\apache\maven\plugins\maven-archetype-plugin\3.0.2-SNAPSHOT\maven-archetype-plugin-3.0.2-SNAPSHOT.jar
[windows-jdk8-m3.5.x_build] [withMaven] artifactsPublisher - Archive artifact windows-jdk8-m3.5.x_build\archetype-testing\archetype-final\pom.xml under org\apache\maven\archetype\archetype-final\3.0.2-SNAPSHOT\archetype-final-3.0.2-SNAPSHOT.pom
[windows-jdk8-m3.5.x_build] [withMaven] artifactsPublisher - Archive artifact windows-jdk8-m3.5.x_build\archetype-testing\archetype-final\target\archetype-final-3.0.2-SNAPSHOT.jar under org\apache\maven\archetype\archetype-final\3.0.2-SNAPSHOT\archetype-final-3.0.2-SNAPSHOT.jar
[windows-jdk8-m3.5.x_build] [Fast Archiver] Compressed 874.78 KB of artifacts by 43.9% relative to #24
[windows-jdk8-m3.5.x_build] [withMaven] invokerPublisher - Archive invoker results for Maven artifact MavenArtifact{org.apache.maven.plugins:maven-archetype-plugin::3.0.2-SNAPSHOT(version: 3.0.2-SNAPSHOT, snapshot:false) } generated by PluginInvocation{org.apache.maven.plugins:maven-invoker-plugin:3.1.0@run  integration-test}: windows-jdk8-m3.5.x_build\maven-archetype-plugin\target\invoker-reports\*.xml
[windows-jdk8-m3.5.x_build] performing MavenInvokerRecorder, reportsFilenamePattern:'**/windows-jdk8-m3.5.x_build\maven-archetype-plugin\target\invoker-reports/BUILD*.xml', invokerBuildDir:'**/windows-jdk8-m3.5.x_build\maven-archetype-plugin\target\it\projects'
[windows-jdk8-m3.5.x_build] Found reports:[f:\jenkins\jenkins-slave\workspace\ven-archetype_ARCHETYPE-553-J4FOCNZGBVSFDFI4P3DBC7GXGJK62NFN5QH7Q5I46GZ5AP3FIVLQ@tmp@2\windows-jdk8-m3.5.x_build\maven-archetype-plugin\target\invoker-reports\BUILD-ARCHETYPE-241_filter-directory.xml, f:\jenkins\jenkins-slave\workspace\ven-archetype_ARCHETYPE-553-J4FOCNZGBVSFDFI4P3DBC7GXGJK62NFN5QH7Q5I46GZ5AP3FIVLQ@tmp@2\windows-jdk8-m3.5.x_build\maven-archetype-plugin\target\invoker-reports\BUILD-ARCHETYPE-517_failing-goals.xml, f:\jenkins\jenkins-slave\workspace\ven-archetype_ARCHETYPE-553-J4FOCNZGBVSFDFI4P3DBC7GXGJK62NFN5QH7Q5I46GZ5AP3FIVLQ@tmp@2\windows-jdk8-m3.5.x_build\maven-archetype-plugin\target\invoker-reports\BUILD-ARCHETYPE-520_mirror.xml, f:\jenkins\jenkins-slave\workspace\ven-archetype_ARCHETYPE-553-J4FOCNZGBVSFDFI4P3DBC7GXGJK62NFN5QH7Q5I46GZ5AP3FIVLQ@tmp@2\windows-jdk8-m3.5.x_build\maven-archetype-plugin\target\invoker-reports\BUILD-ARCHETYPE-521_archetype-repo.xml, f:\jenkins\jenkins-slave\workspace\ven-archetype_ARCHETYPE-553-J4FOCNZGBVSFDFI4P3DBC7GXGJK62NFN5QH7Q5I46GZ5AP3FIVLQ@tmp@2\windows-jdk8-m3.5.x_build\maven-archetype-plugin\target\invoker-reports\BUILD-build-and-run-its.xml, f:\jenkins\jenkins-slave\workspace\ven-archetype_ARCHETYPE-553-J4FOCNZGBVSFDFI4P3DBC7GXGJK62NFN5QH7Q5I46GZ5AP3FIVLQ@tmp@2\windows-jdk8-m3.5.x_build\maven-archetype-plugin\target\invoker-reports\BUILD-build-archetype.xml, f:\jenkins\jenkins-slave\workspace\ven-archetype_ARCHETYPE-553-J4FOCNZGBVSFDFI4P3DBC7GXGJK62NFN5QH7Q5I46GZ5AP3FIVLQ@tmp@2\windows-jdk8-m3.5.x_build\maven-archetype-plugin\target\invoker-reports\BUILD-build-ignore-eol.xml, f:\jenkins\jenkins-slave\workspace\ven-archetype_ARCHETYPE-553-J4FOCNZGBVSFDFI4P3DBC7GXGJK62NFN5QH7Q5I46GZ5AP3FIVLQ@tmp@2\windows-jdk8-m3.5.x_build\maven-archetype-plugin\target\invoker-reports\BUILD-create-from-project-exclude-patterns.xml, f:\jenkins\jenkins-slave\workspace\ven-archetype_ARCHETYPE-553-J4FOCNZGBVSFDFI4P3DBC7GXGJK62NFN5QH7Q5I46GZ5AP3FIVLQ@tmp@2\windows-jdk8-m3.5.x_build\maven-archetype-plugin\target\invoker-reports\BUILD-create-from-project.xml, f:\jenkins\jenkins-slave\workspace\ven-archetype_ARCHETYPE-553-J4FOCNZGBVSFDFI4P3DBC7GXGJK62NFN5QH7Q5I46GZ5AP3FIVLQ@tmp@2\windows-jdk8-m3.5.x_build\maven-archetype-plugin\target\invoker-reports\BUILD-generate-basic.xml, f:\jenkins\jenkins-slave\workspace\ven-archetype_ARCHETYPE-553-J4FOCNZGBVSFDFI4P3DBC7GXGJK62NFN5QH7Q5I46GZ5AP3FIVLQ@tmp@2\windows-jdk8-m3.5.x_build\maven-archetype-plugin\target\invoker-reports\BUILD-property-setting-cli.xml]
[windows-jdk8-m3.5.x_build] Found logs:[f:\jenkins\jenkins-slave\workspace\ven-archetype_ARCHETYPE-553-J4FOCNZGBVSFDFI4P3DBC7GXGJK62NFN5QH7Q5I46GZ5AP3FIVLQ@tmp@2\windows-jdk8-m3.5.x_build\maven-archetype-plugin\target\it\projects\ARCHETYPE-241_filter-directory\build.log, f:\jenkins\jenkins-slave\workspace\ven-archetype_ARCHETYPE-553-J4FOCNZGBVSFDFI4P3DBC7GXGJK62NFN5QH7Q5I46GZ5AP3FIVLQ@tmp@2\windows-jdk8-m3.5.x_build\maven-archetype-plugin\target\it\projects\ARCHETYPE-517_failing-goals\build.log, f:\jenkins\jenkins-slave\workspace\ven-archetype_ARCHETYPE-553-J4FOCNZGBVSFDFI4P3DBC7GXGJK62NFN5QH7Q5I46GZ5AP3FIVLQ@tmp@2\windows-jdk8-m3.5.x_build\maven-archetype-plugin\target\it\projects\ARCHETYPE-520_mirror\build.log, f:\jenkins\jenkins-slave\workspace\ven-archetype_ARCHETYPE-553-J4FOCNZGBVSFDFI4P3DBC7GXGJK62NFN5QH7Q5I46GZ5AP3FIVLQ@tmp@2\windows-jdk8-m3.5.x_build\maven-archetype-plugin\target\it\projects\ARCHETYPE-521_archetype-repo\build.log, f:\jenkins\jenkins-slave\workspace\ven-archetype_ARCHETYPE-553-J4FOCNZGBVSFDFI4P3DBC7GXGJK62NFN5QH7Q5I46GZ5AP3FIVLQ@tmp@2\windows-jdk8-m3.5.x_build\maven-archetype-plugin\target\it\projects\build-and-run-its\build.log, f:\jenkins\jenkins-slave\workspace\ven-archetype_ARCHETYPE-553-J4FOCNZGBVSFDFI4P3DBC7GXGJK62NFN5QH7Q5I46GZ5AP3FIVLQ@tmp@2\windows-jdk8-m3.5.x_build\maven-archetype-plugin\target\it\projects\build-and-run-its\target\test-classes\projects\basic\project\project\basic\build.log, f:\jenkins\jenkins-slave\workspace\ven-archetype_ARCHETYPE-553-J4FOCNZGBVSFDFI4P3DBC7GXGJK62NFN5QH7Q5I46GZ5AP3FIVLQ@tmp@2\windows-jdk8-m3.5.x_build\maven-archetype-plugin\target\it\projects\build-archetype\build.log, f:\jenkins\jenkins-slave\workspace\ven-archetype_ARCHETYPE-553-J4FOCNZGBVSFDFI4P3DBC7GXGJK62NFN5QH7Q5I46GZ5AP3FIVLQ@tmp@2\windows-jdk8-m3.5.x_build\maven-archetype-plugin\target\it\projects\build-archetype\target\test-classes\projects\basic\project\basic\build.log, f:\jenkins\jenkins-slave\workspace\ven-archetype_ARCHETYPE-553-J4FOCNZGBVSFDFI4P3DBC7GXGJK62NFN5QH7Q5I46GZ5AP3FIVLQ@tmp@2\windows-jdk8-m3.5.x_build\maven-archetype-plugin\target\it\projects\build-ignore-eol\build.log, f:\jenkins\jenkins-slave\workspace\ven-archetype_ARCHETYPE-553-J4FOCNZGBVSFDFI4P3DBC7GXGJK62NFN5QH7Q5I46GZ5AP3FIVLQ@tmp@2\windows-jdk8-m3.5.x_build\maven-archetype-plugin\target\it\projects\build-ignore-eol\target\test-classes\projects\basic\project\basic\build.log, f:\jenkins\jenkins-slave\workspace\ven-archetype_ARCHETYPE-553-J4FOCNZGBVSFDFI4P3DBC7GXGJK62NFN5QH7Q5I46GZ5AP3FIVLQ@tmp@2\windows-jdk8-m3.5.x_build\maven-archetype-plugin\target\it\projects\create-from-project-exclude-patterns\build.log, f:\jenkins\jenkins-slave\workspace\ven-archetype_ARCHETYPE-553-J4FOCNZGBVSFDFI4P3DBC7GXGJK62NFN5QH7Q5I46GZ5AP3FIVLQ@tmp@2\windows-jdk8-m3.5.x_build\maven-archetype-plugin\target\it\projects\create-from-project-exclude-patterns\target\generated-sources\archetype\src\main\resources\archetype-resources\build.log, f:\jenkins\jenkins-slave\workspace\ven-archetype_ARCHETYPE-553-J4FOCNZGBVSFDFI4P3DBC7GXGJK62NFN5QH7Q5I46GZ5AP3FIVLQ@tmp@2\windows-jdk8-m3.5.x_build\maven-archetype-plugin\target\it\projects\create-from-project\build.log, f:\jenkins\jenkins-slave\workspace\ven-archetype_ARCHETYPE-553-J4FOCNZGBVSFDFI4P3DBC7GXGJK62NFN5QH7Q5I46GZ5AP3FIVLQ@tmp@2\windows-jdk8-m3.5.x_build\maven-archetype-plugin\target\it\projects\create-from-project\target\generated-sources\archetype\src\main\resources\archetype-resources\build.log, f:\jenkins\jenkins-slave\workspace\ven-archetype_ARCHETYPE-553-J4FOCNZGBVSFDFI4P3DBC7GXGJK62NFN5QH7Q5I46GZ5AP3FIVLQ@tmp@2\windows-jdk8-m3.5.x_build\maven-archetype-plugin\target\it\projects\create-from-project\target\generated-sources\archetype\target\classes\archetype-resources\build.log, f:\jenkins\jenkins-slave\workspace\ven-archetype_ARCHETYPE-553-J4FOCNZGBVSFDFI4P3DBC7GXGJK62NFN5QH7Q5I46GZ5AP3FIVLQ@tmp@2\windows-jdk8-m3.5.x_build\maven-archetype-plugin\target\it\projects\generate-basic\build.log, f:\jenkins\jenkins-slave\workspace\ven-archetype_ARCHETYPE-553-J4FOCNZGBVSFDFI4P3DBC7GXGJK62NFN5QH7Q5I46GZ5AP3FIVLQ@tmp@2\windows-jdk8-m3.5.x_build\maven-archetype-plugin\target\it\projects\property-setting-cli\build.log]
[windows-jdk8-m3.5.x_build] Finished parsing Maven Invoker results (found 11)
[windows-jdk8-m3.5.x_build] [withMaven] junitPublisher - Archive test results for Maven artifact org.apache.maven.archetype:archetype-catalog:3.0.2-SNAPSHOT generated by maven-surefire-plugin:test (default-test): windows-jdk8-m3.5.x_build\archetype-models\archetype-catalog\target\surefire-reports\*.xml
[windows-jdk8-m3.5.x_build] Recording test results
[windows-jdk8-m3.5.x_build] None of the test reports contained any result
[windows-jdk8-m3.5.x_build] [withMaven] junitPublisher - Archive test results for Maven artifact org.apache.maven.archetype:archetype-descriptor:3.0.2-SNAPSHOT generated by maven-surefire-plugin:test (default-test): windows-jdk8-m3.5.x_build\archetype-models\archetype-descriptor\target\surefire-reports\*.xml
[windows-jdk8-m3.5.x_build] Recording test results
[windows-jdk8-m3.5.x_build] None of the test reports contained any result
[windows-jdk8-m3.5.x_build] [withMaven] junitPublisher - Archive test results for Maven artifact org.apache.maven.archetype:archetype-repository:3.0.2-SNAPSHOT generated by maven-surefire-plugin:test (default-test): windows-jdk8-m3.5.x_build\archetype-testing\archetype-repository\target\surefire-reports\*.xml
[windows-jdk8-m3.5.x_build] Recording test results
[windows-jdk8-m3.5.x_build] None of the test reports contained any result
[windows-jdk8-m3.5.x_build] [withMaven] junitPublisher - Archive test results for Maven artifact org.apache.maven.archetype:archetype-proxy:3.0.2-SNAPSHOT generated by maven-surefire-plugin:test (default-test): windows-jdk8-m3.5.x_build\archetype-testing\archetype-proxy\target\surefire-reports\*.xml
[windows-jdk8-m3.5.x_build] Recording test results
[windows-jdk8-m3.5.x_build] None of the test reports contained any result
[windows-jdk8-m3.5.x_build] [withMaven] junitPublisher - Archive test results for Maven artifact org.apache.maven.archetype:archetype-common:3.0.2-SNAPSHOT generated by maven-surefire-plugin:test (default-test): windows-jdk8-m3.5.x_build\archetype-common\target\surefire-reports\*.xml
[windows-jdk8-m3.5.x_build] Recording test results
[windows-jdk8-m3.5.x_build] [withMaven] junitPublisher - Archive test results for Maven artifact org.apache.maven.archetype:archetype-packaging:3.0.2-SNAPSHOT generated by maven-surefire-plugin:test (default-test): windows-jdk8-m3.5.x_build\archetype-packaging\target\surefire-reports\*.xml
[windows-jdk8-m3.5.x_build] Recording test results
[windows-jdk8-m3.5.x_build] None of the test reports contained any result
[windows-jdk8-m3.5.x_build] [withMaven] junitPublisher - Archive test results for Maven artifact org.apache.maven.plugins:maven-archetype-plugin:3.0.2-SNAPSHOT generated by maven-surefire-plugin:test (default-test): windows-jdk8-m3.5.x_build\maven-archetype-plugin\target\surefire-reports\*.xml
[windows-jdk8-m3.5.x_build] Recording test results
[windows-jdk8-m3.5.x_build] [withMaven] junitPublisher - Archive test results for Maven artifact org.apache.maven.archetype:archetype-final:3.0.2-SNAPSHOT generated by maven-surefire-plugin:test (default-test): windows-jdk8-m3.5.x_build\archetype-testing\archetype-final\target\surefire-reports\*.xml
[windows-jdk8-m3.5.x_build] Recording test results
[windows-jdk8-m3.5.x_build] None of the test reports contained any result
[windows-jdk8-m3.5.x_build] [withMaven] junitPublisher - Archive test results for Maven artifact org.apache.maven.archetype:archetype-final:3.0.2-SNAPSHOT generated by maven-failsafe-plugin:integration-test (default): windows-jdk8-m3.5.x_build\archetype-testing\archetype-final\target\failsafe-reports\*.xml
[windows-jdk8-m3.5.x_build] Recording test results
[windows-jdk8-m3.5.x_build] [withMaven] openTasksPublisher - Scan Tasks for Maven artifact org.apache.maven.archetype:archetype-repository:3.0.2-SNAPSHOT in source directory windows-jdk8-m3.5.x_build\archetype-testing\archetype-repository\src\main\java
[windows-jdk8-m3.5.x_build] [withMaven] openTasksPublisher - Scan Tasks for Maven artifact org.apache.maven.archetype:archetype-proxy:3.0.2-SNAPSHOT in source directory windows-jdk8-m3.5.x_build\archetype-testing\archetype-proxy\src\main\java
[windows-jdk8-m3.5.x_build] [withMaven] openTasksPublisher - Scan Tasks for Maven artifact org.apache.maven.archetype:archetype-common:3.0.2-SNAPSHOT in source directory windows-jdk8-m3.5.x_build\archetype-common\src\main\java
[windows-jdk8-m3.5.x_build] [withMaven] openTasksPublisher - Scan Tasks for Maven artifact org.apache.maven.plugins:maven-archetype-plugin:3.0.2-SNAPSHOT in source directory windows-jdk8-m3.5.x_build\maven-archetype-plugin\src\main\java
[windows-jdk8-m3.5.x_build] [TASKS] Scanning folder 'f:\jenkins\jenkins-slave\workspace\ven-archetype_ARCHETYPE-553-J4FOCNZGBVSFDFI4P3DBC7GXGJK62NFN5QH7Q5I46GZ5AP3FIVLQ@tmp@2' for files matching the pattern 'windows-jdk8-m3.5.x_build\archetype-testing\archetype-repository\src\main\java\**\*,windows-jdk8-m3.5.x_build\archetype-testing\archetype-proxy\src\main\java\**\*,windows-jdk8-m3.5.x_build\archetype-common\src\main\java\**\*,windows-jdk8-m3.5.x_build\maven-archetype-plugin\src\main\java\**\*' - excludes: null
[windows-jdk8-m3.5.x_build] [TASKS] Found 91 files to scan for tasks
[windows-jdk8-m3.5.x_build] [TASKS] Found 27 open tasks.
[windows-jdk8-m3.5.x_build] Skipping warnings blame since pipelines do not have an SCM link.%n
[windows-jdk8-m3.5.x_build] [TASKS] Computing warning deltas based on reference build #24
[Pipeline] [windows-jdk7-m3.5.x_build] }
[Pipeline] [windows-jdk10-m3.5.x_build] }
[Pipeline] [windows-jdk7-m3.2.x_build] // ws
[Pipeline] [windows-jdk9-m3.5.x_build] // withMaven
[Pipeline] [linux-jdk9-m3.5.x_build] // withMaven
[Pipeline] [linux-jdk10-m3.5.x_build] // withMaven
[Pipeline] [windows-jdk8-m3.5.x_build] // withMaven
[Pipeline] [windows-jdk7-m3.2.x_build] }
[Pipeline] [linux-jdk7-m3.3.x_build] }
[Pipeline] [windows-jdk9-m3.5.x_build] cleanWs
[Pipeline] [linux-jdk7-m3.5.x_build] }
[Pipeline] [linux-jdk8-m3.5.x_build] }
[Pipeline] [linux-jdk7-m3.2.x_build] }
[Pipeline] [linux-jdk9-m3.5.x_build] cleanWs
[Pipeline] [linux-jdk10-m3.5.x_build] cleanWs
[Pipeline] [windows-jdk7-m3.3.x_build] }
[Pipeline] [windows-jdk8-m3.5.x_build] cleanWs
[Pipeline] [windows-jdk7-m3.5.x_build] // stage
[Pipeline] [windows-jdk7-m3.5.x_build] }
[Pipeline] [windows-jdk10-m3.5.x_build] // stage
[Pipeline] [windows-jdk10-m3.5.x_build] }
[windows-jdk9-m3.5.x_build] [WS-CLEANUP] Deleting project workspace...[WS-CLEANUP] done
[Pipeline] [windows-jdk7-m3.2.x_build] // node
[windows-jdk8-m3.5.x_build] [WS-CLEANUP] Deleting project workspace...[WS-CLEANUP] done
[Pipeline] [linux-jdk7-m3.3.x_build] // stage
[Pipeline] [linux-jdk7-m3.5.x_build] // stage
[Pipeline] [linux-jdk8-m3.5.x_build] // stage
[Pipeline] [linux-jdk7-m3.2.x_build] // stage
[Pipeline] [windows-jdk7-m3.3.x_build] // stage
[Pipeline] [windows-jdk7-m3.2.x_build] }
[Pipeline] [linux-jdk7-m3.2.x_build] }
[Pipeline] [linux-jdk7-m3.3.x_build] }
[Pipeline] [linux-jdk7-m3.5.x_build] }
[Pipeline] [linux-jdk8-m3.5.x_build] }
[Pipeline] [windows-jdk7-m3.3.x_build] }
[Pipeline] [windows-jdk7-m3.5.x_build] // ws
[Pipeline] [windows-jdk7-m3.5.x_build] }
[Pipeline] [windows-jdk10-m3.5.x_build] // ws
[Pipeline] [windows-jdk10-m3.5.x_build] }
[Pipeline] [windows-jdk9-m3.5.x_build] }
[Pipeline] [windows-jdk8-m3.5.x_build] }
[Pipeline] [linux-jdk7-m3.2.x_build] // ws
[Pipeline] [linux-jdk7-m3.3.x_build] // ws
[Pipeline] [linux-jdk7-m3.5.x_build] // ws
[Pipeline] [linux-jdk8-m3.5.x_build] // ws
[Pipeline] [windows-jdk7-m3.3.x_build] // ws
[Pipeline] [linux-jdk7-m3.2.x_build] }
[Pipeline] [linux-jdk7-m3.3.x_build] }
[Pipeline] [linux-jdk7-m3.5.x_build] }
[Pipeline] [linux-jdk8-m3.5.x_build] }
[Pipeline] [windows-jdk7-m3.3.x_build] }
[Pipeline] [windows-jdk7-m3.5.x_build] // node
[Pipeline] [windows-jdk7-m3.5.x_build] }
[Pipeline] [windows-jdk10-m3.5.x_build] // node
[linux-jdk9-m3.5.x_build] [WS-CLEANUP] Deleting project workspace...[WS-CLEANUP] done
[linux-jdk10-m3.5.x_build] [WS-CLEANUP] Deleting project workspace...[WS-CLEANUP] done
[Pipeline] [windows-jdk9-m3.5.x_build] // stage
[Pipeline] [windows-jdk10-m3.5.x_build] }
[Pipeline] [windows-jdk9-m3.5.x_build] }
[Pipeline] [windows-jdk8-m3.5.x_build] // stage
[Pipeline] [windows-jdk8-m3.5.x_build] }
[Pipeline] [linux-jdk7-m3.2.x_build] // node
[Pipeline] [linux-jdk7-m3.3.x_build] // node
[Pipeline] [linux-jdk7-m3.5.x_build] // node
[Pipeline] [linux-jdk8-m3.5.x_build] // node
[Pipeline] [windows-jdk7-m3.3.x_build] // node
[Pipeline] [linux-jdk7-m3.2.x_build] }
[Pipeline] [linux-jdk7-m3.3.x_build] }
[Pipeline] [linux-jdk7-m3.5.x_build] }
[Pipeline] [linux-jdk8-m3.5.x_build] }
[Pipeline] [windows-jdk7-m3.3.x_build] }
[Pipeline] [windows-jdk9-m3.5.x_build] // ws
[Pipeline] [windows-jdk9-m3.5.x_build] }
[Pipeline] [linux-jdk9-m3.5.x_build] }
[Pipeline] [linux-jdk10-m3.5.x_build] }
[Pipeline] [windows-jdk8-m3.5.x_build] // ws
[Pipeline] [windows-jdk8-m3.5.x_build] }
[Pipeline] [windows-jdk9-m3.5.x_build] // node
[Pipeline] [linux-jdk9-m3.5.x_build] // stage
[Pipeline] [linux-jdk10-m3.5.x_build] // stage
[Pipeline] [windows-jdk9-m3.5.x_build] }
[Pipeline] [linux-jdk9-m3.5.x_build] }
[Pipeline] [linux-jdk10-m3.5.x_build] }
[Pipeline] [windows-jdk8-m3.5.x_build] // node
[Pipeline] [windows-jdk8-m3.5.x_build] }
[Pipeline] [linux-jdk9-m3.5.x_build] // ws
[Pipeline] [linux-jdk10-m3.5.x_build] // ws
[Pipeline] [linux-jdk9-m3.5.x_build] }
[Pipeline] [linux-jdk10-m3.5.x_build] }
[Pipeline] [linux-jdk9-m3.5.x_build] // node
[Pipeline] [linux-jdk10-m3.5.x_build] // node
[Pipeline] [linux-jdk9-m3.5.x_build] }
[Pipeline] [linux-jdk10-m3.5.x_build] }
[Pipeline] // parallel
[Pipeline] stage
[Pipeline] { (Notifications)
[Pipeline] echo
Build result: UNSTABLE
[Pipeline] jiraIssueSelector
[Pipeline] emailext
Mime
  • Unnamed multipart/mixed (inline, None, 0 bytes)
View raw message