maven-notifications mailing list archives

Site index · List index
Message view « Date » · « Thread »
Top « Date » · « Thread »
From Apache Jenkins Server <jenk...@builds.apache.org>
Subject Build failed in Jenkins: Maven TLP » maven-wagon » wagon-scm-git #17
Date Wed, 10 Oct 2018 18:07:55 GMT
See https://builds.apache.org/job/maven-box/job/maven-wagon/job/wagon-scm-git/17/

Changes:

* Exclude H25
* Exclude H31 cause master is failing constantly.
* no need to test anymore with '3.0.x'
* Add Java 11 to defaults
* Try to shorten path for Windows by using tempDir
* Fix arguments
* Add option for temp workspace
* disable tmpWs
* enable tmpWs
* Use def
* Try to shorten wsDir

46 tests failed.
FAILED:  org.apache.maven.wagon.providers.scm.ScmSvnExeWagonTest.testWagonPutDirectoryDeepDestination

Error Message:
Error checking out: command failed: svn: E180001: Unable to connect to a repository at URL 'file://2/m/wagon-providers/wagon-scm/target/test-classes/test-repo-svn-test'
svn: E180001: Unable to open an ra_local session to URL
svn: E180001: Unable to open repository 'file://2/m/wagon-providers/wagon-scm/target/test-classes/test-repo-svn-test'

Stack Trace:
org.apache.maven.wagon.TransferFailedException: 
Error checking out: command failed: svn: E180001: Unable to connect to a repository at URL 'file://2/m/wagon-providers/wagon-scm/target/test-classes/test-repo-svn-test'
svn: E180001: Unable to open an ra_local session to URL
svn: E180001: Unable to open repository 'file://2/m/wagon-providers/wagon-scm/target/test-classes/test-repo-svn-test'
Caused by: org.apache.maven.scm.ScmException: 
command failed: svn: E180001: Unable to connect to a repository at URL 'file://2/m/wagon-providers/wagon-scm/target/test-classes/test-repo-svn-test'
svn: E180001: Unable to open an ra_local session to URL
svn: E180001: Unable to open repository 'file://2/m/wagon-providers/wagon-scm/target/test-classes/test-repo-svn-test'


FAILED:  org.apache.maven.wagon.providers.scm.ScmSvnExeWagonTest.testWagon

Error Message:

  Unexpected method call TransferListener.transferError(TransferEvent[GET|ERROR|Repository[scm:svn:file://2/m/wagon-providers/wagon-scm/target/test-classes/test-repo-svn-test]|null|test-resource[len = 18; mod = 1539194791702]]):
    TransferListener.transferCompleted(TransferEvent[PUT|COMPLETED|Repository[scm:svn:file://2/m/wagon-providers/wagon-scm/target/test-classes/test-repo-svn-test]|F:\jenkins\jenkins-slave\workspace\x_maven-wagon_wagon-scm-git-JFLMMYBLUJZHZUM4KST663ZOB5W6QQB2OF5JLK4YVV3OMUVRSJDA@2\m\wagon-providers\wagon-scm\target\test-output\test-resource|test-resource[len = 18; mod = 1539194791702]]): expected: 1, actual: 0

Stack Trace:
java.lang.AssertionError: 

  Unexpected method call TransferListener.transferError(TransferEvent[GET|ERROR|Repository[scm:svn:file://2/m/wagon-providers/wagon-scm/target/test-classes/test-repo-svn-test]|null|test-resource[len = 18; mod = 1539194791702]]):
    TransferListener.transferCompleted(TransferEvent[PUT|COMPLETED|Repository[scm:svn:file://2/m/wagon-providers/wagon-scm/target/test-classes/test-repo-svn-test]|F:\jenkins\jenkins-slave\workspace\x_maven-wagon_wagon-scm-git-JFLMMYBLUJZHZUM4KST663ZOB5W6QQB2OF5JLK4YVV3OMUVRSJDA@2\m\wagon-providers\wagon-scm\target\test-output\test-resource|test-resource[len = 18; mod = 1539194791702]]): expected: 1, actual: 0


FAILED:  org.apache.maven.wagon.providers.scm.ScmSvnExeWagonTest.testWagonPutDirectoryForDot

Error Message:
Error checking out: command failed: svn: E180001: Unable to connect to a repository at URL 'file://2/m/wagon-providers/wagon-scm/target/test-classes/test-repo-svn-test'
svn: E180001: Unable to open an ra_local session to URL
svn: E180001: Unable to open repository 'file://2/m/wagon-providers/wagon-scm/target/test-classes/test-repo-svn-test'

Stack Trace:
org.apache.maven.wagon.TransferFailedException: 
Error checking out: command failed: svn: E180001: Unable to connect to a repository at URL 'file://2/m/wagon-providers/wagon-scm/target/test-classes/test-repo-svn-test'
svn: E180001: Unable to open an ra_local session to URL
svn: E180001: Unable to open repository 'file://2/m/wagon-providers/wagon-scm/target/test-classes/test-repo-svn-test'
Caused by: org.apache.maven.scm.ScmException: 
command failed: svn: E180001: Unable to connect to a repository at URL 'file://2/m/wagon-providers/wagon-scm/target/test-classes/test-repo-svn-test'
svn: E180001: Unable to open an ra_local session to URL
svn: E180001: Unable to open repository 'file://2/m/wagon-providers/wagon-scm/target/test-classes/test-repo-svn-test'


FAILED:  org.apache.maven.wagon.providers.scm.ScmSvnExeWagonTest.testWagonGetFileList

Error Message:

  Unexpected method call TransferListener.transferError(TransferEvent[GET|ERROR|Repository[scm:svn:file://2/m/wagon-providers/wagon-scm/target/test-classes/test-repo-svn-test]|null|file-list/test-resource.txt[len = 18; mod = 1539194792105]]):
    TransferListener.transferCompleted(TransferEvent[PUT|COMPLETED|Repository[scm:svn:file://2/m/wagon-providers/wagon-scm/target/test-classes/test-repo-svn-test]|F:\jenkins\jenkins-slave\workspace\x_maven-wagon_wagon-scm-git-JFLMMYBLUJZHZUM4KST663ZOB5W6QQB2OF5JLK4YVV3OMUVRSJDA@2\m\wagon-providers\wagon-scm\target\test-output\file-list\test-resource.txt|file-list/test-resource.txt[len = 18; mod = 1539194792105]]): expected: 1, actual: 0

Stack Trace:
java.lang.AssertionError: 

  Unexpected method call TransferListener.transferError(TransferEvent[GET|ERROR|Repository[scm:svn:file://2/m/wagon-providers/wagon-scm/target/test-classes/test-repo-svn-test]|null|file-list/test-resource.txt[len = 18; mod = 1539194792105]]):
    TransferListener.transferCompleted(TransferEvent[PUT|COMPLETED|Repository[scm:svn:file://2/m/wagon-providers/wagon-scm/target/test-classes/test-repo-svn-test]|F:\jenkins\jenkins-slave\workspace\x_maven-wagon_wagon-scm-git-JFLMMYBLUJZHZUM4KST663ZOB5W6QQB2OF5JLK4YVV3OMUVRSJDA@2\m\wagon-providers\wagon-scm\target\test-output\file-list\test-resource.txt|file-list/test-resource.txt[len = 18; mod = 1539194792105]]): expected: 1, actual: 0


FAILED:  org.apache.maven.wagon.providers.scm.ScmSvnExeWagonTest.testFailedGet

Error Message:
Error getting file from SCM

Stack Trace:
org.apache.maven.wagon.TransferFailedException: Error getting file from SCM
Caused by: org.apache.maven.scm.ScmException: 
command failed: svn: E180001: Unable to connect to a repository at URL 'file://2/m/wagon-providers/wagon-scm/target/test-classes/test-repo-svn-test'
svn: E180001: Unable to open an ra_local session to URL
svn: E180001: Unable to open repository 'file://2/m/wagon-providers/wagon-scm/target/test-classes/test-repo-svn-test'


FAILED:  org.apache.maven.wagon.providers.scm.ScmSvnExeWagonTest.testWagonPutDirectoryWhenDirectoryAlreadyExists

Error Message:
Error checking out: command failed: svn: E180001: Unable to connect to a repository at URL 'file://2/m/wagon-providers/wagon-scm/target/test-classes/test-repo-svn-test'
svn: E180001: Unable to open an ra_local session to URL
svn: E180001: Unable to open repository 'file://2/m/wagon-providers/wagon-scm/target/test-classes/test-repo-svn-test'

Stack Trace:
org.apache.maven.wagon.TransferFailedException: 
Error checking out: command failed: svn: E180001: Unable to connect to a repository at URL 'file://2/m/wagon-providers/wagon-scm/target/test-classes/test-repo-svn-test'
svn: E180001: Unable to open an ra_local session to URL
svn: E180001: Unable to open repository 'file://2/m/wagon-providers/wagon-scm/target/test-classes/test-repo-svn-test'
Caused by: org.apache.maven.scm.ScmException: 
command failed: svn: E180001: Unable to connect to a repository at URL 'file://2/m/wagon-providers/wagon-scm/target/test-classes/test-repo-svn-test'
svn: E180001: Unable to open an ra_local session to URL
svn: E180001: Unable to open repository 'file://2/m/wagon-providers/wagon-scm/target/test-classes/test-repo-svn-test'


FAILED:  org.apache.maven.wagon.providers.scm.ScmSvnExeWagonTest.testWagonResourceExists

Error Message:

  Unexpected method call TransferListener.transferError(TransferEvent[GET|ERROR|Repository[scm:svn:file://2/m/wagon-providers/wagon-scm/target/test-classes/test-repo-svn-test]|null|test-resource[len = 18; mod = 1539194792485]]):
    TransferListener.transferCompleted(TransferEvent[PUT|COMPLETED|Repository[scm:svn:file://2/m/wagon-providers/wagon-scm/target/test-classes/test-repo-svn-test]|F:\jenkins\jenkins-slave\workspace\x_maven-wagon_wagon-scm-git-JFLMMYBLUJZHZUM4KST663ZOB5W6QQB2OF5JLK4YVV3OMUVRSJDA@2\m\wagon-providers\wagon-scm\target\test-output\test-resource|test-resource[len = 18; mod = 1539194792485]]): expected: 1, actual: 0

Stack Trace:
java.lang.AssertionError: 

  Unexpected method call TransferListener.transferError(TransferEvent[GET|ERROR|Repository[scm:svn:file://2/m/wagon-providers/wagon-scm/target/test-classes/test-repo-svn-test]|null|test-resource[len = 18; mod = 1539194792485]]):
    TransferListener.transferCompleted(TransferEvent[PUT|COMPLETED|Repository[scm:svn:file://2/m/wagon-providers/wagon-scm/target/test-classes/test-repo-svn-test]|F:\jenkins\jenkins-slave\workspace\x_maven-wagon_wagon-scm-git-JFLMMYBLUJZHZUM4KST663ZOB5W6QQB2OF5JLK4YVV3OMUVRSJDA@2\m\wagon-providers\wagon-scm\target\test-output\test-resource|test-resource[len = 18; mod = 1539194792485]]): expected: 1, actual: 0


FAILED:  org.apache.maven.wagon.providers.scm.ScmSvnExeWagonTest.testWagonPutDirectory

Error Message:
Error checking out: command failed: svn: E180001: Unable to connect to a repository at URL 'file://2/m/wagon-providers/wagon-scm/target/test-classes/test-repo-svn-test'
svn: E180001: Unable to open an ra_local session to URL
svn: E180001: Unable to open repository 'file://2/m/wagon-providers/wagon-scm/target/test-classes/test-repo-svn-test'

Stack Trace:
org.apache.maven.wagon.TransferFailedException: 
Error checking out: command failed: svn: E180001: Unable to connect to a repository at URL 'file://2/m/wagon-providers/wagon-scm/target/test-classes/test-repo-svn-test'
svn: E180001: Unable to open an ra_local session to URL
svn: E180001: Unable to open repository 'file://2/m/wagon-providers/wagon-scm/target/test-classes/test-repo-svn-test'
Caused by: org.apache.maven.scm.ScmException: 
command failed: svn: E180001: Unable to connect to a repository at URL 'file://2/m/wagon-providers/wagon-scm/target/test-classes/test-repo-svn-test'
svn: E180001: Unable to open an ra_local session to URL
svn: E180001: Unable to open repository 'file://2/m/wagon-providers/wagon-scm/target/test-classes/test-repo-svn-test'


FAILED:  org.apache.maven.wagon.providers.scm.ScmGitExeWagonTest.testWagonPutDirectoryDeepDestination

Error Message:
Error interacting with SCM: Unable to commit file. The git-commit command failed. 
*** Please tell me who you are.

Run

  git config --global user.email "you@example.com"
  git config --global user.name "Your Name"

to set your account's default identity.
Omit --global to set the identity only in this repository.

fatal:********@asf924.gq1.ygridcore.net>) not allowed


Stack Trace:
org.apache.maven.wagon.TransferFailedException: 
Error interacting with SCM: Unable to commit file. The git-commit command failed. 
*** Please tell me who you are.

Run

  git config --global user.email "you@example.com"
  git config --global user.name "Your Name"

to set your account's default identity.
Omit --global to set the identity only in this repository.

fatal:********@asf924.gq1.ygridcore.net>) not allowed

Caused by: org.apache.maven.scm.ScmException: 
Unable to commit file. The git-commit command failed. 
*** Please tell me who you are.

Run

  git config --global user.email "you@example.com"
  git config --global user.name "Your Name"

to set your account's default identity.
Omit --global to set the identity only in this repository.

fatal:********@asf924.gq1.ygridcore.net>) not allowed



FAILED:  org.apache.maven.wagon.providers.scm.ScmGitExeWagonTest.testWagon

Error Message:

  Unexpected method call TransferListener.transferError(TransferEvent[PUT|ERROR|Repository[scm:git:file:///home/jenkins/jenkins-slave/workspace/x_maven-wagon_wagon-scm-git-JFLMMYBLUJZHZUM4KST663ZOB5W6QQB2OF5JLK4YVV3OMUVRSJDA/m/wagon-providers/wagon-scm/target/test-classes/test-repo-git-test/]|null|test-resource[len = 18; mod = 1539194065000]]):
    TransferListener.transferCompleted(TransferEvent[PUT|COMPLETED|Repository[scm:git:file:///home/jenkins/jenkins-slave/workspace/x_maven-wagon_wagon-scm-git-JFLMMYBLUJZHZUM4KST663ZOB5W6QQB2OF5JLK4YVV3OMUVRSJDA/m/wagon-providers/wagon-scm/target/test-classes/test-repo-git-test/]|/home/jenkins/jenkins-slave/workspace/x_maven-wagon_wagon-scm-git-JFLMMYBLUJZHZUM4KST663ZOB5W6QQB2OF5JLK4YVV3OMUVRSJDA/m/wagon-providers/wagon-scm/target/test-output/test-resource|test-resource[len = 18; mod = 1539194065000]]): expected: 1, actual: 0

Stack Trace:
java.lang.AssertionError: 

  Unexpected method call TransferListener.transferError(TransferEvent[PUT|ERROR|Repository[scm:git:file:///home/jenkins/jenkins-slave/workspace/x_maven-wagon_wagon-scm-git-JFLMMYBLUJZHZUM4KST663ZOB5W6QQB2OF5JLK4YVV3OMUVRSJDA/m/wagon-providers/wagon-scm/target/test-classes/test-repo-git-test/]|null|test-resource[len = 18; mod = 1539194065000]]):
    TransferListener.transferCompleted(TransferEvent[PUT|COMPLETED|Repository[scm:git:file:///home/jenkins/jenkins-slave/workspace/x_maven-wagon_wagon-scm-git-JFLMMYBLUJZHZUM4KST663ZOB5W6QQB2OF5JLK4YVV3OMUVRSJDA/m/wagon-providers/wagon-scm/target/test-classes/test-repo-git-test/]|/home/jenkins/jenkins-slave/workspace/x_maven-wagon_wagon-scm-git-JFLMMYBLUJZHZUM4KST663ZOB5W6QQB2OF5JLK4YVV3OMUVRSJDA/m/wagon-providers/wagon-scm/target/test-output/test-resource|test-resource[len = 18; mod = 1539194065000]]): expected: 1, actual: 0


FAILED:  org.apache.maven.wagon.providers.scm.ScmGitExeWagonTest.testWagonPutDirectoryForDot

Error Message:
Error interacting with SCM: Unable to commit file. The git-commit command failed. 
*** Please tell me who you are.

Run

  git config --global user.email "you@example.com"
  git config --global user.name "Your Name"

to set your account's default identity.
Omit --global to set the identity only in this repository.

fatal:********@asf924.gq1.ygridcore.net>) not allowed


Stack Trace:
org.apache.maven.wagon.TransferFailedException: 
Error interacting with SCM: Unable to commit file. The git-commit command failed. 
*** Please tell me who you are.

Run

  git config --global user.email "you@example.com"
  git config --global user.name "Your Name"

to set your account's default identity.
Omit --global to set the identity only in this repository.

fatal:********@asf924.gq1.ygridcore.net>) not allowed

Caused by: org.apache.maven.scm.ScmException: 
Unable to commit file. The git-commit command failed. 
*** Please tell me who you are.

Run

  git config --global user.email "you@example.com"
  git config --global user.name "Your Name"

to set your account's default identity.
Omit --global to set the identity only in this repository.

fatal:********@asf924.gq1.ygridcore.net>) not allowed



FAILED:  org.apache.maven.wagon.providers.scm.ScmGitExeWagonTest.testWagonPutDirectoryWhenDirectoryAlreadyExists

Error Message:
Error interacting with SCM: Unable to commit file. The git-commit command failed. 
*** Please tell me who you are.

Run

  git config --global user.email "you@example.com"
  git config --global user.name "Your Name"

to set your account's default identity.
Omit --global to set the identity only in this repository.

fatal:********@asf924.gq1.ygridcore.net>) not allowed


Stack Trace:
org.apache.maven.wagon.TransferFailedException: 
Error interacting with SCM: Unable to commit file. The git-commit command failed. 
*** Please tell me who you are.

Run

  git config --global user.email "you@example.com"
  git config --global user.name "Your Name"

to set your account's default identity.
Omit --global to set the identity only in this repository.

fatal:********@asf924.gq1.ygridcore.net>) not allowed

Caused by: org.apache.maven.scm.ScmException: 
Unable to commit file. The git-commit command failed. 
*** Please tell me who you are.

Run

  git config --global user.email "you@example.com"
  git config --global user.name "Your Name"

to set your account's default identity.
Omit --global to set the identity only in this repository.

fatal:********@asf924.gq1.ygridcore.net>) not allowed



FAILED:  org.apache.maven.wagon.providers.scm.ScmGitExeWagonTest.testWagonPutDirectory

Error Message:
Error interacting with SCM: Unable to commit file. The git-commit command failed. 
*** Please tell me who you are.

Run

  git config --global user.email "you@example.com"
  git config --global user.name "Your Name"

to set your account's default identity.
Omit --global to set the identity only in this repository.

fatal:********@asf924.gq1.ygridcore.net>) not allowed


Stack Trace:
org.apache.maven.wagon.TransferFailedException: 
Error interacting with SCM: Unable to commit file. The git-commit command failed. 
*** Please tell me who you are.

Run

  git config --global user.email "you@example.com"
  git config --global user.name "Your Name"

to set your account's default identity.
Omit --global to set the identity only in this repository.

fatal:********@asf924.gq1.ygridcore.net>) not allowed

Caused by: org.apache.maven.scm.ScmException: 
Unable to commit file. The git-commit command failed. 
*** Please tell me who you are.

Run

  git config --global user.email "you@example.com"
  git config --global user.name "Your Name"

to set your account's default identity.
Omit --global to set the identity only in this repository.

fatal:********@asf924.gq1.ygridcore.net>) not allowed



FAILED:  org.apache.maven.wagon.providers.scm.ScmGitExeWagonTest.testWagonPutDirectoryDeepDestination

Error Message:
Error interacting with SCM: Unable to commit file. The git-commit command failed. 
*** Please tell me who you are.

Run

  git config --global user.email "you@example.com"
  git config --global user.name "Your Name"

to set your account's default identity.
Omit --global to set the identity only in this repository.

fatal:********@asf925.gq1.ygridcore.net>) not allowed


Stack Trace:
org.apache.maven.wagon.TransferFailedException: 
Error interacting with SCM: Unable to commit file. The git-commit command failed. 
*** Please tell me who you are.

Run

  git config --global user.email "you@example.com"
  git config --global user.name "Your Name"

to set your account's default identity.
Omit --global to set the identity only in this repository.

fatal:********@asf925.gq1.ygridcore.net>) not allowed

Caused by: org.apache.maven.scm.ScmException: 
Unable to commit file. The git-commit command failed. 
*** Please tell me who you are.

Run

  git config --global user.email "you@example.com"
  git config --global user.name "Your Name"

to set your account's default identity.
Omit --global to set the identity only in this repository.

fatal:********@asf925.gq1.ygridcore.net>) not allowed



FAILED:  org.apache.maven.wagon.providers.scm.ScmGitExeWagonTest.testWagon

Error Message:

  Unexpected method call TransferListener.transferError(TransferEvent[PUT|ERROR|Repository[scm:git:file:///home/jenkins/jenkins-slave/workspace/x_maven-wagon_wagon-scm-git-JFLMMYBLUJZHZUM4KST663ZOB5W6QQB2OF5JLK4YVV3OMUVRSJDA/m/wagon-providers/wagon-scm/target/test-classes/test-repo-git-test/]|null|test-resource[len = 18; mod = 1539194072000]]):
    TransferListener.transferCompleted(TransferEvent[PUT|COMPLETED|Repository[scm:git:file:///home/jenkins/jenkins-slave/workspace/x_maven-wagon_wagon-scm-git-JFLMMYBLUJZHZUM4KST663ZOB5W6QQB2OF5JLK4YVV3OMUVRSJDA/m/wagon-providers/wagon-scm/target/test-classes/test-repo-git-test/]|/home/jenkins/jenkins-slave/workspace/x_maven-wagon_wagon-scm-git-JFLMMYBLUJZHZUM4KST663ZOB5W6QQB2OF5JLK4YVV3OMUVRSJDA/m/wagon-providers/wagon-scm/target/test-output/test-resource|test-resource[len = 18; mod = 1539194072000]]): expected: 1, actual: 0

Stack Trace:
java.lang.AssertionError: 

  Unexpected method call TransferListener.transferError(TransferEvent[PUT|ERROR|Repository[scm:git:file:///home/jenkins/jenkins-slave/workspace/x_maven-wagon_wagon-scm-git-JFLMMYBLUJZHZUM4KST663ZOB5W6QQB2OF5JLK4YVV3OMUVRSJDA/m/wagon-providers/wagon-scm/target/test-classes/test-repo-git-test/]|null|test-resource[len = 18; mod = 1539194072000]]):
    TransferListener.transferCompleted(TransferEvent[PUT|COMPLETED|Repository[scm:git:file:///home/jenkins/jenkins-slave/workspace/x_maven-wagon_wagon-scm-git-JFLMMYBLUJZHZUM4KST663ZOB5W6QQB2OF5JLK4YVV3OMUVRSJDA/m/wagon-providers/wagon-scm/target/test-classes/test-repo-git-test/]|/home/jenkins/jenkins-slave/workspace/x_maven-wagon_wagon-scm-git-JFLMMYBLUJZHZUM4KST663ZOB5W6QQB2OF5JLK4YVV3OMUVRSJDA/m/wagon-providers/wagon-scm/target/test-output/test-resource|test-resource[len = 18; mod = 1539194072000]]): expected: 1, actual: 0


FAILED:  org.apache.maven.wagon.providers.scm.ScmGitExeWagonTest.testWagonPutDirectoryForDot

Error Message:
Error interacting with SCM: Unable to commit file. The git-commit command failed. 
*** Please tell me who you are.

Run

  git config --global user.email "you@example.com"
  git config --global user.name "Your Name"

to set your account's default identity.
Omit --global to set the identity only in this repository.

fatal:********@asf925.gq1.ygridcore.net>) not allowed


Stack Trace:
org.apache.maven.wagon.TransferFailedException: 
Error interacting with SCM: Unable to commit file. The git-commit command failed. 
*** Please tell me who you are.

Run

  git config --global user.email "you@example.com"
  git config --global user.name "Your Name"

to set your account's default identity.
Omit --global to set the identity only in this repository.

fatal:********@asf925.gq1.ygridcore.net>) not allowed

Caused by: org.apache.maven.scm.ScmException: 
Unable to commit file. The git-commit command failed. 
*** Please tell me who you are.

Run

  git config --global user.email "you@example.com"
  git config --global user.name "Your Name"

to set your account's default identity.
Omit --global to set the identity only in this repository.

fatal:********@asf925.gq1.ygridcore.net>) not allowed



FAILED:  org.apache.maven.wagon.providers.scm.ScmGitExeWagonTest.testWagonPutDirectoryWhenDirectoryAlreadyExists

Error Message:
Error interacting with SCM: Unable to commit file. The git-commit command failed. 
*** Please tell me who you are.

Run

  git config --global user.email "you@example.com"
  git config --global user.name "Your Name"

to set your account's default identity.
Omit --global to set the identity only in this repository.

fatal:********@asf925.gq1.ygridcore.net>) not allowed


Stack Trace:
org.apache.maven.wagon.TransferFailedException: 
Error interacting with SCM: Unable to commit file. The git-commit command failed. 
*** Please tell me who you are.

Run

  git config --global user.email "you@example.com"
  git config --global user.name "Your Name"

to set your account's default identity.
Omit --global to set the identity only in this repository.

fatal:********@asf925.gq1.ygridcore.net>) not allowed

Caused by: org.apache.maven.scm.ScmException: 
Unable to commit file. The git-commit command failed. 
*** Please tell me who you are.

Run

  git config --global user.email "you@example.com"
  git config --global user.name "Your Name"

to set your account's default identity.
Omit --global to set the identity only in this repository.

fatal:********@asf925.gq1.ygridcore.net>) not allowed



FAILED:  org.apache.maven.wagon.providers.scm.ScmGitExeWagonTest.testWagonPutDirectory

Error Message:
Error interacting with SCM: Unable to commit file. The git-commit command failed. 
*** Please tell me who you are.

Run

  git config --global user.email "you@example.com"
  git config --global user.name "Your Name"

to set your account's default identity.
Omit --global to set the identity only in this repository.

fatal:********@asf925.gq1.ygridcore.net>) not allowed


Stack Trace:
org.apache.maven.wagon.TransferFailedException: 
Error interacting with SCM: Unable to commit file. The git-commit command failed. 
*** Please tell me who you are.

Run

  git config --global user.email "you@example.com"
  git config --global user.name "Your Name"

to set your account's default identity.
Omit --global to set the identity only in this repository.

fatal:********@asf925.gq1.ygridcore.net>) not allowed

Caused by: org.apache.maven.scm.ScmException: 
Unable to commit file. The git-commit command failed. 
*** Please tell me who you are.

Run

  git config --global user.email "you@example.com"
  git config --global user.name "Your Name"

to set your account's default identity.
Omit --global to set the identity only in this repository.

fatal:********@asf925.gq1.ygridcore.net>) not allowed



FAILED:  org.apache.maven.wagon.providers.scm.ScmGitExeWagonTest.testWagonPutDirectoryDeepDestination

Error Message:
Error interacting with SCM: Unable to commit file. The git-commit command failed. 
*** Please tell me who you are.

Run

  git config --global user.email "you@example.com"
  git config --global user.name "Your Name"

to set your account's default identity.
Omit --global to set the identity only in this repository.

fatal:********@asf933.gq1.ygridcore.net>) not allowed


Stack Trace:
org.apache.maven.wagon.TransferFailedException: 
Error interacting with SCM: Unable to commit file. The git-commit command failed. 
*** Please tell me who you are.

Run

  git config --global user.email "you@example.com"
  git config --global user.name "Your Name"

to set your account's default identity.
Omit --global to set the identity only in this repository.

fatal:********@asf933.gq1.ygridcore.net>) not allowed

Caused by: org.apache.maven.scm.ScmException: 
Unable to commit file. The git-commit command failed. 
*** Please tell me who you are.

Run

  git config --global user.email "you@example.com"
  git config --global user.name "Your Name"

to set your account's default identity.
Omit --global to set the identity only in this repository.

fatal:********@asf933.gq1.ygridcore.net>) not allowed



FAILED:  org.apache.maven.wagon.providers.scm.ScmGitExeWagonTest.testWagon

Error Message:

  Unexpected method call TransferListener.transferError(TransferEvent[PUT|ERROR|Repository[scm:git:file:///home/jenkins/jenkins-slave/workspace/x_maven-wagon_wagon-scm-git-JFLMMYBLUJZHZUM4KST663ZOB5W6QQB2OF5JLK4YVV3OMUVRSJDA/m/wagon-providers/wagon-scm/target/test-classes/test-repo-git-test/]|null|test-resource[len = 18; mod = 1539194060000]]):
    TransferListener.transferCompleted(TransferEvent[PUT|COMPLETED|Repository[scm:git:file:///home/jenkins/jenkins-slave/workspace/x_maven-wagon_wagon-scm-git-JFLMMYBLUJZHZUM4KST663ZOB5W6QQB2OF5JLK4YVV3OMUVRSJDA/m/wagon-providers/wagon-scm/target/test-classes/test-repo-git-test/]|/home/jenkins/jenkins-slave/workspace/x_maven-wagon_wagon-scm-git-JFLMMYBLUJZHZUM4KST663ZOB5W6QQB2OF5JLK4YVV3OMUVRSJDA/m/wagon-providers/wagon-scm/target/test-output/test-resource|test-resource[len = 18; mod = 1539194060000]]): expected: 1, actual: 0

Stack Trace:
java.lang.AssertionError: 

  Unexpected method call TransferListener.transferError(TransferEvent[PUT|ERROR|Repository[scm:git:file:///home/jenkins/jenkins-slave/workspace/x_maven-wagon_wagon-scm-git-JFLMMYBLUJZHZUM4KST663ZOB5W6QQB2OF5JLK4YVV3OMUVRSJDA/m/wagon-providers/wagon-scm/target/test-classes/test-repo-git-test/]|null|test-resource[len = 18; mod = 1539194060000]]):
    TransferListener.transferCompleted(TransferEvent[PUT|COMPLETED|Repository[scm:git:file:///home/jenkins/jenkins-slave/workspace/x_maven-wagon_wagon-scm-git-JFLMMYBLUJZHZUM4KST663ZOB5W6QQB2OF5JLK4YVV3OMUVRSJDA/m/wagon-providers/wagon-scm/target/test-classes/test-repo-git-test/]|/home/jenkins/jenkins-slave/workspace/x_maven-wagon_wagon-scm-git-JFLMMYBLUJZHZUM4KST663ZOB5W6QQB2OF5JLK4YVV3OMUVRSJDA/m/wagon-providers/wagon-scm/target/test-output/test-resource|test-resource[len = 18; mod = 1539194060000]]): expected: 1, actual: 0


FAILED:  org.apache.maven.wagon.providers.scm.ScmGitExeWagonTest.testWagonPutDirectoryForDot

Error Message:
Error interacting with SCM: Unable to commit file. The git-commit command failed. 
*** Please tell me who you are.

Run

  git config --global user.email "you@example.com"
  git config --global user.name "Your Name"

to set your account's default identity.
Omit --global to set the identity only in this repository.

fatal:********@asf933.gq1.ygridcore.net>) not allowed


Stack Trace:
org.apache.maven.wagon.TransferFailedException: 
Error interacting with SCM: Unable to commit file. The git-commit command failed. 
*** Please tell me who you are.

Run

  git config --global user.email "you@example.com"
  git config --global user.name "Your Name"

to set your account's default identity.
Omit --global to set the identity only in this repository.

fatal:********@asf933.gq1.ygridcore.net>) not allowed

Caused by: org.apache.maven.scm.ScmException: 
Unable to commit file. The git-commit command failed. 
*** Please tell me who you are.

Run

  git config --global user.email "you@example.com"
  git config --global user.name "Your Name"

to set your account's default identity.
Omit --global to set the identity only in this repository.

fatal:********@asf933.gq1.ygridcore.net>) not allowed



FAILED:  org.apache.maven.wagon.providers.scm.ScmGitExeWagonTest.testWagonPutDirectoryWhenDirectoryAlreadyExists

Error Message:
Error interacting with SCM: Unable to commit file. The git-commit command failed. 
*** Please tell me who you are.

Run

  git config --global user.email "you@example.com"
  git config --global user.name "Your Name"

to set your account's default identity.
Omit --global to set the identity only in this repository.

fatal:********@asf933.gq1.ygridcore.net>) not allowed


Stack Trace:
org.apache.maven.wagon.TransferFailedException: 
Error interacting with SCM: Unable to commit file. The git-commit command failed. 
*** Please tell me who you are.

Run

  git config --global user.email "you@example.com"
  git config --global user.name "Your Name"

to set your account's default identity.
Omit --global to set the identity only in this repository.

fatal:********@asf933.gq1.ygridcore.net>) not allowed

Caused by: org.apache.maven.scm.ScmException: 
Unable to commit file. The git-commit command failed. 
*** Please tell me who you are.

Run

  git config --global user.email "you@example.com"
  git config --global user.name "Your Name"

to set your account's default identity.
Omit --global to set the identity only in this repository.

fatal:********@asf933.gq1.ygridcore.net>) not allowed



FAILED:  org.apache.maven.wagon.providers.scm.ScmGitExeWagonTest.testWagonPutDirectory

Error Message:
Error interacting with SCM: Unable to commit file. The git-commit command failed. 
*** Please tell me who you are.

Run

  git config --global user.email "you@example.com"
  git config --global user.name "Your Name"

to set your account's default identity.
Omit --global to set the identity only in this repository.

fatal:********@asf933.gq1.ygridcore.net>) not allowed


Stack Trace:
org.apache.maven.wagon.TransferFailedException: 
Error interacting with SCM: Unable to commit file. The git-commit command failed. 
*** Please tell me who you are.

Run

  git config --global user.email "you@example.com"
  git config --global user.name "Your Name"

to set your account's default identity.
Omit --global to set the identity only in this repository.

fatal:********@asf933.gq1.ygridcore.net>) not allowed

Caused by: org.apache.maven.scm.ScmException: 
Unable to commit file. The git-commit command failed. 
*** Please tell me who you are.

Run

  git config --global user.email "you@example.com"
  git config --global user.name "Your Name"

to set your account's default identity.
Omit --global to set the identity only in this repository.

fatal:********@asf933.gq1.ygridcore.net>) not allowed



FAILED:  org.apache.maven.wagon.providers.scm.ScmGitExeWagonTest.testWagonPutDirectoryDeepDestination

Error Message:
Error interacting with SCM: Unable to commit file. The git-commit command failed. 
*** Please tell me who you are.

Run

  git config --global user.email "you@example.com"
  git config --global user.name "Your Name"

to set your account's default identity.
Omit --global to set the identity only in this repository.

fatal:********@asf922.gq1.ygridcore.net>) not allowed


Stack Trace:
org.apache.maven.wagon.TransferFailedException: 
Error interacting with SCM: Unable to commit file. The git-commit command failed. 
*** Please tell me who you are.

Run

  git config --global user.email "you@example.com"
  git config --global user.name "Your Name"

to set your account's default identity.
Omit --global to set the identity only in this repository.

fatal:********@asf922.gq1.ygridcore.net>) not allowed

Caused by: org.apache.maven.scm.ScmException: 
Unable to commit file. The git-commit command failed. 
*** Please tell me who you are.

Run

  git config --global user.email "you@example.com"
  git config --global user.name "Your Name"

to set your account's default identity.
Omit --global to set the identity only in this repository.

fatal:********@asf922.gq1.ygridcore.net>) not allowed



FAILED:  org.apache.maven.wagon.providers.scm.ScmGitExeWagonTest.testWagon

Error Message:

  Unexpected method call TransferListener.transferError(TransferEvent[PUT|ERROR|Repository[scm:git:file:///home/jenkins/jenkins-slave/workspace/x_maven-wagon_wagon-scm-git-JFLMMYBLUJZHZUM4KST663ZOB5W6QQB2OF5JLK4YVV3OMUVRSJDA/m/wagon-providers/wagon-scm/target/test-classes/test-repo-git-test/]|null|test-resource[len = 18; mod = 1539194111491]]):
    TransferListener.transferCompleted(TransferEvent[PUT|COMPLETED|Repository[scm:git:file:///home/jenkins/jenkins-slave/workspace/x_maven-wagon_wagon-scm-git-JFLMMYBLUJZHZUM4KST663ZOB5W6QQB2OF5JLK4YVV3OMUVRSJDA/m/wagon-providers/wagon-scm/target/test-classes/test-repo-git-test/]|/home/jenkins/jenkins-slave/workspace/x_maven-wagon_wagon-scm-git-JFLMMYBLUJZHZUM4KST663ZOB5W6QQB2OF5JLK4YVV3OMUVRSJDA/m/wagon-providers/wagon-scm/target/test-output/test-resource|test-resource[len = 18; mod = 1539194111491]]): expected: 1, actual: 0

Stack Trace:
java.lang.AssertionError: 

  Unexpected method call TransferListener.transferError(TransferEvent[PUT|ERROR|Repository[scm:git:file:///home/jenkins/jenkins-slave/workspace/x_maven-wagon_wagon-scm-git-JFLMMYBLUJZHZUM4KST663ZOB5W6QQB2OF5JLK4YVV3OMUVRSJDA/m/wagon-providers/wagon-scm/target/test-classes/test-repo-git-test/]|null|test-resource[len = 18; mod = 1539194111491]]):
    TransferListener.transferCompleted(TransferEvent[PUT|COMPLETED|Repository[scm:git:file:///home/jenkins/jenkins-slave/workspace/x_maven-wagon_wagon-scm-git-JFLMMYBLUJZHZUM4KST663ZOB5W6QQB2OF5JLK4YVV3OMUVRSJDA/m/wagon-providers/wagon-scm/target/test-classes/test-repo-git-test/]|/home/jenkins/jenkins-slave/workspace/x_maven-wagon_wagon-scm-git-JFLMMYBLUJZHZUM4KST663ZOB5W6QQB2OF5JLK4YVV3OMUVRSJDA/m/wagon-providers/wagon-scm/target/test-output/test-resource|test-resource[len = 18; mod = 1539194111491]]): expected: 1, actual: 0


FAILED:  org.apache.maven.wagon.providers.scm.ScmGitExeWagonTest.testWagonPutDirectoryForDot

Error Message:
Error interacting with SCM: Unable to commit file. The git-commit command failed. 
*** Please tell me who you are.

Run

  git config --global user.email "you@example.com"
  git config --global user.name "Your Name"

to set your account's default identity.
Omit --global to set the identity only in this repository.

fatal:********@asf922.gq1.ygridcore.net>) not allowed


Stack Trace:
org.apache.maven.wagon.TransferFailedException: 
Error interacting with SCM: Unable to commit file. The git-commit command failed. 
*** Please tell me who you are.

Run

  git config --global user.email "you@example.com"
  git config --global user.name "Your Name"

to set your account's default identity.
Omit --global to set the identity only in this repository.

fatal:********@asf922.gq1.ygridcore.net>) not allowed

Caused by: org.apache.maven.scm.ScmException: 
Unable to commit file. The git-commit command failed. 
*** Please tell me who you are.

Run

  git config --global user.email "you@example.com"
  git config --global user.name "Your Name"

to set your account's default identity.
Omit --global to set the identity only in this repository.

fatal:********@asf922.gq1.ygridcore.net>) not allowed



FAILED:  org.apache.maven.wagon.providers.scm.ScmGitExeWagonTest.testWagonPutDirectoryWhenDirectoryAlreadyExists

Error Message:
Error interacting with SCM: Unable to commit file. The git-commit command failed. 
*** Please tell me who you are.

Run

  git config --global user.email "you@example.com"
  git config --global user.name "Your Name"

to set your account's default identity.
Omit --global to set the identity only in this repository.

fatal:********@asf922.gq1.ygridcore.net>) not allowed


Stack Trace:
org.apache.maven.wagon.TransferFailedException: 
Error interacting with SCM: Unable to commit file. The git-commit command failed. 
*** Please tell me who you are.

Run

  git config --global user.email "you@example.com"
  git config --global user.name "Your Name"

to set your account's default identity.
Omit --global to set the identity only in this repository.

fatal:********@asf922.gq1.ygridcore.net>) not allowed

Caused by: org.apache.maven.scm.ScmException: 
Unable to commit file. The git-commit command failed. 
*** Please tell me who you are.

Run

  git config --global user.email "you@example.com"
  git config --global user.name "Your Name"

to set your account's default identity.
Omit --global to set the identity only in this repository.

fatal:********@asf922.gq1.ygridcore.net>) not allowed



FAILED:  org.apache.maven.wagon.providers.scm.ScmGitExeWagonTest.testWagonPutDirectory

Error Message:
Error interacting with SCM: Unable to commit file. The git-commit command failed. 
*** Please tell me who you are.

Run

  git config --global user.email "you@example.com"
  git config --global user.name "Your Name"

to set your account's default identity.
Omit --global to set the identity only in this repository.

fatal:********@asf922.gq1.ygridcore.net>) not allowed


Stack Trace:
org.apache.maven.wagon.TransferFailedException: 
Error interacting with SCM: Unable to commit file. The git-commit command failed. 
*** Please tell me who you are.

Run

  git config --global user.email "you@example.com"
  git config --global user.name "Your Name"

to set your account's default identity.
Omit --global to set the identity only in this repository.

fatal:********@asf922.gq1.ygridcore.net>) not allowed

Caused by: org.apache.maven.scm.ScmException: 
Unable to commit file. The git-commit command failed. 
*** Please tell me who you are.

Run

  git config --global user.email "you@example.com"
  git config --global user.name "Your Name"

to set your account's default identity.
Omit --global to set the identity only in this repository.

fatal:********@asf922.gq1.ygridcore.net>) not allowed



FAILED:  org.apache.maven.wagon.providers.scm.ScmGitExeWagonTest.testWagonPutDirectoryDeepDestination

Error Message:
Error checking out: command failed: Cloning into 'F:\jenkins\jenkins-slave\workspace\x_maven-wagon_wagon-scm-git-JFLMMYBLUJZHZUM4KST663ZOB5W6QQB2OF5JLK4YVV3OMUVRSJDA\m\wagon-providers\wagon-scm\target\test-output\checkout-org.apache.maven.scm.provider.git.gitexe.GitExeScmProvider'...
fatal: cannot stat 'F:/jenkins/jenkins-slave/workspace/x_maven-wagon_wagon-scm-git-JFLMMYBLUJZHZUM4KST663ZOB5W6QQB2OF5JLK4YVV3OMUVRSJDA/m/wagon-providers/wagon-scm/target/test-output/checkout-org.apache.maven.scm.provider.git.gitexe.GitExeScmProvider/.git/hooks/applypatch-msg.sample': Filename too long

Stack Trace:
org.apache.maven.wagon.TransferFailedException: 
Error checking out: command failed: Cloning into 'F:\jenkins\jenkins-slave\workspace\x_maven-wagon_wagon-scm-git-JFLMMYBLUJZHZUM4KST663ZOB5W6QQB2OF5JLK4YVV3OMUVRSJDA\m\wagon-providers\wagon-scm\target\test-output\checkout-org.apache.maven.scm.provider.git.gitexe.GitExeScmProvider'...
fatal: cannot stat 'F:/jenkins/jenkins-slave/workspace/x_maven-wagon_wagon-scm-git-JFLMMYBLUJZHZUM4KST663ZOB5W6QQB2OF5JLK4YVV3OMUVRSJDA/m/wagon-providers/wagon-scm/target/test-output/checkout-org.apache.maven.scm.provider.git.gitexe.GitExeScmProvider/.git/hooks/applypatch-msg.sample': Filename too long
Caused by: org.apache.maven.scm.ScmException: 
command failed: Cloning into 'F:\jenkins\jenkins-slave\workspace\x_maven-wagon_wagon-scm-git-JFLMMYBLUJZHZUM4KST663ZOB5W6QQB2OF5JLK4YVV3OMUVRSJDA\m\wagon-providers\wagon-scm\target\test-output\checkout-org.apache.maven.scm.provider.git.gitexe.GitExeScmProvider'...
fatal: cannot stat 'F:/jenkins/jenkins-slave/workspace/x_maven-wagon_wagon-scm-git-JFLMMYBLUJZHZUM4KST663ZOB5W6QQB2OF5JLK4YVV3OMUVRSJDA/m/wagon-providers/wagon-scm/target/test-output/checkout-org.apache.maven.scm.provider.git.gitexe.GitExeScmProvider/.git/hooks/applypatch-msg.sample': Filename too long


FAILED:  org.apache.maven.wagon.providers.scm.ScmGitExeWagonTest.testWagon

Error Message:

  Unexpected method call TransferListener.transferError(TransferEvent[GET|ERROR|Repository[scm:git:file:///F:/jenkins/jenkins-slave/workspace/x_maven-wagon_wagon-scm-git-JFLMMYBLUJZHZUM4KST663ZOB5W6QQB2OF5JLK4YVV3OMUVRSJDA/m/wagon-providers/wagon-scm/target/test-classes/test-repo-git-test/]|null|test-resource[len = 18; mod = 1539194750836]]):
    TransferListener.transferCompleted(TransferEvent[PUT|COMPLETED|Repository[scm:git:file:///F:/jenkins/jenkins-slave/workspace/x_maven-wagon_wagon-scm-git-JFLMMYBLUJZHZUM4KST663ZOB5W6QQB2OF5JLK4YVV3OMUVRSJDA/m/wagon-providers/wagon-scm/target/test-classes/test-repo-git-test/]|F:\jenkins\jenkins-slave\workspace\x_maven-wagon_wagon-scm-git-JFLMMYBLUJZHZUM4KST663ZOB5W6QQB2OF5JLK4YVV3OMUVRSJDA\m\wagon-providers\wagon-scm\target\test-output\test-resource|test-resource[len = 18; mod = 1539194750836]]): expected: 1, actual: 0

Stack Trace:
java.lang.AssertionError: 

  Unexpected method call TransferListener.transferError(TransferEvent[GET|ERROR|Repository[scm:git:file:///F:/jenkins/jenkins-slave/workspace/x_maven-wagon_wagon-scm-git-JFLMMYBLUJZHZUM4KST663ZOB5W6QQB2OF5JLK4YVV3OMUVRSJDA/m/wagon-providers/wagon-scm/target/test-classes/test-repo-git-test/]|null|test-resource[len = 18; mod = 1539194750836]]):
    TransferListener.transferCompleted(TransferEvent[PUT|COMPLETED|Repository[scm:git:file:///F:/jenkins/jenkins-slave/workspace/x_maven-wagon_wagon-scm-git-JFLMMYBLUJZHZUM4KST663ZOB5W6QQB2OF5JLK4YVV3OMUVRSJDA/m/wagon-providers/wagon-scm/target/test-classes/test-repo-git-test/]|F:\jenkins\jenkins-slave\workspace\x_maven-wagon_wagon-scm-git-JFLMMYBLUJZHZUM4KST663ZOB5W6QQB2OF5JLK4YVV3OMUVRSJDA\m\wagon-providers\wagon-scm\target\test-output\test-resource|test-resource[len = 18; mod = 1539194750836]]): expected: 1, actual: 0


FAILED:  org.apache.maven.wagon.providers.scm.ScmGitExeWagonTest.testWagonPutDirectoryForDot

Error Message:
Error checking out: command failed: Cloning into 'F:\jenkins\jenkins-slave\workspace\x_maven-wagon_wagon-scm-git-JFLMMYBLUJZHZUM4KST663ZOB5W6QQB2OF5JLK4YVV3OMUVRSJDA\m\wagon-providers\wagon-scm\target\test-output\checkout-org.apache.maven.scm.provider.git.gitexe.GitExeScmProvider'...
fatal: cannot stat 'F:/jenkins/jenkins-slave/workspace/x_maven-wagon_wagon-scm-git-JFLMMYBLUJZHZUM4KST663ZOB5W6QQB2OF5JLK4YVV3OMUVRSJDA/m/wagon-providers/wagon-scm/target/test-output/checkout-org.apache.maven.scm.provider.git.gitexe.GitExeScmProvider/.git/hooks/applypatch-msg.sample': Filename too long

Stack Trace:
org.apache.maven.wagon.TransferFailedException: 
Error checking out: command failed: Cloning into 'F:\jenkins\jenkins-slave\workspace\x_maven-wagon_wagon-scm-git-JFLMMYBLUJZHZUM4KST663ZOB5W6QQB2OF5JLK4YVV3OMUVRSJDA\m\wagon-providers\wagon-scm\target\test-output\checkout-org.apache.maven.scm.provider.git.gitexe.GitExeScmProvider'...
fatal: cannot stat 'F:/jenkins/jenkins-slave/workspace/x_maven-wagon_wagon-scm-git-JFLMMYBLUJZHZUM4KST663ZOB5W6QQB2OF5JLK4YVV3OMUVRSJDA/m/wagon-providers/wagon-scm/target/test-output/checkout-org.apache.maven.scm.provider.git.gitexe.GitExeScmProvider/.git/hooks/applypatch-msg.sample': Filename too long
Caused by: org.apache.maven.scm.ScmException: 
command failed: Cloning into 'F:\jenkins\jenkins-slave\workspace\x_maven-wagon_wagon-scm-git-JFLMMYBLUJZHZUM4KST663ZOB5W6QQB2OF5JLK4YVV3OMUVRSJDA\m\wagon-providers\wagon-scm\target\test-output\checkout-org.apache.maven.scm.provider.git.gitexe.GitExeScmProvider'...
fatal: cannot stat 'F:/jenkins/jenkins-slave/workspace/x_maven-wagon_wagon-scm-git-JFLMMYBLUJZHZUM4KST663ZOB5W6QQB2OF5JLK4YVV3OMUVRSJDA/m/wagon-providers/wagon-scm/target/test-output/checkout-org.apache.maven.scm.provider.git.gitexe.GitExeScmProvider/.git/hooks/applypatch-msg.sample': Filename too long


FAILED:  org.apache.maven.wagon.providers.scm.ScmGitExeWagonTest.testFailedGet

Error Message:
Error getting file from SCM

Stack Trace:
org.apache.maven.wagon.TransferFailedException: Error getting file from SCM
Caused by: org.apache.maven.scm.ScmException: 
command failed: Cloning into 'F:\jenkins\jenkins-slave\workspace\x_maven-wagon_wagon-scm-git-JFLMMYBLUJZHZUM4KST663ZOB5W6QQB2OF5JLK4YVV3OMUVRSJDA\m\wagon-providers\wagon-scm\target\test-output\checkout-org.apache.maven.scm.provider.git.gitexe.GitExeScmProvider'...
fatal: cannot stat 'F:/jenkins/jenkins-slave/workspace/x_maven-wagon_wagon-scm-git-JFLMMYBLUJZHZUM4KST663ZOB5W6QQB2OF5JLK4YVV3OMUVRSJDA/m/wagon-providers/wagon-scm/target/test-output/checkout-org.apache.maven.scm.provider.git.gitexe.GitExeScmProvider/.git/hooks/applypatch-msg.sample': Filename too long


FAILED:  org.apache.maven.wagon.providers.scm.ScmGitExeWagonTest.testWagonPutDirectoryWhenDirectoryAlreadyExists

Error Message:
Error checking out: command failed: Cloning into 'F:\jenkins\jenkins-slave\workspace\x_maven-wagon_wagon-scm-git-JFLMMYBLUJZHZUM4KST663ZOB5W6QQB2OF5JLK4YVV3OMUVRSJDA\m\wagon-providers\wagon-scm\target\test-output\checkout-org.apache.maven.scm.provider.git.gitexe.GitExeScmProvider'...
fatal: cannot stat 'F:/jenkins/jenkins-slave/workspace/x_maven-wagon_wagon-scm-git-JFLMMYBLUJZHZUM4KST663ZOB5W6QQB2OF5JLK4YVV3OMUVRSJDA/m/wagon-providers/wagon-scm/target/test-output/checkout-org.apache.maven.scm.provider.git.gitexe.GitExeScmProvider/.git/hooks/applypatch-msg.sample': Filename too long

Stack Trace:
org.apache.maven.wagon.TransferFailedException: 
Error checking out: command failed: Cloning into 'F:\jenkins\jenkins-slave\workspace\x_maven-wagon_wagon-scm-git-JFLMMYBLUJZHZUM4KST663ZOB5W6QQB2OF5JLK4YVV3OMUVRSJDA\m\wagon-providers\wagon-scm\target\test-output\checkout-org.apache.maven.scm.provider.git.gitexe.GitExeScmProvider'...
fatal: cannot stat 'F:/jenkins/jenkins-slave/workspace/x_maven-wagon_wagon-scm-git-JFLMMYBLUJZHZUM4KST663ZOB5W6QQB2OF5JLK4YVV3OMUVRSJDA/m/wagon-providers/wagon-scm/target/test-output/checkout-org.apache.maven.scm.provider.git.gitexe.GitExeScmProvider/.git/hooks/applypatch-msg.sample': Filename too long
Caused by: org.apache.maven.scm.ScmException: 
command failed: Cloning into 'F:\jenkins\jenkins-slave\workspace\x_maven-wagon_wagon-scm-git-JFLMMYBLUJZHZUM4KST663ZOB5W6QQB2OF5JLK4YVV3OMUVRSJDA\m\wagon-providers\wagon-scm\target\test-output\checkout-org.apache.maven.scm.provider.git.gitexe.GitExeScmProvider'...
fatal: cannot stat 'F:/jenkins/jenkins-slave/workspace/x_maven-wagon_wagon-scm-git-JFLMMYBLUJZHZUM4KST663ZOB5W6QQB2OF5JLK4YVV3OMUVRSJDA/m/wagon-providers/wagon-scm/target/test-output/checkout-org.apache.maven.scm.provider.git.gitexe.GitExeScmProvider/.git/hooks/applypatch-msg.sample': Filename too long


FAILED:  org.apache.maven.wagon.providers.scm.ScmGitExeWagonTest.testWagonPutDirectory

Error Message:
Error checking out: command failed: Cloning into 'F:\jenkins\jenkins-slave\workspace\x_maven-wagon_wagon-scm-git-JFLMMYBLUJZHZUM4KST663ZOB5W6QQB2OF5JLK4YVV3OMUVRSJDA\m\wagon-providers\wagon-scm\target\test-output\checkout-org.apache.maven.scm.provider.git.gitexe.GitExeScmProvider'...
fatal: cannot stat 'F:/jenkins/jenkins-slave/workspace/x_maven-wagon_wagon-scm-git-JFLMMYBLUJZHZUM4KST663ZOB5W6QQB2OF5JLK4YVV3OMUVRSJDA/m/wagon-providers/wagon-scm/target/test-output/checkout-org.apache.maven.scm.provider.git.gitexe.GitExeScmProvider/.git/hooks/applypatch-msg.sample': Filename too long

Stack Trace:
org.apache.maven.wagon.TransferFailedException: 
Error checking out: command failed: Cloning into 'F:\jenkins\jenkins-slave\workspace\x_maven-wagon_wagon-scm-git-JFLMMYBLUJZHZUM4KST663ZOB5W6QQB2OF5JLK4YVV3OMUVRSJDA\m\wagon-providers\wagon-scm\target\test-output\checkout-org.apache.maven.scm.provider.git.gitexe.GitExeScmProvider'...
fatal: cannot stat 'F:/jenkins/jenkins-slave/workspace/x_maven-wagon_wagon-scm-git-JFLMMYBLUJZHZUM4KST663ZOB5W6QQB2OF5JLK4YVV3OMUVRSJDA/m/wagon-providers/wagon-scm/target/test-output/checkout-org.apache.maven.scm.provider.git.gitexe.GitExeScmProvider/.git/hooks/applypatch-msg.sample': Filename too long
Caused by: org.apache.maven.scm.ScmException: 
command failed: Cloning into 'F:\jenkins\jenkins-slave\workspace\x_maven-wagon_wagon-scm-git-JFLMMYBLUJZHZUM4KST663ZOB5W6QQB2OF5JLK4YVV3OMUVRSJDA\m\wagon-providers\wagon-scm\target\test-output\checkout-org.apache.maven.scm.provider.git.gitexe.GitExeScmProvider'...
fatal: cannot stat 'F:/jenkins/jenkins-slave/workspace/x_maven-wagon_wagon-scm-git-JFLMMYBLUJZHZUM4KST663ZOB5W6QQB2OF5JLK4YVV3OMUVRSJDA/m/wagon-providers/wagon-scm/target/test-output/checkout-org.apache.maven.scm.provider.git.gitexe.GitExeScmProvider/.git/hooks/applypatch-msg.sample': Filename too long


FAILED:  org.apache.maven.wagon.providers.scm.ScmGitExeWagonTest.testWagonPutDirectoryDeepDestination

Error Message:
Error checking out: command failed: Cloning into 'F:\jenkins\jenkins-slave\workspace\x_maven-wagon_wagon-scm-git-JFLMMYBLUJZHZUM4KST663ZOB5W6QQB2OF5JLK4YVV3OMUVRSJDA\m\wagon-providers\wagon-scm\target\test-output\checkout-org.apache.maven.scm.provider.git.gitexe.GitExeScmProvider'...
fatal: '$GIT_DIR' too big
fatal: index-pack failed

Stack Trace:
org.apache.maven.wagon.TransferFailedException: 
Error checking out: command failed: Cloning into 'F:\jenkins\jenkins-slave\workspace\x_maven-wagon_wagon-scm-git-JFLMMYBLUJZHZUM4KST663ZOB5W6QQB2OF5JLK4YVV3OMUVRSJDA\m\wagon-providers\wagon-scm\target\test-output\checkout-org.apache.maven.scm.provider.git.gitexe.GitExeScmProvider'...
fatal: '$GIT_DIR' too big
fatal: index-pack failed
Caused by: org.apache.maven.scm.ScmException: 
command failed: Cloning into 'F:\jenkins\jenkins-slave\workspace\x_maven-wagon_wagon-scm-git-JFLMMYBLUJZHZUM4KST663ZOB5W6QQB2OF5JLK4YVV3OMUVRSJDA\m\wagon-providers\wagon-scm\target\test-output\checkout-org.apache.maven.scm.provider.git.gitexe.GitExeScmProvider'...
fatal: '$GIT_DIR' too big
fatal: index-pack failed


FAILED:  org.apache.maven.wagon.providers.scm.ScmGitExeWagonTest.testWagon

Error Message:

  Unexpected method call TransferListener.transferError(TransferEvent[GET|ERROR|Repository[scm:git:file:///F:/jenkins/jenkins-slave/workspace/x_maven-wagon_wagon-scm-git-JFLMMYBLUJZHZUM4KST663ZOB5W6QQB2OF5JLK4YVV3OMUVRSJDA/m/wagon-providers/wagon-scm/target/test-classes/test-repo-git-test/]|null|test-resource[len = 18; mod = 1539194759087]]):
    TransferListener.transferCompleted(TransferEvent[PUT|COMPLETED|Repository[scm:git:file:///F:/jenkins/jenkins-slave/workspace/x_maven-wagon_wagon-scm-git-JFLMMYBLUJZHZUM4KST663ZOB5W6QQB2OF5JLK4YVV3OMUVRSJDA/m/wagon-providers/wagon-scm/target/test-classes/test-repo-git-test/]|F:\jenkins\jenkins-slave\workspace\x_maven-wagon_wagon-scm-git-JFLMMYBLUJZHZUM4KST663ZOB5W6QQB2OF5JLK4YVV3OMUVRSJDA\m\wagon-providers\wagon-scm\target\test-output\test-resource|test-resource[len = 18; mod = 1539194759087]]): expected: 1, actual: 0

Stack Trace:
java.lang.AssertionError: 

  Unexpected method call TransferListener.transferError(TransferEvent[GET|ERROR|Repository[scm:git:file:///F:/jenkins/jenkins-slave/workspace/x_maven-wagon_wagon-scm-git-JFLMMYBLUJZHZUM4KST663ZOB5W6QQB2OF5JLK4YVV3OMUVRSJDA/m/wagon-providers/wagon-scm/target/test-classes/test-repo-git-test/]|null|test-resource[len = 18; mod = 1539194759087]]):
    TransferListener.transferCompleted(TransferEvent[PUT|COMPLETED|Repository[scm:git:file:///F:/jenkins/jenkins-slave/workspace/x_maven-wagon_wagon-scm-git-JFLMMYBLUJZHZUM4KST663ZOB5W6QQB2OF5JLK4YVV3OMUVRSJDA/m/wagon-providers/wagon-scm/target/test-classes/test-repo-git-test/]|F:\jenkins\jenkins-slave\workspace\x_maven-wagon_wagon-scm-git-JFLMMYBLUJZHZUM4KST663ZOB5W6QQB2OF5JLK4YVV3OMUVRSJDA\m\wagon-providers\wagon-scm\target\test-output\test-resource|test-resource[len = 18; mod = 1539194759087]]): expected: 1, actual: 0


FAILED:  org.apache.maven.wagon.providers.scm.ScmGitExeWagonTest.testWagonPutDirectoryForDot

Error Message:
Error checking out: command failed: Cloning into 'F:\jenkins\jenkins-slave\workspace\x_maven-wagon_wagon-scm-git-JFLMMYBLUJZHZUM4KST663ZOB5W6QQB2OF5JLK4YVV3OMUVRSJDA\m\wagon-providers\wagon-scm\target\test-output\checkout-org.apache.maven.scm.provider.git.gitexe.GitExeScmProvider'...
fatal: '$GIT_DIR' too big
fatal: index-pack failed

Stack Trace:
org.apache.maven.wagon.TransferFailedException: 
Error checking out: command failed: Cloning into 'F:\jenkins\jenkins-slave\workspace\x_maven-wagon_wagon-scm-git-JFLMMYBLUJZHZUM4KST663ZOB5W6QQB2OF5JLK4YVV3OMUVRSJDA\m\wagon-providers\wagon-scm\target\test-output\checkout-org.apache.maven.scm.provider.git.gitexe.GitExeScmProvider'...
fatal: '$GIT_DIR' too big
fatal: index-pack failed
Caused by: org.apache.maven.scm.ScmException: 
command failed: Cloning into 'F:\jenkins\jenkins-slave\workspace\x_maven-wagon_wagon-scm-git-JFLMMYBLUJZHZUM4KST663ZOB5W6QQB2OF5JLK4YVV3OMUVRSJDA\m\wagon-providers\wagon-scm\target\test-output\checkout-org.apache.maven.scm.provider.git.gitexe.GitExeScmProvider'...
fatal: '$GIT_DIR' too big
fatal: index-pack failed


FAILED:  org.apache.maven.wagon.providers.scm.ScmGitExeWagonTest.testFailedGet

Error Message:
Error getting file from SCM

Stack Trace:
org.apache.maven.wagon.TransferFailedException: Error getting file from SCM
Caused by: org.apache.maven.scm.ScmException: 
command failed: Cloning into 'F:\jenkins\jenkins-slave\workspace\x_maven-wagon_wagon-scm-git-JFLMMYBLUJZHZUM4KST663ZOB5W6QQB2OF5JLK4YVV3OMUVRSJDA\m\wagon-providers\wagon-scm\target\test-output\checkout-org.apache.maven.scm.provider.git.gitexe.GitExeScmProvider'...
fatal: '$GIT_DIR' too big
fatal: index-pack failed


FAILED:  org.apache.maven.wagon.providers.scm.ScmGitExeWagonTest.testWagonPutDirectoryWhenDirectoryAlreadyExists

Error Message:
Error checking out: command failed: Cloning into 'F:\jenkins\jenkins-slave\workspace\x_maven-wagon_wagon-scm-git-JFLMMYBLUJZHZUM4KST663ZOB5W6QQB2OF5JLK4YVV3OMUVRSJDA\m\wagon-providers\wagon-scm\target\test-output\checkout-org.apache.maven.scm.provider.git.gitexe.GitExeScmProvider'...
fatal: '$GIT_DIR' too big
fatal: index-pack failed

Stack Trace:
org.apache.maven.wagon.TransferFailedException: 
Error checking out: command failed: Cloning into 'F:\jenkins\jenkins-slave\workspace\x_maven-wagon_wagon-scm-git-JFLMMYBLUJZHZUM4KST663ZOB5W6QQB2OF5JLK4YVV3OMUVRSJDA\m\wagon-providers\wagon-scm\target\test-output\checkout-org.apache.maven.scm.provider.git.gitexe.GitExeScmProvider'...
fatal: '$GIT_DIR' too big
fatal: index-pack failed
Caused by: org.apache.maven.scm.ScmException: 
command failed: Cloning into 'F:\jenkins\jenkins-slave\workspace\x_maven-wagon_wagon-scm-git-JFLMMYBLUJZHZUM4KST663ZOB5W6QQB2OF5JLK4YVV3OMUVRSJDA\m\wagon-providers\wagon-scm\target\test-output\checkout-org.apache.maven.scm.provider.git.gitexe.GitExeScmProvider'...
fatal: '$GIT_DIR' too big
fatal: index-pack failed


FAILED:  org.apache.maven.wagon.providers.scm.ScmGitExeWagonTest.testWagonPutDirectory

Error Message:
Error checking out: command failed: Cloning into 'F:\jenkins\jenkins-slave\workspace\x_maven-wagon_wagon-scm-git-JFLMMYBLUJZHZUM4KST663ZOB5W6QQB2OF5JLK4YVV3OMUVRSJDA\m\wagon-providers\wagon-scm\target\test-output\checkout-org.apache.maven.scm.provider.git.gitexe.GitExeScmProvider'...
fatal: '$GIT_DIR' too big
fatal: index-pack failed

Stack Trace:
org.apache.maven.wagon.TransferFailedException: 
Error checking out: command failed: Cloning into 'F:\jenkins\jenkins-slave\workspace\x_maven-wagon_wagon-scm-git-JFLMMYBLUJZHZUM4KST663ZOB5W6QQB2OF5JLK4YVV3OMUVRSJDA\m\wagon-providers\wagon-scm\target\test-output\checkout-org.apache.maven.scm.provider.git.gitexe.GitExeScmProvider'...
fatal: '$GIT_DIR' too big
fatal: index-pack failed
Caused by: org.apache.maven.scm.ScmException: 
command failed: Cloning into 'F:\jenkins\jenkins-slave\workspace\x_maven-wagon_wagon-scm-git-JFLMMYBLUJZHZUM4KST663ZOB5W6QQB2OF5JLK4YVV3OMUVRSJDA\m\wagon-providers\wagon-scm\target\test-output\checkout-org.apache.maven.scm.provider.git.gitexe.GitExeScmProvider'...
fatal: '$GIT_DIR' too big
fatal: index-pack failed


FAILED:  org.apache.maven.wagon.providers.scm.ScmGitExeWagonTest.testWagonPutDirectoryDeepDestination

Error Message:
Error checking out: command failed: F:/jenkins/jenkins-slave/workspace/x_maven-wagon_wagon-scm-git-JFLMMYBLUJZHZUM4KST663ZOB5W6QQB2OF5JLK4YVV3OMUVRSJDA@2/m/wagon-providers/wagon-scm/target/test-output/checkout-org.apache.maven.scm.provider.git.gitexe.GitExeScmProvider/.git/refs/heads: Filename too long
Cloning into 'F:********@2\m\wagon-providers\wagon-scm\target\test-output\checkout-org.apache.maven.scm.provider.git.gitexe.GitExeScmProvider'...

Stack Trace:
org.apache.maven.wagon.TransferFailedException: 
Error checking out: command failed: F:/jenkins/jenkins-slave/workspace/x_maven-wagon_wagon-scm-git-JFLMMYBLUJZHZUM4KST663ZOB5W6QQB2OF5JLK4YVV3OMUVRSJDA@2/m/wagon-providers/wagon-scm/target/test-output/checkout-org.apache.maven.scm.provider.git.gitexe.GitExeScmProvider/.git/refs/heads: Filename too long
Cloning into 'F:********@2\m\wagon-providers\wagon-scm\target\test-output\checkout-org.apache.maven.scm.provider.git.gitexe.GitExeScmProvider'...
Caused by: org.apache.maven.scm.ScmException: 
command failed: F:/jenkins/jenkins-slave/workspace/x_maven-wagon_wagon-scm-git-JFLMMYBLUJZHZUM4KST663ZOB5W6QQB2OF5JLK4YVV3OMUVRSJDA@2/m/wagon-providers/wagon-scm/target/test-output/checkout-org.apache.maven.scm.provider.git.gitexe.GitExeScmProvider/.git/refs/heads: Filename too long
Cloning into 'F:********@2\m\wagon-providers\wagon-scm\target\test-output\checkout-org.apache.maven.scm.provider.git.gitexe.GitExeScmProvider'...


FAILED:  org.apache.maven.wagon.providers.scm.ScmGitExeWagonTest.testWagon

Error Message:

  Unexpected method call TransferListener.transferError(TransferEvent[GET|ERROR|Repository[scm:git:file://2/m/wagon-providers/wagon-scm/target/test-classes/test-repo-git-test/]|null|test-resource[len = 18; mod = 1539194787971]]):
    TransferListener.transferCompleted(TransferEvent[PUT|COMPLETED|Repository[scm:git:file://2/m/wagon-providers/wagon-scm/target/test-classes/test-repo-git-test/]|F:\jenkins\jenkins-slave\workspace\x_maven-wagon_wagon-scm-git-JFLMMYBLUJZHZUM4KST663ZOB5W6QQB2OF5JLK4YVV3OMUVRSJDA@2\m\wagon-providers\wagon-scm\target\test-output\test-resource|test-resource[len = 18; mod = 1539194787971]]): expected: 1, actual: 0

Stack Trace:
java.lang.AssertionError: 

  Unexpected method call TransferListener.transferError(TransferEvent[GET|ERROR|Repository[scm:git:file://2/m/wagon-providers/wagon-scm/target/test-classes/test-repo-git-test/]|null|test-resource[len = 18; mod = 1539194787971]]):
    TransferListener.transferCompleted(TransferEvent[PUT|COMPLETED|Repository[scm:git:file://2/m/wagon-providers/wagon-scm/target/test-classes/test-repo-git-test/]|F:\jenkins\jenkins-slave\workspace\x_maven-wagon_wagon-scm-git-JFLMMYBLUJZHZUM4KST663ZOB5W6QQB2OF5JLK4YVV3OMUVRSJDA@2\m\wagon-providers\wagon-scm\target\test-output\test-resource|test-resource[len = 18; mod = 1539194787971]]): expected: 1, actual: 0


FAILED:  org.apache.maven.wagon.providers.scm.ScmGitExeWagonTest.testWagonPutDirectoryForDot

Error Message:
Error checking out: command failed: F:/jenkins/jenkins-slave/workspace/x_maven-wagon_wagon-scm-git-JFLMMYBLUJZHZUM4KST663ZOB5W6QQB2OF5JLK4YVV3OMUVRSJDA@2/m/wagon-providers/wagon-scm/target/test-output/checkout-org.apache.maven.scm.provider.git.gitexe.GitExeScmProvider/.git/refs/heads: Filename too long
Cloning into 'F:********@2\m\wagon-providers\wagon-scm\target\test-output\checkout-org.apache.maven.scm.provider.git.gitexe.GitExeScmProvider'...

Stack Trace:
org.apache.maven.wagon.TransferFailedException: 
Error checking out: command failed: F:/jenkins/jenkins-slave/workspace/x_maven-wagon_wagon-scm-git-JFLMMYBLUJZHZUM4KST663ZOB5W6QQB2OF5JLK4YVV3OMUVRSJDA@2/m/wagon-providers/wagon-scm/target/test-output/checkout-org.apache.maven.scm.provider.git.gitexe.GitExeScmProvider/.git/refs/heads: Filename too long
Cloning into 'F:********@2\m\wagon-providers\wagon-scm\target\test-output\checkout-org.apache.maven.scm.provider.git.gitexe.GitExeScmProvider'...
Caused by: org.apache.maven.scm.ScmException: 
command failed: F:/jenkins/jenkins-slave/workspace/x_maven-wagon_wagon-scm-git-JFLMMYBLUJZHZUM4KST663ZOB5W6QQB2OF5JLK4YVV3OMUVRSJDA@2/m/wagon-providers/wagon-scm/target/test-output/checkout-org.apache.maven.scm.provider.git.gitexe.GitExeScmProvider/.git/refs/heads: Filename too long
Cloning into 'F:********@2\m\wagon-providers\wagon-scm\target\test-output\checkout-org.apache.maven.scm.provider.git.gitexe.GitExeScmProvider'...


FAILED:  org.apache.maven.wagon.providers.scm.ScmGitExeWagonTest.testFailedGet

Error Message:
Error getting file from SCM

Stack Trace:
org.apache.maven.wagon.TransferFailedException: Error getting file from SCM
Caused by: org.apache.maven.scm.ScmException: 
command failed: F:/jenkins/jenkins-slave/workspace/x_maven-wagon_wagon-scm-git-JFLMMYBLUJZHZUM4KST663ZOB5W6QQB2OF5JLK4YVV3OMUVRSJDA@2/m/wagon-providers/wagon-scm/target/test-output/checkout-org.apache.maven.scm.provider.git.gitexe.GitExeScmProvider/.git/refs/heads: Filename too long
Cloning into 'F:********@2\m\wagon-providers\wagon-scm\target\test-output\checkout-org.apache.maven.scm.provider.git.gitexe.GitExeScmProvider'...


FAILED:  org.apache.maven.wagon.providers.scm.ScmGitExeWagonTest.testWagonPutDirectoryWhenDirectoryAlreadyExists

Error Message:
Error checking out: command failed: F:/jenkins/jenkins-slave/workspace/x_maven-wagon_wagon-scm-git-JFLMMYBLUJZHZUM4KST663ZOB5W6QQB2OF5JLK4YVV3OMUVRSJDA@2/m/wagon-providers/wagon-scm/target/test-output/checkout-org.apache.maven.scm.provider.git.gitexe.GitExeScmProvider/.git/refs/heads: Filename too long
Cloning into 'F:********@2\m\wagon-providers\wagon-scm\target\test-output\checkout-org.apache.maven.scm.provider.git.gitexe.GitExeScmProvider'...

Stack Trace:
org.apache.maven.wagon.TransferFailedException: 
Error checking out: command failed: F:/jenkins/jenkins-slave/workspace/x_maven-wagon_wagon-scm-git-JFLMMYBLUJZHZUM4KST663ZOB5W6QQB2OF5JLK4YVV3OMUVRSJDA@2/m/wagon-providers/wagon-scm/target/test-output/checkout-org.apache.maven.scm.provider.git.gitexe.GitExeScmProvider/.git/refs/heads: Filename too long
Cloning into 'F:********@2\m\wagon-providers\wagon-scm\target\test-output\checkout-org.apache.maven.scm.provider.git.gitexe.GitExeScmProvider'...
Caused by: org.apache.maven.scm.ScmException: 
command failed: F:/jenkins/jenkins-slave/workspace/x_maven-wagon_wagon-scm-git-JFLMMYBLUJZHZUM4KST663ZOB5W6QQB2OF5JLK4YVV3OMUVRSJDA@2/m/wagon-providers/wagon-scm/target/test-output/checkout-org.apache.maven.scm.provider.git.gitexe.GitExeScmProvider/.git/refs/heads: Filename too long
Cloning into 'F:********@2\m\wagon-providers\wagon-scm\target\test-output\checkout-org.apache.maven.scm.provider.git.gitexe.GitExeScmProvider'...


FAILED:  org.apache.maven.wagon.providers.scm.ScmGitExeWagonTest.testWagonPutDirectory

Error Message:
Error checking out: command failed: F:/jenkins/jenkins-slave/workspace/x_maven-wagon_wagon-scm-git-JFLMMYBLUJZHZUM4KST663ZOB5W6QQB2OF5JLK4YVV3OMUVRSJDA@2/m/wagon-providers/wagon-scm/target/test-output/checkout-org.apache.maven.scm.provider.git.gitexe.GitExeScmProvider/.git/refs/heads: Filename too long
Cloning into 'F:********@2\m\wagon-providers\wagon-scm\target\test-output\checkout-org.apache.maven.scm.provider.git.gitexe.GitExeScmProvider'...

Stack Trace:
org.apache.maven.wagon.TransferFailedException: 
Error checking out: command failed: F:/jenkins/jenkins-slave/workspace/x_maven-wagon_wagon-scm-git-JFLMMYBLUJZHZUM4KST663ZOB5W6QQB2OF5JLK4YVV3OMUVRSJDA@2/m/wagon-providers/wagon-scm/target/test-output/checkout-org.apache.maven.scm.provider.git.gitexe.GitExeScmProvider/.git/refs/heads: Filename too long
Cloning into 'F:********@2\m\wagon-providers\wagon-scm\target\test-output\checkout-org.apache.maven.scm.provider.git.gitexe.GitExeScmProvider'...
Caused by: org.apache.maven.scm.ScmException: 
command failed: F:/jenkins/jenkins-slave/workspace/x_maven-wagon_wagon-scm-git-JFLMMYBLUJZHZUM4KST663ZOB5W6QQB2OF5JLK4YVV3OMUVRSJDA@2/m/wagon-providers/wagon-scm/target/test-output/checkout-org.apache.maven.scm.provider.git.gitexe.GitExeScmProvider/.git/refs/heads: Filename too long
Cloning into 'F:********@2\m\wagon-providers\wagon-scm\target\test-output\checkout-org.apache.maven.scm.provider.git.gitexe.GitExeScmProvider'...




Build log:
[...truncated 3.38 MB...]
[windows-jdk7] [INFO] Apache Maven Wagon :: Providers :: HTTP Shared Library SUCCESS [  4.410 s]
[windows-jdk7] [INFO] Apache Maven Wagon :: Test Compatibility Kits ...... SUCCESS [  1.373 s]
[windows-jdk7] [INFO] Apache Maven Wagon :: HTTP Test Compatibility Kit .. SUCCESS [  2.560 s]
[windows-jdk7] [INFO] Apache Maven Wagon :: Providers :: HTTP Provider ... SUCCESS [04:54 min]
[windows-jdk7] [INFO] Apache Maven Wagon :: Providers :: Lightweight HTTP Provider SUCCESS [02:13 min]
[windows-jdk7] [INFO] Apache Maven Wagon :: Providers :: SCM Provider .... SUCCESS [ 16.030 s]
[windows-jdk7] [INFO] Apache Maven Wagon :: Providers :: SSH Common Library SUCCESS [  3.190 s]
[windows-jdk7] [INFO] Apache Maven Wagon :: Providers :: SSH Common Tests  SUCCESS [  2.422 s]
[windows-jdk7] [INFO] Apache Maven Wagon :: Providers :: SSH External Provider SUCCESS [  1.842 s]
[windows-jdk7] [INFO] Apache Maven Wagon :: Providers :: SSH Provider .... SUCCESS [  2.790 s]
[windows-jdk7] [INFO] Apache Maven Wagon :: Providers :: WebDAV Provider . SUCCESS [01:03 min]
[windows-jdk7] [INFO] ------------------------------------------------------------------------
[windows-jdk7] [INFO] BUILD SUCCESS
[windows-jdk7] [INFO] ------------------------------------------------------------------------
[windows-jdk7] [INFO] Total time: 09:28 min
[windows-jdk7] [INFO] Finished at: 2018-10-10T18:07:16Z
[windows-jdk7] [INFO] Final Memory: 54M/452M
[windows-jdk7] [INFO] ------------------------------------------------------------------------
[windows-jdk7] [WARNING] The requested profile "run-its" could not be activated because it does not exist.
[windows-jdk7] [INFO] [jenkins-event-spy] Generated F:\jenkins\jenkins-slave\workspace\x_maven-wagon_wagon-scm-git-JFLMMYBLUJZHZUM4KST663ZOB5W6QQB2OF5JLK4YVV3OMUVRSJDA@tmp\withMaven3aaef66c\maven-spy-20181010-175748-25582361500809928842.log
[windows-jdk7] Picked up JAVA_TOOL_OPTIONS: -Dmaven.ext.class.path="f:\jenkins\jenkins-slave\workspace\x_maven-wagon_wagon-scm-git-JFLMMYBLUJZHZUM4KST663ZOB5W6QQB2OF5JLK4YVV3OMUVRSJDA@tmp\withMaven3aaef66c\pipeline-maven-spy.jar" -Dorg.jenkinsci.plugins.pipeline.maven.reportsFolder="f:\jenkins\jenkins-slave\workspace\x_maven-wagon_wagon-scm-git-JFLMMYBLUJZHZUM4KST663ZOB5W6QQB2OF5JLK4YVV3OMUVRSJDA@tmp\withMaven3aaef66c" 
[Pipeline] [windows-jdk7] }
[Pipeline] [windows-jdk7] // dir
[windows-jdk8] [INFO] Tests run: 69, Failures: 0, Errors: 0, Skipped: 0, Time elapsed: 30.728 s - in org.apache.maven.wagon.providers.webdav.WebDavsWagonTest
[windows-jdk8] [INFO] Running org.apache.maven.wagon.providers.webdav.WebDavWagonTest
[windows-jdk9] [INFO] Tests run: 69, Failures: 0, Errors: 0, Skipped: 0, Time elapsed: 26.651 s - in org.apache.maven.wagon.providers.webdav.WebDavWagonTest
[windows-jdk9] [INFO] 
[windows-jdk9] [INFO] Results:
[windows-jdk9] [INFO] 
[windows-jdk9] [INFO] Tests run: 145, Failures: 0, Errors: 0, Skipped: 0
[windows-jdk9] [INFO] 
[windows-jdk9] [INFO] 
[windows-jdk9] [INFO] --- maven-jar-plugin:3.0.2:jar (default-jar) @ wagon-webdav-jackrabbit ---
[windows-jdk9] [INFO] Building jar: F:\jenkins\jenkins-slave\workspace\x_maven-wagon_wagon-scm-git-JFLMMYBLUJZHZUM4KST663ZOB5W6QQB2OF5JLK4YVV3OMUVRSJDA\m\wagon-providers\wagon-webdav-jackrabbit\target\wagon-webdav-jackrabbit-3.1.0-SNAPSHOT.jar
[windows-jdk9] [INFO] 
[windows-jdk9] [INFO] --- maven-site-plugin:3.7:attach-descriptor (attach-descriptor) @ wagon-webdav-jackrabbit ---
[windows-jdk9] [INFO] Skipping because packaging 'jar' is not pom.
[windows-jdk9] [INFO] 
[windows-jdk9] [INFO] --- maven-checkstyle-plugin:3.0.0:check (checkstyle-check) @ wagon-webdav-jackrabbit ---
[windows-jdk9] [INFO] ------------------------------------------------------------------------
[windows-jdk9] [INFO] Reactor Summary:
[windows-jdk9] [INFO] 
[windows-jdk9] [INFO] Apache Maven Wagon ................................. SUCCESS [ 14.916 s]
[windows-jdk9] [INFO] Apache Maven Wagon :: API .......................... SUCCESS [  7.650 s]
[windows-jdk9] [INFO] Apache Maven Wagon :: Provider Test ................ SUCCESS [  2.724 s]
[windows-jdk9] [INFO] Apache Maven Wagon :: Providers .................... SUCCESS [  1.151 s]
[windows-jdk9] [INFO] Apache Maven Wagon :: Providers :: File Provider ... SUCCESS [  3.172 s]
[windows-jdk9] [INFO] Apache Maven Wagon :: Providers :: FTP Provider .... SUCCESS [  5.847 s]
[windows-jdk9] [INFO] Apache Maven Wagon :: Providers :: HTTP Shared Library SUCCESS [  4.268 s]
[windows-jdk9] [INFO] Apache Maven Wagon :: Test Compatibility Kits ...... SUCCESS [  1.148 s]
[windows-jdk9] [INFO] Apache Maven Wagon :: HTTP Test Compatibility Kit .. SUCCESS [  2.275 s]
[windows-jdk9] [INFO] Apache Maven Wagon :: Providers :: HTTP Provider ... SUCCESS [04:35 min]
[windows-jdk9] [INFO] Apache Maven Wagon :: Providers :: Lightweight HTTP Provider SUCCESS [02:08 min]
[windows-jdk9] [INFO] Apache Maven Wagon :: Providers :: SCM Provider .... SUCCESS [ 14.906 s]
[windows-jdk9] [INFO] Apache Maven Wagon :: Providers :: SSH Common Library SUCCESS [  2.311 s]
[windows-jdk9] [INFO] Apache Maven Wagon :: Providers :: SSH Common Tests  SUCCESS [  1.873 s]
[windows-jdk9] [INFO] Apache Maven Wagon :: Providers :: SSH External Provider SUCCESS [  1.385 s]
[windows-jdk9] [INFO] Apache Maven Wagon :: Providers :: SSH Provider .... SUCCESS [  2.083 s]
[windows-jdk9] [INFO] Apache Maven Wagon :: Providers :: WebDAV Provider . SUCCESS [01:02 min]
[windows-jdk9] [INFO] ------------------------------------------------------------------------
[windows-jdk9] [INFO] BUILD SUCCESS
[windows-jdk9] [INFO] ------------------------------------------------------------------------
[windows-jdk9] [INFO] Total time: 08:53 min
[windows-jdk9] [INFO] Finished at: 2018-10-10T18:07:20Z
[windows-jdk9] [INFO] Final Memory: 45M/151M
[windows-jdk9] [INFO] ------------------------------------------------------------------------
[windows-jdk9] [WARNING] The requested profile "run-its" could not be activated because it does not exist.
[windows-jdk9] [INFO] [jenkins-event-spy] Generated F:\jenkins\jenkins-slave\workspace\x_maven-wagon_wagon-scm-git-JFLMMYBLUJZHZUM4KST663ZOB5W6QQB2OF5JLK4YVV3OMUVRSJDA@tmp\withMavend6c6642c\maven-spy-20181010-175826-69114635551412183223965.log
[Pipeline] [windows-jdk7] }
[windows-jdk7] [withMaven] junitPublisher - Archive test results for Maven artifact org.apache.maven.wagon:wagon-provider-api:3.1.0-SNAPSHOT generated by maven-surefire-plugin:test (default-test): m\wagon-provider-api\target\surefire-reports\*.xml
[windows-jdk7] Recording test results
[windows-jdk7] [withMaven] junitPublisher - Archive test results for Maven artifact org.apache.maven.wagon:wagon-provider-test:3.1.0-SNAPSHOT generated by maven-surefire-plugin:test (default-test): m\wagon-provider-test\target\surefire-reports\*.xml
[windows-jdk7] Recording test results
[windows-jdk7] None of the test reports contained any result
[windows-jdk7] [withMaven] junitPublisher - Archive test results for Maven artifact org.apache.maven.wagon:wagon-file:3.1.0-SNAPSHOT generated by maven-surefire-plugin:test (default-test): m\wagon-providers\wagon-file\target\surefire-reports\*.xml
[windows-jdk7] Recording test results
[windows-jdk7] [withMaven] junitPublisher - Archive test results for Maven artifact org.apache.maven.wagon:wagon-ftp:3.1.0-SNAPSHOT generated by maven-surefire-plugin:test (default-test): m\wagon-providers\wagon-ftp\target\surefire-reports\*.xml
[windows-jdk7] Recording test results
[windows-jdk7] [withMaven] junitPublisher - Archive test results for Maven artifact org.apache.maven.wagon:wagon-http-shared:3.1.0-SNAPSHOT generated by maven-surefire-plugin:test (default-test): m\wagon-providers\wagon-http-shared\target\surefire-reports\*.xml
[windows-jdk7] Recording test results
[windows-jdk7] [withMaven] junitPublisher - Archive test results for Maven artifact org.apache.maven.wagon:wagon-tck-http:3.1.0-SNAPSHOT generated by maven-surefire-plugin:test (default-test): m\wagon-tcks\wagon-tck-http\target\surefire-reports\*.xml
[windows-jdk7] Recording test results
[windows-jdk7] None of the test reports contained any result
[windows-jdk7] [withMaven] junitPublisher - Archive test results for Maven artifact org.apache.maven.wagon:wagon-http:3.1.0-SNAPSHOT generated by maven-surefire-plugin:test (default-test): m\wagon-providers\wagon-http\target\surefire-reports\*.xml
[windows-jdk7] Recording test results
[windows-jdk7] [withMaven] junitPublisher - Archive test results for Maven artifact org.apache.maven.wagon:wagon-http-lightweight:3.1.0-SNAPSHOT generated by maven-surefire-plugin:test (default-test): m\wagon-providers\wagon-http-lightweight\target\surefire-reports\*.xml
[windows-jdk7] Recording test results
[windows-jdk7] [withMaven] junitPublisher - Archive test results for Maven artifact org.apache.maven.wagon:wagon-scm:3.1.0-SNAPSHOT generated by maven-surefire-plugin:test (default-test): m\wagon-providers\wagon-scm\target\surefire-reports\*.xml
[windows-jdk7] Recording test results
[windows-jdk7] [withMaven] junitPublisher - Archive test results for Maven artifact org.apache.maven.wagon:wagon-ssh-common:3.1.0-SNAPSHOT generated by maven-surefire-plugin:test (default-test): m\wagon-providers\wagon-ssh-common\target\surefire-reports\*.xml
[windows-jdk7] Recording test results
[windows-jdk7] [withMaven] junitPublisher - Archive test results for Maven artifact org.apache.maven.wagon:wagon-ssh-common-test:3.1.0-SNAPSHOT generated by maven-surefire-plugin:test (default-test): m\wagon-providers\wagon-ssh-common-test\target\surefire-reports\*.xml
[windows-jdk7] Recording test results
[windows-jdk7] None of the test reports contained any result
[windows-jdk7] [withMaven] junitPublisher - Archive test results for Maven artifact org.apache.maven.wagon:wagon-ssh-external:3.1.0-SNAPSHOT generated by maven-surefire-plugin:test (default-test): m\wagon-providers\wagon-ssh-external\target\surefire-reports\*.xml
[windows-jdk7] Recording test results
[windows-jdk7] None of the test reports contained any result
[windows-jdk7] [withMaven] junitPublisher - Archive test results for Maven artifact org.apache.maven.wagon:wagon-ssh:3.1.0-SNAPSHOT generated by maven-surefire-plugin:test (default-test): m\wagon-providers\wagon-ssh\target\surefire-reports\*.xml
[windows-jdk7] Recording test results
[windows-jdk7] None of the test reports contained any result
[windows-jdk7] [withMaven] junitPublisher - Archive test results for Maven artifact org.apache.maven.wagon:wagon-webdav-jackrabbit:3.1.0-SNAPSHOT generated by maven-surefire-plugin:test (default-test): m\wagon-providers\wagon-webdav-jackrabbit\target\surefire-reports\*.xml
[windows-jdk7] Recording test results
[Pipeline] [windows-jdk7] // withMaven
[Pipeline] [windows-jdk7] cleanWs
[Pipeline] [windows-jdk9] }
[Pipeline] [windows-jdk9] // dir
[windows-jdk7] [WS-CLEANUP] Deleting project workspace...[WS-CLEANUP] done
[Pipeline] [windows-jdk9] }
[windows-jdk9] [withMaven] junitPublisher - Archive test results for Maven artifact org.apache.maven.wagon:wagon-provider-api:3.1.0-SNAPSHOT generated by maven-surefire-plugin:test (default-test): m\wagon-provider-api\target\surefire-reports\*.xml
[windows-jdk9] Recording test results
[windows-jdk9] [withMaven] junitPublisher - Archive test results for Maven artifact org.apache.maven.wagon:wagon-provider-test:3.1.0-SNAPSHOT generated by maven-surefire-plugin:test (default-test): m\wagon-provider-test\target\surefire-reports\*.xml
[windows-jdk9] Recording test results
[windows-jdk9] None of the test reports contained any result
[windows-jdk9] [withMaven] junitPublisher - Archive test results for Maven artifact org.apache.maven.wagon:wagon-file:3.1.0-SNAPSHOT generated by maven-surefire-plugin:test (default-test): m\wagon-providers\wagon-file\target\surefire-reports\*.xml
[windows-jdk9] Recording test results
[windows-jdk9] [withMaven] junitPublisher - Archive test results for Maven artifact org.apache.maven.wagon:wagon-ftp:3.1.0-SNAPSHOT generated by maven-surefire-plugin:test (default-test): m\wagon-providers\wagon-ftp\target\surefire-reports\*.xml
[windows-jdk9] Recording test results
[windows-jdk9] [withMaven] junitPublisher - Archive test results for Maven artifact org.apache.maven.wagon:wagon-http-shared:3.1.0-SNAPSHOT generated by maven-surefire-plugin:test (default-test): m\wagon-providers\wagon-http-shared\target\surefire-reports\*.xml
[windows-jdk9] Recording test results
[windows-jdk9] [withMaven] junitPublisher - Archive test results for Maven artifact org.apache.maven.wagon:wagon-tck-http:3.1.0-SNAPSHOT generated by maven-surefire-plugin:test (default-test): m\wagon-tcks\wagon-tck-http\target\surefire-reports\*.xml
[windows-jdk9] Recording test results
[windows-jdk9] None of the test reports contained any result
[windows-jdk9] [withMaven] junitPublisher - Archive test results for Maven artifact org.apache.maven.wagon:wagon-http:3.1.0-SNAPSHOT generated by maven-surefire-plugin:test (default-test): m\wagon-providers\wagon-http\target\surefire-reports\*.xml
[windows-jdk9] Recording test results
[windows-jdk9] [withMaven] junitPublisher - Archive test results for Maven artifact org.apache.maven.wagon:wagon-http-lightweight:3.1.0-SNAPSHOT generated by maven-surefire-plugin:test (default-test): m\wagon-providers\wagon-http-lightweight\target\surefire-reports\*.xml
[windows-jdk9] Recording test results
[windows-jdk9] [withMaven] junitPublisher - Archive test results for Maven artifact org.apache.maven.wagon:wagon-scm:3.1.0-SNAPSHOT generated by maven-surefire-plugin:test (default-test): m\wagon-providers\wagon-scm\target\surefire-reports\*.xml
[windows-jdk9] Recording test results
[windows-jdk9] [withMaven] junitPublisher - Archive test results for Maven artifact org.apache.maven.wagon:wagon-ssh-common:3.1.0-SNAPSHOT generated by maven-surefire-plugin:test (default-test): m\wagon-providers\wagon-ssh-common\target\surefire-reports\*.xml
[windows-jdk9] Recording test results
[windows-jdk9] [withMaven] junitPublisher - Archive test results for Maven artifact org.apache.maven.wagon:wagon-ssh-common-test:3.1.0-SNAPSHOT generated by maven-surefire-plugin:test (default-test): m\wagon-providers\wagon-ssh-common-test\target\surefire-reports\*.xml
[windows-jdk9] Recording test results
[windows-jdk9] None of the test reports contained any result
[windows-jdk9] [withMaven] junitPublisher - Archive test results for Maven artifact org.apache.maven.wagon:wagon-ssh-external:3.1.0-SNAPSHOT generated by maven-surefire-plugin:test (default-test): m\wagon-providers\wagon-ssh-external\target\surefire-reports\*.xml
[windows-jdk9] Recording test results
[windows-jdk9] None of the test reports contained any result
[windows-jdk9] [withMaven] junitPublisher - Archive test results for Maven artifact org.apache.maven.wagon:wagon-ssh:3.1.0-SNAPSHOT generated by maven-surefire-plugin:test (default-test): m\wagon-providers\wagon-ssh\target\surefire-reports\*.xml
[windows-jdk9] Recording test results
[windows-jdk9] None of the test reports contained any result
[windows-jdk9] [withMaven] junitPublisher - Archive test results for Maven artifact org.apache.maven.wagon:wagon-webdav-jackrabbit:3.1.0-SNAPSHOT generated by maven-surefire-plugin:test (default-test): m\wagon-providers\wagon-webdav-jackrabbit\target\surefire-reports\*.xml
[windows-jdk9] Recording test results
[Pipeline] [windows-jdk9] // withMaven
[Pipeline] [windows-jdk7] }
[Pipeline] [windows-jdk9] cleanWs
[Pipeline] [windows-jdk7] // stage
[Pipeline] [windows-jdk7] }
[Pipeline] [windows-jdk7] // node
[windows-jdk9] [WS-CLEANUP] Deleting project workspace...[WS-CLEANUP] done
[Pipeline] [windows-jdk7] }
[Pipeline] [windows-jdk9] }
[Pipeline] [windows-jdk9] // stage
[Pipeline] [windows-jdk9] }
[Pipeline] [windows-jdk9] // node
[Pipeline] [windows-jdk9] }
[windows-jdk8] [INFO] Tests run: 69, Failures: 0, Errors: 0, Skipped: 0, Time elapsed: 27.612 s - in org.apache.maven.wagon.providers.webdav.WebDavWagonTest
[windows-jdk8] [INFO] 
[windows-jdk8] [INFO] Results:
[windows-jdk8] [INFO] 
[windows-jdk8] [INFO] Tests run: 145, Failures: 0, Errors: 0, Skipped: 0
[windows-jdk8] [INFO] 
[windows-jdk8] [INFO] 
[windows-jdk8] [INFO] --- maven-jar-plugin:3.0.2:jar (default-jar) @ wagon-webdav-jackrabbit ---
[windows-jdk8] [INFO] Building jar: F:\jenkins\jenkins-slave\workspace\x_maven-wagon_wagon-scm-git-JFLMMYBLUJZHZUM4KST663ZOB5W6QQB2OF5JLK4YVV3OMUVRSJDA@2\m\wagon-providers\wagon-webdav-jackrabbit\target\wagon-webdav-jackrabbit-3.1.0-SNAPSHOT.jar
[windows-jdk8] [INFO] 
[windows-jdk8] [INFO] --- maven-site-plugin:3.7:attach-descriptor (attach-descriptor) @ wagon-webdav-jackrabbit ---
[windows-jdk8] [INFO] Skipping because packaging 'jar' is not pom.
[windows-jdk8] [INFO] 
[windows-jdk8] [INFO] --- maven-checkstyle-plugin:3.0.0:check (checkstyle-check) @ wagon-webdav-jackrabbit ---
[windows-jdk8] [INFO] ------------------------------------------------------------------------
[windows-jdk8] [INFO] Reactor Summary:
[windows-jdk8] [INFO] 
[windows-jdk8] [INFO] Apache Maven Wagon ................................. SUCCESS [ 18.078 s]
[windows-jdk8] [INFO] Apache Maven Wagon :: API .......................... SUCCESS [  7.897 s]
[windows-jdk8] [INFO] Apache Maven Wagon :: Provider Test ................ SUCCESS [  3.149 s]
[windows-jdk8] [INFO] Apache Maven Wagon :: Providers .................... SUCCESS [  1.332 s]
[windows-jdk8] [INFO] Apache Maven Wagon :: Providers :: File Provider ... SUCCESS [  3.180 s]
[windows-jdk8] [INFO] Apache Maven Wagon :: Providers :: FTP Provider .... SUCCESS [  7.012 s]
[windows-jdk8] [INFO] Apache Maven Wagon :: Providers :: HTTP Shared Library SUCCESS [  3.632 s]
[windows-jdk8] [INFO] Apache Maven Wagon :: Test Compatibility Kits ...... SUCCESS [  1.101 s]
[windows-jdk8] [INFO] Apache Maven Wagon :: HTTP Test Compatibility Kit .. SUCCESS [  1.835 s]
[windows-jdk8] [INFO] Apache Maven Wagon :: Providers :: HTTP Provider ... SUCCESS [04:52 min]
[windows-jdk8] [INFO] Apache Maven Wagon :: Providers :: Lightweight HTTP Provider SUCCESS [02:12 min]
[windows-jdk8] [INFO] Apache Maven Wagon :: Providers :: SCM Provider .... SUCCESS [  9.550 s]
[windows-jdk8] [INFO] Apache Maven Wagon :: Providers :: SSH Common Library SUCCESS [  3.779 s]
[windows-jdk8] [INFO] Apache Maven Wagon :: Providers :: SSH Common Tests  SUCCESS [  3.200 s]
[windows-jdk8] [INFO] Apache Maven Wagon :: Providers :: SSH External Provider SUCCESS [  1.842 s]
[windows-jdk8] [INFO] Apache Maven Wagon :: Providers :: SSH Provider .... SUCCESS [  2.597 s]
[windows-jdk8] [INFO] Apache Maven Wagon :: Providers :: WebDAV Provider . SUCCESS [01:02 min]
[windows-jdk8] [INFO] ------------------------------------------------------------------------
[windows-jdk8] [INFO] BUILD SUCCESS
[windows-jdk8] [INFO] ------------------------------------------------------------------------
[windows-jdk8] [INFO] Total time: 09:19 min
[windows-jdk8] [INFO] Finished at: 2018-10-10T18:07:48Z
[windows-jdk8] [INFO] Final Memory: 96M/1019M
[windows-jdk8] [INFO] ------------------------------------------------------------------------
[windows-jdk8] [WARNING] The requested profile "run-its" could not be activated because it does not exist.
[windows-jdk8] [INFO] [jenkins-event-spy] Generated F:\jenkins\jenkins-slave\workspace\x_maven-wagon_wagon-scm-git-JFLMMYBLUJZHZUM4KST663ZOB5W6QQB2OF5JLK4YVV3OMUVRSJDA@2@tmp\withMaven46f3875d\maven-spy-20181010-175828-1398064913723425364909.log
[windows-jdk8] Picked up JAVA_TOOL_OPTIONS: -Dmaven.ext.class.path="f:\jenkins\jenkins-slave\workspace\x_maven-wagon_wagon-scm-git-JFLMMYBLUJZHZUM4KST663ZOB5W6QQB2OF5JLK4YVV3OMUVRSJDA@2@tmp\withMaven46f3875d\pipeline-maven-spy.jar" -Dorg.jenkinsci.plugins.pipeline.maven.reportsFolder="f:\jenkins\jenkins-slave\workspace\x_maven-wagon_wagon-scm-git-JFLMMYBLUJZHZUM4KST663ZOB5W6QQB2OF5JLK4YVV3OMUVRSJDA@2@tmp\withMaven46f3875d" 
[Pipeline] [windows-jdk8] }
[Pipeline] [windows-jdk8] // dir
[Pipeline] [windows-jdk8] }
[windows-jdk8] [withMaven] junitPublisher - Archive test results for Maven artifact org.apache.maven.wagon:wagon-provider-api:3.1.0-SNAPSHOT generated by maven-surefire-plugin:test (default-test): m\wagon-provider-api\target\surefire-reports\*.xml
[windows-jdk8] Recording test results
[windows-jdk8] [withMaven] junitPublisher - Archive test results for Maven artifact org.apache.maven.wagon:wagon-provider-test:3.1.0-SNAPSHOT generated by maven-surefire-plugin:test (default-test): m\wagon-provider-test\target\surefire-reports\*.xml
[windows-jdk8] Recording test results
[windows-jdk8] None of the test reports contained any result
[windows-jdk8] [withMaven] junitPublisher - Archive test results for Maven artifact org.apache.maven.wagon:wagon-file:3.1.0-SNAPSHOT generated by maven-surefire-plugin:test (default-test): m\wagon-providers\wagon-file\target\surefire-reports\*.xml
[windows-jdk8] Recording test results
[windows-jdk8] [withMaven] junitPublisher - Archive test results for Maven artifact org.apache.maven.wagon:wagon-ftp:3.1.0-SNAPSHOT generated by maven-surefire-plugin:test (default-test): m\wagon-providers\wagon-ftp\target\surefire-reports\*.xml
[windows-jdk8] Recording test results
[windows-jdk8] [withMaven] junitPublisher - Archive test results for Maven artifact org.apache.maven.wagon:wagon-http-shared:3.1.0-SNAPSHOT generated by maven-surefire-plugin:test (default-test): m\wagon-providers\wagon-http-shared\target\surefire-reports\*.xml
[windows-jdk8] Recording test results
[windows-jdk8] [withMaven] junitPublisher - Archive test results for Maven artifact org.apache.maven.wagon:wagon-tck-http:3.1.0-SNAPSHOT generated by maven-surefire-plugin:test (default-test): m\wagon-tcks\wagon-tck-http\target\surefire-reports\*.xml
[windows-jdk8] Recording test results
[windows-jdk8] None of the test reports contained any result
[windows-jdk8] [withMaven] junitPublisher - Archive test results for Maven artifact org.apache.maven.wagon:wagon-http:3.1.0-SNAPSHOT generated by maven-surefire-plugin:test (default-test): m\wagon-providers\wagon-http\target\surefire-reports\*.xml
[windows-jdk8] Recording test results
[windows-jdk8] [withMaven] junitPublisher - Archive test results for Maven artifact org.apache.maven.wagon:wagon-http-lightweight:3.1.0-SNAPSHOT generated by maven-surefire-plugin:test (default-test): m\wagon-providers\wagon-http-lightweight\target\surefire-reports\*.xml
[windows-jdk8] Recording test results
[windows-jdk8] [withMaven] junitPublisher - Archive test results for Maven artifact org.apache.maven.wagon:wagon-scm:3.1.0-SNAPSHOT generated by maven-surefire-plugin:test (default-test): m\wagon-providers\wagon-scm\target\surefire-reports\*.xml
[windows-jdk8] Recording test results
[windows-jdk8] [withMaven] junitPublisher - Archive test results for Maven artifact org.apache.maven.wagon:wagon-ssh-common:3.1.0-SNAPSHOT generated by maven-surefire-plugin:test (default-test): m\wagon-providers\wagon-ssh-common\target\surefire-reports\*.xml
[windows-jdk8] Recording test results
[windows-jdk8] [withMaven] junitPublisher - Archive test results for Maven artifact org.apache.maven.wagon:wagon-ssh-common-test:3.1.0-SNAPSHOT generated by maven-surefire-plugin:test (default-test): m\wagon-providers\wagon-ssh-common-test\target\surefire-reports\*.xml
[windows-jdk8] Recording test results
[windows-jdk8] None of the test reports contained any result
[windows-jdk8] [withMaven] junitPublisher - Archive test results for Maven artifact org.apache.maven.wagon:wagon-ssh-external:3.1.0-SNAPSHOT generated by maven-surefire-plugin:test (default-test): m\wagon-providers\wagon-ssh-external\target\surefire-reports\*.xml
[windows-jdk8] Recording test results
[windows-jdk8] None of the test reports contained any result
[windows-jdk8] [withMaven] junitPublisher - Archive test results for Maven artifact org.apache.maven.wagon:wagon-ssh:3.1.0-SNAPSHOT generated by maven-surefire-plugin:test (default-test): m\wagon-providers\wagon-ssh\target\surefire-reports\*.xml
[windows-jdk8] Recording test results
[windows-jdk8] None of the test reports contained any result
[windows-jdk8] [withMaven] junitPublisher - Archive test results for Maven artifact org.apache.maven.wagon:wagon-webdav-jackrabbit:3.1.0-SNAPSHOT generated by maven-surefire-plugin:test (default-test): m\wagon-providers\wagon-webdav-jackrabbit\target\surefire-reports\*.xml
[windows-jdk8] Recording test results
[Pipeline] [windows-jdk8] // withMaven
[Pipeline] [windows-jdk8] cleanWs
[windows-jdk8] [WS-CLEANUP] Deleting project workspace...[WS-CLEANUP] done
[Pipeline] [windows-jdk8] }
[Pipeline] [windows-jdk8] // stage
[Pipeline] [windows-jdk8] }
[Pipeline] [windows-jdk8] // node
[Pipeline] [windows-jdk8] }
[Pipeline] // parallel
[Pipeline] stage
[Pipeline] { (Notifications)
[Pipeline] echo
Build result: FAILURE
[Pipeline] jiraIssueSelector
[Pipeline] emailext
Mime
  • Unnamed multipart/mixed (inline, None, 0 bytes)
View raw message