maven-notifications mailing list archives

Site index · List index
Message view « Date » · « Thread »
Top « Date » · « Thread »
From Apache Jenkins Server <jenk...@builds.apache.org>
Subject Build unstable in Jenkins: Maven TLP » maven-plugin-tools » jdk11_asm7 #7
Date Wed, 03 Oct 2018 23:18:44 GMT
See https://builds.apache.org/job/maven-box/job/maven-plugin-tools/job/jdk11_asm7/7/

Changes:

* some java7 sugar syntax and fix some checkstyle
* some java7 sugar syntax and fix some checkstyle
* some java7 sugar syntax and fix some checkstyle
* some java7 sugar syntax and fix some checkstyle
* some java7 sugar syntax and fix some checkstyle
* some java7 sugar syntax and fix some checkstyle
* some java7 sugar syntax and fix some checkstyle

2 tests failed.
FAILED:  org.apache.maven.tools.plugin.generator.PluginDescriptorGeneratorTest.testGenerator

Error Message:
C:\Users\jenkins\AppData\Local\Temp\2\testGenerator-outDir\plugin.xml (The system cannot find the path specified)

Stack Trace:
java.io.FileNotFoundException: C:\Users\jenkins\AppData\Local\Temp\2\testGenerator-outDir\plugin.xml (The system cannot find the path specified)
	at java.io.FileInputStream.open(Native Method)
	at java.io.FileInputStream.<init>(FileInputStream.java:146)
	at org.codehaus.plexus.util.xml.XmlReader.<init>(XmlReader.java:124)
	at org.codehaus.plexus.util.xml.XmlStreamReader.<init>(XmlStreamReader.java:67)
	at org.codehaus.plexus.util.ReaderFactory.newXmlReader(ReaderFactory.java:118)
	at org.apache.maven.tools.plugin.generator.PluginDescriptorGeneratorTest.readFile(PluginDescriptorGeneratorTest.java:83)
	at org.apache.maven.tools.plugin.generator.PluginDescriptorGeneratorTest.validate(PluginDescriptorGeneratorTest.java:50)
	at org.apache.maven.tools.plugin.generator.AbstractGeneratorTestCase.testGenerator(AbstractGeneratorTestCase.java:121)
	at sun.reflect.NativeMethodAccessorImpl.invoke0(Native Method)
	at sun.reflect.NativeMethodAccessorImpl.invoke(NativeMethodAccessorImpl.java:57)
	at sun.reflect.DelegatingMethodAccessorImpl.invoke(DelegatingMethodAccessorImpl.java:43)
	at java.lang.reflect.Method.invoke(Method.java:606)
	at junit.framework.TestCase.runTest(TestCase.java:164)
	at junit.framework.TestCase.runBare(TestCase.java:130)
	at junit.framework.TestResult$1.protect(TestResult.java:106)
	at junit.framework.TestResult.runProtected(TestResult.java:124)
	at junit.framework.TestResult.run(TestResult.java:109)
	at junit.framework.TestCase.run(TestCase.java:120)
	at junit.framework.TestSuite.runTest(TestSuite.java:230)
	at junit.framework.TestSuite.run(TestSuite.java:225)
	at sun.reflect.NativeMethodAccessorImpl.invoke0(Native Method)
	at sun.reflect.NativeMethodAccessorImpl.invoke(NativeMethodAccessorImpl.java:57)
	at sun.reflect.DelegatingMethodAccessorImpl.invoke(DelegatingMethodAccessorImpl.java:43)
	at java.lang.reflect.Method.invoke(Method.java:606)
	at org.apache.maven.surefire.junit.JUnitTestSet.execute(JUnitTestSet.java:100)
	at org.apache.maven.surefire.junit.JUnit3Provider.executeTestSet(JUnit3Provider.java:140)
	at org.apache.maven.surefire.junit.JUnit3Provider.invoke(JUnit3Provider.java:113)
	at org.apache.maven.surefire.booter.ForkedBooter.invokeProviderInSameClassLoader(ForkedBooter.java:383)
	at org.apache.maven.surefire.booter.ForkedBooter.runSuitesInProcess(ForkedBooter.java:344)
	at org.apache.maven.surefire.booter.ForkedBooter.execute(ForkedBooter.java:125)
	at org.apache.maven.surefire.booter.ForkedBooter.main(ForkedBooter.java:417)


FAILED:  org.apache.maven.tools.plugin.generator.PluginXdocGeneratorTest.testGenerator

Error Message:
File C:\Users\jenkins\AppData\Local\Temp\1\testGenerator-outDir\plugin.xml unable to be deleted.

Stack Trace:
java.io.IOException: File C:\Users\jenkins\AppData\Local\Temp\1\testGenerator-outDir\plugin.xml unable to be deleted.
	at org.codehaus.plexus.util.FileUtils.forceDelete(FileUtils.java:1414)
	at org.codehaus.plexus.util.FileUtils.cleanDirectory(FileUtils.java:1672)
	at org.codehaus.plexus.util.FileUtils.deleteDirectory(FileUtils.java:1618)
	at org.apache.maven.tools.plugin.generator.AbstractGeneratorTestCase.testGenerator(AbstractGeneratorTestCase.java:123)
	at java.base/jdk.internal.reflect.NativeMethodAccessorImpl.invoke0(Native Method)
	at java.base/jdk.internal.reflect.NativeMethodAccessorImpl.invoke(NativeMethodAccessorImpl.java:62)
	at java.base/jdk.internal.reflect.DelegatingMethodAccessorImpl.invoke(DelegatingMethodAccessorImpl.java:43)
	at java.base/java.lang.reflect.Method.invoke(Method.java:564)
	at junit.framework.TestCase.runTest(TestCase.java:164)
	at junit.framework.TestCase.runBare(TestCase.java:130)
	at junit.framework.TestResult$1.protect(TestResult.java:106)
	at junit.framework.TestResult.runProtected(TestResult.java:124)
	at junit.framework.TestResult.run(TestResult.java:109)
	at junit.framework.TestCase.run(TestCase.java:120)
	at junit.framework.TestSuite.runTest(TestSuite.java:230)
	at junit.framework.TestSuite.run(TestSuite.java:225)
	at java.base/jdk.internal.reflect.NativeMethodAccessorImpl.invoke0(Native Method)
	at java.base/jdk.internal.reflect.NativeMethodAccessorImpl.invoke(NativeMethodAccessorImpl.java:62)
	at java.base/jdk.internal.reflect.DelegatingMethodAccessorImpl.invoke(DelegatingMethodAccessorImpl.java:43)
	at java.base/java.lang.reflect.Method.invoke(Method.java:564)
	at org.apache.maven.surefire.junit.JUnitTestSet.execute(JUnitTestSet.java:100)
	at org.apache.maven.surefire.junit.JUnit3Provider.executeTestSet(JUnit3Provider.java:140)
	at org.apache.maven.surefire.junit.JUnit3Provider.invoke(JUnit3Provider.java:113)
	at org.apache.maven.surefire.booter.ForkedBooter.invokeProviderInSameClassLoader(ForkedBooter.java:383)
	at org.apache.maven.surefire.booter.ForkedBooter.runSuitesInProcess(ForkedBooter.java:344)
	at org.apache.maven.surefire.booter.ForkedBooter.execute(ForkedBooter.java:125)
	at org.apache.maven.surefire.booter.ForkedBooter.main(ForkedBooter.java:417)




Build log:
[...truncated 7.58 MB...]
[linux-jdk9-m3.5.x_build] [INFO] Build Summary:
[linux-jdk9-m3.5.x_build] [INFO]   Passed: 33, Failed: 0, Errors: 0, Skipped: 2
[linux-jdk9-m3.5.x_build] [INFO] -------------------------------------------------
[linux-jdk9-m3.5.x_build] [INFO] 
[linux-jdk9-m3.5.x_build] [INFO] --- maven-checkstyle-plugin:3.0.0:check (checkstyle-check) @ maven-plugin-plugin ---
[linux-jdk9-m3.5.x_build] [INFO] ------------------------------------------------------------------------
[linux-jdk9-m3.5.x_build] [INFO] Reactor Summary:
[linux-jdk9-m3.5.x_build] [INFO] 
[linux-jdk9-m3.5.x_build] [INFO] Maven Plugin Tools 3.6.0-SNAPSHOT .................. SUCCESS [ 14.990 s]
[linux-jdk9-m3.5.x_build] [INFO] Maven Plugin Tools Extractor API ................... SUCCESS [  8.583 s]
[linux-jdk9-m3.5.x_build] [INFO] Maven Plugin Tools Generators ...................... SUCCESS [  5.975 s]
[linux-jdk9-m3.5.x_build] [INFO] Maven Plugin Tool for Java with Javadoc Tags ....... SUCCESS [  5.002 s]
[linux-jdk9-m3.5.x_build] [INFO] Maven Plugin Tools Java Annotations ................ SUCCESS [  0.807 s]
[linux-jdk9-m3.5.x_build] [INFO] Maven Plugin Tool for Java with Annotations ........ SUCCESS [  4.104 s]
[linux-jdk9-m3.5.x_build] [INFO] Maven Script Mojo Support .......................... SUCCESS [  0.536 s]
[linux-jdk9-m3.5.x_build] [INFO] Maven Plugin Metadata Model ........................ SUCCESS [  2.836 s]
[linux-jdk9-m3.5.x_build] [INFO] Maven Plugin Tool for Ant .......................... SUCCESS [  1.990 s]
[linux-jdk9-m3.5.x_build] [INFO] Maven Ant Mojo Support ............................. SUCCESS [  3.817 s]
[linux-jdk9-m3.5.x_build] [INFO] Maven Plugin Tool for Beanshell .................... SUCCESS [  1.045 s]
[linux-jdk9-m3.5.x_build] [INFO] Maven Beanshell Mojo Support ....................... SUCCESS [  0.586 s]
[linux-jdk9-m3.5.x_build] [INFO] Maven Plugin Plugin 3.6.0-SNAPSHOT ................. SUCCESS [06:23 min]
[linux-jdk9-m3.5.x_build] [INFO] ------------------------------------------------------------------------
[linux-jdk9-m3.5.x_build] [INFO] BUILD SUCCESS
[linux-jdk9-m3.5.x_build] [INFO] ------------------------------------------------------------------------
[linux-jdk9-m3.5.x_build] [INFO] Total time: 07:14 min
[linux-jdk9-m3.5.x_build] [INFO] Finished at: 2018-10-03T23:16:56Z
[linux-jdk9-m3.5.x_build] [INFO] ------------------------------------------------------------------------
[linux-jdk9-m3.5.x_build] [INFO] [jenkins-event-spy] Generated /home/jenkins/jenkins-slave/workspace/ven-plugin-tools_jdk11_asm7-J7667H6X6V4EBCRWUSKUMW4LMBBFILIHPFM47RV7V2XYHJFAOARA@tmp/withMavend1f399fd/maven-spy-20181003-230941-5743833061359221625787.log
[Pipeline] [linux-jdk9-m3.5.x_build] }
[Pipeline] [linux-jdk9-m3.5.x_build] // dir
[linux-jdk11-m3.5.x_build] [INFO] run post-build script verify.groovy
[linux-jdk11-m3.5.x_build] [INFO]           fix-maven-since-3.x/pom.xml ...................... SUCCESS (15.2 s)
[linux-jdk11-m3.5.x_build] [INFO] Building: packaging-jar/pom.xml
[linux-jdk11-m3.5.x_build] [INFO] run post-build script verify.groovy
[linux-jdk11-m3.5.x_build] [INFO]           packaging-jar/pom.xml ............................ SUCCESS (7.4 s)
[linux-jdk11-m3.5.x_build] [INFO] Building: ignore-plugin-class-realm/pom.xml
[linux-jdk11-m3.5.x_build] [INFO]           ignore-plugin-class-realm/pom.xml ................ SUCCESS (9.8 s)
[linux-jdk11-m3.5.x_build] [INFO] Building: java-basic-annotations-jdk8/pom.xml
[linux-jdk11-m3.5.x_build] [INFO] run post-build script verify.groovy
[linux-jdk11-m3.5.x_build] [INFO]           java-basic-annotations-jdk8/pom.xml .............. SUCCESS (14.1 s)
[linux-jdk11-m3.5.x_build] [INFO] Building: annotation-with-inheritance-from-deps/pom.xml
[Pipeline] [linux-jdk9-m3.5.x_build] }
[linux-jdk9-m3.5.x_build] [withMaven] artifactsPublisher - Archive artifact linux-jdk9-m3.5.x_build/pom.xml under org/apache/maven/plugin-tools/maven-plugin-tools/3.6.0-SNAPSHOT/maven-plugin-tools-3.6.0-SNAPSHOT.pom
[linux-jdk9-m3.5.x_build] [withMaven] artifactsPublisher - Archive artifact linux-jdk9-m3.5.x_build/target/maven-plugin-tools-3.6.0-SNAPSHOT-site.xml under org/apache/maven/plugin-tools/maven-plugin-tools/3.6.0-SNAPSHOT/maven-plugin-tools-3.6.0-SNAPSHOT-site.xml
[linux-jdk9-m3.5.x_build] [withMaven] artifactsPublisher - Archive artifact linux-jdk9-m3.5.x_build/maven-plugin-tools-api/pom.xml under org/apache/maven/plugin-tools/maven-plugin-tools-api/3.6.0-SNAPSHOT/maven-plugin-tools-api-3.6.0-SNAPSHOT.pom
[linux-jdk9-m3.5.x_build] [withMaven] artifactsPublisher - Archive artifact linux-jdk9-m3.5.x_build/maven-plugin-tools-api/target/maven-plugin-tools-api-3.6.0-SNAPSHOT.jar under org/apache/maven/plugin-tools/maven-plugin-tools-api/3.6.0-SNAPSHOT/maven-plugin-tools-api-3.6.0-SNAPSHOT.jar
[linux-jdk9-m3.5.x_build] [withMaven] artifactsPublisher - Archive artifact linux-jdk9-m3.5.x_build/maven-plugin-tools-generators/pom.xml under org/apache/maven/plugin-tools/maven-plugin-tools-generators/3.6.0-SNAPSHOT/maven-plugin-tools-generators-3.6.0-SNAPSHOT.pom
[linux-jdk9-m3.5.x_build] [withMaven] artifactsPublisher - Archive artifact linux-jdk9-m3.5.x_build/maven-plugin-tools-generators/target/maven-plugin-tools-generators-3.6.0-SNAPSHOT.jar under org/apache/maven/plugin-tools/maven-plugin-tools-generators/3.6.0-SNAPSHOT/maven-plugin-tools-generators-3.6.0-SNAPSHOT.jar
[linux-jdk9-m3.5.x_build] [withMaven] artifactsPublisher - Archive artifact linux-jdk9-m3.5.x_build/maven-plugin-tools-java/pom.xml under org/apache/maven/plugin-tools/maven-plugin-tools-java/3.6.0-SNAPSHOT/maven-plugin-tools-java-3.6.0-SNAPSHOT.pom
[linux-jdk9-m3.5.x_build] [withMaven] artifactsPublisher - Archive artifact linux-jdk9-m3.5.x_build/maven-plugin-tools-java/target/maven-plugin-tools-java-3.6.0-SNAPSHOT.jar under org/apache/maven/plugin-tools/maven-plugin-tools-java/3.6.0-SNAPSHOT/maven-plugin-tools-java-3.6.0-SNAPSHOT.jar
[linux-jdk9-m3.5.x_build] [withMaven] artifactsPublisher - Archive artifact linux-jdk9-m3.5.x_build/maven-plugin-annotations/pom.xml under org/apache/maven/plugin-tools/maven-plugin-annotations/3.6.0-SNAPSHOT/maven-plugin-annotations-3.6.0-SNAPSHOT.pom
[linux-jdk9-m3.5.x_build] [withMaven] artifactsPublisher - Archive artifact linux-jdk9-m3.5.x_build/maven-plugin-annotations/target/maven-plugin-annotations-3.6.0-SNAPSHOT.jar under org/apache/maven/plugin-tools/maven-plugin-annotations/3.6.0-SNAPSHOT/maven-plugin-annotations-3.6.0-SNAPSHOT.jar
[linux-jdk9-m3.5.x_build] [withMaven] artifactsPublisher - Archive artifact linux-jdk9-m3.5.x_build/maven-plugin-tools-annotations/pom.xml under org/apache/maven/plugin-tools/maven-plugin-tools-annotations/3.6.0-SNAPSHOT/maven-plugin-tools-annotations-3.6.0-SNAPSHOT.pom
[linux-jdk9-m3.5.x_build] [withMaven] artifactsPublisher - Archive artifact linux-jdk9-m3.5.x_build/maven-plugin-tools-annotations/target/maven-plugin-tools-annotations-3.6.0-SNAPSHOT.jar under org/apache/maven/plugin-tools/maven-plugin-tools-annotations/3.6.0-SNAPSHOT/maven-plugin-tools-annotations-3.6.0-SNAPSHOT.jar
[linux-jdk9-m3.5.x_build] [withMaven] artifactsPublisher - Archive artifact linux-jdk9-m3.5.x_build/maven-plugin-tools-annotations/target/maven-plugin-tools-annotations-3.6.0-SNAPSHOT-tests.jar under org/apache/maven/plugin-tools/maven-plugin-tools-annotations/3.6.0-SNAPSHOT/maven-plugin-tools-annotations-3.6.0-SNAPSHOT-tests.jar
[linux-jdk9-m3.5.x_build] [withMaven] artifactsPublisher - Archive artifact linux-jdk9-m3.5.x_build/maven-plugin-tools-annotations/target/maven-plugin-tools-annotations-3.6.0-SNAPSHOT-test-sources.jar under org/apache/maven/plugin-tools/maven-plugin-tools-annotations/3.6.0-SNAPSHOT/maven-plugin-tools-annotations-3.6.0-SNAPSHOT-test-sources.jar
[linux-jdk9-m3.5.x_build] [withMaven] artifactsPublisher - Archive artifact linux-jdk9-m3.5.x_build/maven-script/pom.xml under org/apache/maven/plugin-tools/maven-script/3.6.0-SNAPSHOT/maven-script-3.6.0-SNAPSHOT.pom
[linux-jdk9-m3.5.x_build] [withMaven] artifactsPublisher - Archive artifact linux-jdk9-m3.5.x_build/maven-script/target/maven-script-3.6.0-SNAPSHOT-site.xml under org/apache/maven/plugin-tools/maven-script/3.6.0-SNAPSHOT/maven-script-3.6.0-SNAPSHOT-site.xml
[linux-jdk9-m3.5.x_build] [withMaven] artifactsPublisher - Archive artifact linux-jdk9-m3.5.x_build/maven-script/maven-plugin-tools-model/pom.xml under org/apache/maven/plugin-tools/maven-plugin-tools-model/3.6.0-SNAPSHOT/maven-plugin-tools-model-3.6.0-SNAPSHOT.pom
[linux-jdk9-m3.5.x_build] [withMaven] artifactsPublisher - Archive artifact linux-jdk9-m3.5.x_build/maven-script/maven-plugin-tools-model/target/maven-plugin-tools-model-3.6.0-SNAPSHOT.jar under org/apache/maven/plugin-tools/maven-plugin-tools-model/3.6.0-SNAPSHOT/maven-plugin-tools-model-3.6.0-SNAPSHOT.jar
[linux-jdk9-m3.5.x_build] [withMaven] artifactsPublisher - Archive artifact linux-jdk9-m3.5.x_build/maven-script/maven-plugin-tools-ant/pom.xml under org/apache/maven/plugin-tools/maven-plugin-tools-ant/3.6.0-SNAPSHOT/maven-plugin-tools-ant-3.6.0-SNAPSHOT.pom
[linux-jdk9-m3.5.x_build] [withMaven] artifactsPublisher - Archive artifact linux-jdk9-m3.5.x_build/maven-script/maven-plugin-tools-ant/target/maven-plugin-tools-ant-3.6.0-SNAPSHOT.jar under org/apache/maven/plugin-tools/maven-plugin-tools-ant/3.6.0-SNAPSHOT/maven-plugin-tools-ant-3.6.0-SNAPSHOT.jar
[linux-jdk9-m3.5.x_build] [withMaven] artifactsPublisher - Archive artifact linux-jdk9-m3.5.x_build/maven-script/maven-script-ant/pom.xml under org/apache/maven/plugin-tools/maven-script-ant/3.6.0-SNAPSHOT/maven-script-ant-3.6.0-SNAPSHOT.pom
[linux-jdk9-m3.5.x_build] [withMaven] artifactsPublisher - Archive artifact linux-jdk9-m3.5.x_build/maven-script/maven-script-ant/target/maven-script-ant-3.6.0-SNAPSHOT.jar under org/apache/maven/plugin-tools/maven-script-ant/3.6.0-SNAPSHOT/maven-script-ant-3.6.0-SNAPSHOT.jar
[linux-jdk9-m3.5.x_build] [withMaven] artifactsPublisher - Archive artifact linux-jdk9-m3.5.x_build/maven-script/maven-plugin-tools-beanshell/pom.xml under org/apache/maven/plugin-tools/maven-plugin-tools-beanshell/3.6.0-SNAPSHOT/maven-plugin-tools-beanshell-3.6.0-SNAPSHOT.pom
[linux-jdk9-m3.5.x_build] [withMaven] artifactsPublisher - Archive artifact linux-jdk9-m3.5.x_build/maven-script/maven-plugin-tools-beanshell/target/maven-plugin-tools-beanshell-3.6.0-SNAPSHOT.jar under org/apache/maven/plugin-tools/maven-plugin-tools-beanshell/3.6.0-SNAPSHOT/maven-plugin-tools-beanshell-3.6.0-SNAPSHOT.jar
[linux-jdk9-m3.5.x_build] [withMaven] artifactsPublisher - Archive artifact linux-jdk9-m3.5.x_build/maven-script/maven-script-beanshell/pom.xml under org/apache/maven/plugin-tools/maven-script-beanshell/3.6.0-SNAPSHOT/maven-script-beanshell-3.6.0-SNAPSHOT.pom
[linux-jdk9-m3.5.x_build] [withMaven] artifactsPublisher - Archive artifact linux-jdk9-m3.5.x_build/maven-script/maven-script-beanshell/target/maven-script-beanshell-3.6.0-SNAPSHOT.jar under org/apache/maven/plugin-tools/maven-script-beanshell/3.6.0-SNAPSHOT/maven-script-beanshell-3.6.0-SNAPSHOT.jar
[linux-jdk9-m3.5.x_build] [withMaven] artifactsPublisher - Archive artifact linux-jdk9-m3.5.x_build/maven-plugin-plugin/pom.xml under org/apache/maven/plugins/maven-plugin-plugin/3.6.0-SNAPSHOT/maven-plugin-plugin-3.6.0-SNAPSHOT.pom
[linux-jdk9-m3.5.x_build] [withMaven] artifactsPublisher - Archive artifact linux-jdk9-m3.5.x_build/maven-plugin-plugin/target/maven-plugin-plugin-3.6.0-SNAPSHOT.jar under org/apache/maven/plugins/maven-plugin-plugin/3.6.0-SNAPSHOT/maven-plugin-plugin-3.6.0-SNAPSHOT.jar
[linux-jdk9-m3.5.x_build] [withMaven] invokerPublisher - Archive invoker results for Maven artifact MavenArtifact{org.apache.maven.plugins:maven-plugin-plugin::3.6.0-SNAPSHOT(version: 3.6.0-SNAPSHOT, snapshot:false) } generated by PluginInvocation{org.apache.maven.plugins:maven-invoker-plugin:3.0.1@run  integration-test}: linux-jdk9-m3.5.x_build/maven-plugin-plugin/target/invoker-reports/*.xml
[linux-jdk9-m3.5.x_build] performing MavenInvokerRecorder, reportsFilenamePattern:'**/linux-jdk9-m3.5.x_build/maven-plugin-plugin/target/invoker-reports/BUILD*.xml', invokerBuildDir:'**/linux-jdk9-m3.5.x_build/maven-plugin-plugin/target/it'
[linux-jdk9-m3.5.x_build] Found reports:[/home/jenkins/jenkins-slave/workspace/ven-plugin-tools_jdk11_asm7-J7667H6X6V4EBCRWUSKUMW4LMBBFILIHPFM47RV7V2XYHJFAOARA/linux-jdk9-m3.5.x_build/maven-plugin-plugin/target/invoker-reports/BUILD-annotation-with-inheritance-from-deps.xml, /home/jenkins/jenkins-slave/workspace/ven-plugin-tools_jdk11_asm7-J7667H6X6V4EBCRWUSKUMW4LMBBFILIHPFM47RV7V2XYHJFAOARA/linux-jdk9-m3.5.x_build/maven-plugin-plugin/target/invoker-reports/BUILD-annotation-with-inheritance-reactor.xml, /home/jenkins/jenkins-slave/workspace/ven-plugin-tools_jdk11_asm7-J7667H6X6V4EBCRWUSKUMW4LMBBFILIHPFM47RV7V2XYHJFAOARA/linux-jdk9-m3.5.x_build/maven-plugin-plugin/target/invoker-reports/BUILD-annotation-with-inheritance.xml, /home/jenkins/jenkins-slave/workspace/ven-plugin-tools_jdk11_asm7-J7667H6X6V4EBCRWUSKUMW4LMBBFILIHPFM47RV7V2XYHJFAOARA/linux-jdk9-m3.5.x_build/maven-plugin-plugin/target/invoker-reports/BUILD-ant-basic.xml, /home/jenkins/jenkins-slave/workspace/ven-plugin-tools_jdk11_asm7-J7667H6X6V4EBCRWUSKUMW4LMBBFILIHPFM47RV7V2XYHJFAOARA/linux-jdk9-m3.5.x_build/maven-plugin-plugin/target/invoker-reports/BUILD-ant-reference-parameter.xml, /home/jenkins/jenkins-slave/workspace/ven-plugin-tools_jdk11_asm7-J7667H6X6V4EBCRWUSKUMW4LMBBFILIHPFM47RV7V2XYHJFAOARA/linux-jdk9-m3.5.x_build/maven-plugin-plugin/target/invoker-reports/BUILD-ant-simple-usage.xml, /home/jenkins/jenkins-slave/workspace/ven-plugin-tools_jdk11_asm7-J7667H6X6V4EBCRWUSKUMW4LMBBFILIHPFM47RV7V2XYHJFAOARA/linux-jdk9-m3.5.x_build/maven-plugin-plugin/target/invoker-reports/BUILD-ant-since-maven-plugin.xml, /home/jenkins/jenkins-slave/workspace/ven-plugin-tools_jdk11_asm7-J7667H6X6V4EBCRWUSKUMW4LMBBFILIHPFM47RV7V2XYHJFAOARA/linux-jdk9-m3.5.x_build/maven-plugin-plugin/target/invoker-reports/BUILD-asm-failure.xml, /home/jenkins/jenkins-slave/workspace/ven-plugin-tools_jdk11_asm7-J7667H6X6V4EBCRWUSKUMW4LMBBFILIHPFM47RV7V2XYHJFAOARA/linux-jdk9-m3.5.x_build/maven-plugin-plugin/target/invoker-reports/BUILD-beanshell-simple.xml, /home/jenkins/jenkins-slave/workspace/ven-plugin-tools_jdk11_asm7-J7667H6X6V4EBCRWUSKUMW4LMBBFILIHPFM47RV7V2XYHJFAOARA/linux-jdk9-m3.5.x_build/maven-plugin-plugin/target/invoker-reports/BUILD-fix-maven-since-3.x.xml, /home/jenkins/jenkins-slave/workspace/ven-plugin-tools_jdk11_asm7-J7667H6X6V4EBCRWUSKUMW4LMBBFILIHPFM47RV7V2XYHJFAOARA/linux-jdk9-m3.5.x_build/maven-plugin-plugin/target/invoker-reports/BUILD-help-basic-jdk11.xml, /home/jenkins/jenkins-slave/workspace/ven-plugin-tools_jdk11_asm7-J7667H6X6V4EBCRWUSKUMW4LMBBFILIHPFM47RV7V2XYHJFAOARA/linux-jdk9-m3.5.x_build/maven-plugin-plugin/target/invoker-reports/BUILD-help-basic.xml, /home/jenkins/jenkins-slave/workspace/ven-plugin-tools_jdk11_asm7-J7667H6X6V4EBCRWUSKUMW4LMBBFILIHPFM47RV7V2XYHJFAOARA/linux-jdk9-m3.5.x_build/maven-plugin-plugin/target/invoker-reports/BUILD-help-package.xml, /home/jenkins/jenkins-slave/workspace/ven-plugin-tools_jdk11_asm7-J7667H6X6V4EBCRWUSKUMW4LMBBFILIHPFM47RV7V2XYHJFAOARA/linux-jdk9-m3.5.x_build/maven-plugin-plugin/target/invoker-reports/BUILD-ignore-plugin-class-realm.xml, /home/jenkins/jenkins-slave/workspace/ven-plugin-tools_jdk11_asm7-J7667H6X6V4EBCRWUSKUMW4LMBBFILIHPFM47RV7V2XYHJFAOARA/linux-jdk9-m3.5.x_build/maven-plugin-plugin/target/invoker-reports/BUILD-java-basic-annotations-jdk11.xml, /home/jenkins/jenkins-slave/workspace/ven-plugin-tools_jdk11_asm7-J7667H6X6V4EBCRWUSKUMW4LMBBFILIHPFM47RV7V2XYHJFAOARA/linux-jdk9-m3.5.x_build/maven-plugin-plugin/target/invoker-reports/BUILD-java-basic-annotations-jdk8.xml, /home/jenkins/jenkins-slave/workspace/ven-plugin-tools_jdk11_asm7-J7667H6X6V4EBCRWUSKUMW4LMBBFILIHPFM47RV7V2XYHJFAOARA/linux-jdk9-m3.5.x_build/maven-plugin-plugin/target/invoker-reports/BUILD-java-basic-annotations.xml, /home/jenkins/jenkins-slave/workspace/ven-plugin-tools_jdk11_asm7-J7667H6X6V4EBCRWUSKUMW4LMBBFILIHPFM47RV7V2XYHJFAOARA/linux-jdk9-m3.5.x_build/maven-plugin-plugin/target/invoker-reports/BUILD-java-basic.xml, /home/jenkins/jenkins-slave/workspace/ven-plugin-tools_jdk11_asm7-J7667H6X6V4EBCRWUSKUMW4LMBBFILIHPFM47RV7V2XYHJFAOARA/linux-jdk9-m3.5.x_build/maven-plugin-plugin/target/invoker-reports/BUILD-mplugin-187.xml, /home/jenkins/jenkins-slave/workspace/ven-plugin-tools_jdk11_asm7-J7667H6X6V4EBCRWUSKUMW4LMBBFILIHPFM47RV7V2XYHJFAOARA/linux-jdk9-m3.5.x_build/maven-plugin-plugin/target/invoker-reports/BUILD-mplugin-191.xml, /home/jenkins/jenkins-slave/workspace/ven-plugin-tools_jdk11_asm7-J7667H6X6V4EBCRWUSKUMW4LMBBFILIHPFM47RV7V2XYHJFAOARA/linux-jdk9-m3.5.x_build/maven-plugin-plugin/target/invoker-reports/BUILD-mplugin-223.xml, /home/jenkins/jenkins-slave/workspace/ven-plugin-tools_jdk11_asm7-J7667H6X6V4EBCRWUSKUMW4LMBBFILIHPFM47RV7V2XYHJFAOARA/linux-jdk9-m3.5.x_build/maven-plugin-plugin/target/invoker-reports/BUILD-mplugin-272_java8.xml, /home/jenkins/jenkins-slave/workspace/ven-plugin-tools_jdk11_asm7-J7667H6X6V4EBCRWUSKUMW4LMBBFILIHPFM47RV7V2XYHJFAOARA/linux-jdk9-m3.5.x_build/maven-plugin-plugin/target/invoker-reports/BUILD-mplugin-299_no-configuration.xml, /home/jenkins/jenkins-slave/workspace/ven-plugin-tools_jdk11_asm7-J7667H6X6V4EBCRWUSKUMW4LMBBFILIHPFM47RV7V2XYHJFAOARA/linux-jdk9-m3.5.x_build/maven-plugin-plugin/target/invoker-reports/BUILD-mplugin-305_defaultMojoDependencies.xml, /home/jenkins/jenkins-slave/workspace/ven-plugin-tools_jdk11_asm7-J7667H6X6V4EBCRWUSKUMW4LMBBFILIHPFM47RV7V2XYHJFAOARA/linux-jdk9-m3.5.x_build/maven-plugin-plugin/target/invoker-reports/BUILD-mplugin-305_emptyMojoDependencies.xml, /home/jenkins/jenkins-slave/workspace/ven-plugin-tools_jdk11_asm7-J7667H6X6V4EBCRWUSKUMW4LMBBFILIHPFM47RV7V2XYHJFAOARA/linux-jdk9-m3.5.x_build/maven-plugin-plugin/target/invoker-reports/BUILD-mplugin-305_singleMojoDependencies.xml, /home/jenkins/jenkins-slave/workspace/ven-plugin-tools_jdk11_asm7-J7667H6X6V4EBCRWUSKUMW4LMBBFILIHPFM47RV7V2XYHJFAOARA/linux-jdk9-m3.5.x_build/maven-plugin-plugin/target/invoker-reports/BUILD-mplugin-319_report-since.xml, /home/jenkins/jenkins-slave/workspace/ven-plugin-tools_jdk11_asm7-J7667H6X6V4EBCRWUSKUMW4LMBBFILIHPFM47RV7V2XYHJFAOARA/linux-jdk9-m3.5.x_build/maven-plugin-plugin/target/invoker-reports/BUILD-mplugin-324_javadoc.xml, /home/jenkins/jenkins-slave/workspace/ven-plugin-tools_jdk11_asm7-J7667H6X6V4EBCRWUSKUMW4LMBBFILIHPFM47RV7V2XYHJFAOARA/linux-jdk9-m3.5.x_build/maven-plugin-plugin/target/invoker-reports/BUILD-packaging-jar.xml, /home/jenkins/jenkins-slave/workspace/ven-plugin-tools_jdk11_asm7-J7667H6X6V4EBCRWUSKUMW4LMBBFILIHPFM47RV7V2XYHJFAOARA/linux-jdk9-m3.5.x_build/maven-plugin-plugin/target/invoker-reports/BUILD-plugin-info-jdk-default-version.xml, /home/jenkins/jenkins-slave/workspace/ven-plugin-tools_jdk11_asm7-J7667H6X6V4EBCRWUSKUMW4LMBBFILIHPFM47RV7V2XYHJFAOARA/linux-jdk9-m3.5.x_build/maven-plugin-plugin/target/invoker-reports/BUILD-plugin-info-jdk.xml, /home/jenkins/jenkins-slave/workspace/ven-plugin-tools_jdk11_asm7-J7667H6X6V4EBCRWUSKUMW4LMBBFILIHPFM47RV7V2XYHJFAOARA/linux-jdk9-m3.5.x_build/maven-plugin-plugin/target/invoker-reports/BUILD-plugin-report-annotations.xml, /home/jenkins/jenkins-slave/workspace/ven-plugin-tools_jdk11_asm7-J7667H6X6V4EBCRWUSKUMW4LMBBFILIHPFM47RV7V2XYHJFAOARA/linux-jdk9-m3.5.x_build/maven-plugin-plugin/target/invoker-reports/BUILD-plugin-report.xml, /home/jenkins/jenkins-slave/workspace/ven-plugin-tools_jdk11_asm7-J7667H6X6V4EBCRWUSKUMW4LMBBFILIHPFM47RV7V2XYHJFAOARA/linux-jdk9-m3.5.x_build/maven-plugin-plugin/target/invoker-reports/BUILD-skip.xml, /home/jenkins/jenkins-slave/workspace/ven-plugin-tools_jdk11_asm7-J7667H6X6V4EBCRWUSKUMW4LMBBFILIHPFM47RV7V2XYHJFAOARA/linux-jdk9-m3.5.x_build/maven-plugin-plugin/target/invoker-reports/BUILD-source-encoding.xml]
[linux-jdk9-m3.5.x_build] Found logs:[/home/jenkins/jenkins-slave/workspace/ven-plugin-tools_jdk11_asm7-J7667H6X6V4EBCRWUSKUMW4LMBBFILIHPFM47RV7V2XYHJFAOARA/linux-jdk9-m3.5.x_build/maven-plugin-plugin/target/it/annotation-with-inheritance-from-deps/build.log, /home/jenkins/jenkins-slave/workspace/ven-plugin-tools_jdk11_asm7-J7667H6X6V4EBCRWUSKUMW4LMBBFILIHPFM47RV7V2XYHJFAOARA/linux-jdk9-m3.5.x_build/maven-plugin-plugin/target/it/annotation-with-inheritance-reactor/build.log, /home/jenkins/jenkins-slave/workspace/ven-plugin-tools_jdk11_asm7-J7667H6X6V4EBCRWUSKUMW4LMBBFILIHPFM47RV7V2XYHJFAOARA/linux-jdk9-m3.5.x_build/maven-plugin-plugin/target/it/annotation-with-inheritance/build.log, /home/jenkins/jenkins-slave/workspace/ven-plugin-tools_jdk11_asm7-J7667H6X6V4EBCRWUSKUMW4LMBBFILIHPFM47RV7V2XYHJFAOARA/linux-jdk9-m3.5.x_build/maven-plugin-plugin/target/it/ant-basic/build.log, /home/jenkins/jenkins-slave/workspace/ven-plugin-tools_jdk11_asm7-J7667H6X6V4EBCRWUSKUMW4LMBBFILIHPFM47RV7V2XYHJFAOARA/linux-jdk9-m3.5.x_build/maven-plugin-plugin/target/it/ant-reference-parameter/build.log, /home/jenkins/jenkins-slave/workspace/ven-plugin-tools_jdk11_asm7-J7667H6X6V4EBCRWUSKUMW4LMBBFILIHPFM47RV7V2XYHJFAOARA/linux-jdk9-m3.5.x_build/maven-plugin-plugin/target/it/ant-simple-usage/build.log, /home/jenkins/jenkins-slave/workspace/ven-plugin-tools_jdk11_asm7-J7667H6X6V4EBCRWUSKUMW4LMBBFILIHPFM47RV7V2XYHJFAOARA/linux-jdk9-m3.5.x_build/maven-plugin-plugin/target/it/ant-since-maven-plugin/build.log, /home/jenkins/jenkins-slave/workspace/ven-plugin-tools_jdk11_asm7-J7667H6X6V4EBCRWUSKUMW4LMBBFILIHPFM47RV7V2XYHJFAOARA/linux-jdk9-m3.5.x_build/maven-plugin-plugin/target/it/asm-failure/build.log, /home/jenkins/jenkins-slave/workspace/ven-plugin-tools_jdk11_asm7-J7667H6X6V4EBCRWUSKUMW4LMBBFILIHPFM47RV7V2XYHJFAOARA/linux-jdk9-m3.5.x_build/maven-plugin-plugin/target/it/beanshell-simple/build.log, /home/jenkins/jenkins-slave/workspace/ven-plugin-tools_jdk11_asm7-J7667H6X6V4EBCRWUSKUMW4LMBBFILIHPFM47RV7V2XYHJFAOARA/linux-jdk9-m3.5.x_build/maven-plugin-plugin/target/it/fix-maven-since-3.x/build.log, /home/jenkins/jenkins-slave/workspace/ven-plugin-tools_jdk11_asm7-J7667H6X6V4EBCRWUSKUMW4LMBBFILIHPFM47RV7V2XYHJFAOARA/linux-jdk9-m3.5.x_build/maven-plugin-plugin/target/it/help-basic/build.log, /home/jenkins/jenkins-slave/workspace/ven-plugin-tools_jdk11_asm7-J7667H6X6V4EBCRWUSKUMW4LMBBFILIHPFM47RV7V2XYHJFAOARA/linux-jdk9-m3.5.x_build/maven-plugin-plugin/target/it/help-package/build.log, /home/jenkins/jenkins-slave/workspace/ven-plugin-tools_jdk11_asm7-J7667H6X6V4EBCRWUSKUMW4LMBBFILIHPFM47RV7V2XYHJFAOARA/linux-jdk9-m3.5.x_build/maven-plugin-plugin/target/it/ignore-plugin-class-realm/build.log, /home/jenkins/jenkins-slave/workspace/ven-plugin-tools_jdk11_asm7-J7667H6X6V4EBCRWUSKUMW4LMBBFILIHPFM47RV7V2XYHJFAOARA/linux-jdk9-m3.5.x_build/maven-plugin-plugin/target/it/java-basic-annotations-jdk8/build.log, /home/jenkins/jenkins-slave/workspace/ven-plugin-tools_jdk11_asm7-J7667H6X6V4EBCRWUSKUMW4LMBBFILIHPFM47RV7V2XYHJFAOARA/linux-jdk9-m3.5.x_build/maven-plugin-plugin/target/it/java-basic-annotations/build.log, /home/jenkins/jenkins-slave/workspace/ven-plugin-tools_jdk11_asm7-J7667H6X6V4EBCRWUSKUMW4LMBBFILIHPFM47RV7V2XYHJFAOARA/linux-jdk9-m3.5.x_build/maven-plugin-plugin/target/it/java-basic/build.log, /home/jenkins/jenkins-slave/workspace/ven-plugin-tools_jdk11_asm7-J7667H6X6V4EBCRWUSKUMW4LMBBFILIHPFM47RV7V2XYHJFAOARA/linux-jdk9-m3.5.x_build/maven-plugin-plugin/target/it/mplugin-187/build.log, /home/jenkins/jenkins-slave/workspace/ven-plugin-tools_jdk11_asm7-J7667H6X6V4EBCRWUSKUMW4LMBBFILIHPFM47RV7V2XYHJFAOARA/linux-jdk9-m3.5.x_build/maven-plugin-plugin/target/it/mplugin-191/build.log, /home/jenkins/jenkins-slave/workspace/ven-plugin-tools_jdk11_asm7-J7667H6X6V4EBCRWUSKUMW4LMBBFILIHPFM47RV7V2XYHJFAOARA/linux-jdk9-m3.5.x_build/maven-plugin-plugin/target/it/mplugin-223/build.log, /home/jenkins/jenkins-slave/workspace/ven-plugin-tools_jdk11_asm7-J7667H6X6V4EBCRWUSKUMW4LMBBFILIHPFM47RV7V2XYHJFAOARA/linux-jdk9-m3.5.x_build/maven-plugin-plugin/target/it/mplugin-272_java8/build.log, /home/jenkins/jenkins-slave/workspace/ven-plugin-tools_jdk11_asm7-J7667H6X6V4EBCRWUSKUMW4LMBBFILIHPFM47RV7V2XYHJFAOARA/linux-jdk9-m3.5.x_build/maven-plugin-plugin/target/it/mplugin-299_no-configuration/build.log, /home/jenkins/jenkins-slave/workspace/ven-plugin-tools_jdk11_asm7-J7667H6X6V4EBCRWUSKUMW4LMBBFILIHPFM47RV7V2XYHJFAOARA/linux-jdk9-m3.5.x_build/maven-plugin-plugin/target/it/mplugin-305_defaultMojoDependencies/build.log, /home/jenkins/jenkins-slave/workspace/ven-plugin-tools_jdk11_asm7-J7667H6X6V4EBCRWUSKUMW4LMBBFILIHPFM47RV7V2XYHJFAOARA/linux-jdk9-m3.5.x_build/maven-plugin-plugin/target/it/mplugin-305_emptyMojoDependencies/build.log, /home/jenkins/jenkins-slave/workspace/ven-plugin-tools_jdk11_asm7-J7667H6X6V4EBCRWUSKUMW4LMBBFILIHPFM47RV7V2XYHJFAOARA/linux-jdk9-m3.5.x_build/maven-plugin-plugin/target/it/mplugin-305_singleMojoDependencies/build.log, /home/jenkins/jenkins-slave/workspace/ven-plugin-tools_jdk11_asm7-J7667H6X6V4EBCRWUSKUMW4LMBBFILIHPFM47RV7V2XYHJFAOARA/linux-jdk9-m3.5.x_build/maven-plugin-plugin/target/it/mplugin-319_report-since/build.log, /home/jenkins/jenkins-slave/workspace/ven-plugin-tools_jdk11_asm7-J7667H6X6V4EBCRWUSKUMW4LMBBFILIHPFM47RV7V2XYHJFAOARA/linux-jdk9-m3.5.x_build/maven-plugin-plugin/target/it/mplugin-324_javadoc/build.log, /home/jenkins/jenkins-slave/workspace/ven-plugin-tools_jdk11_asm7-J7667H6X6V4EBCRWUSKUMW4LMBBFILIHPFM47RV7V2XYHJFAOARA/linux-jdk9-m3.5.x_build/maven-plugin-plugin/target/it/packaging-jar/build.log, /home/jenkins/jenkins-slave/workspace/ven-plugin-tools_jdk11_asm7-J7667H6X6V4EBCRWUSKUMW4LMBBFILIHPFM47RV7V2XYHJFAOARA/linux-jdk9-m3.5.x_build/maven-plugin-plugin/target/it/plugin-info-jdk-default-version/build.log, /home/jenkins/jenkins-slave/workspace/ven-plugin-tools_jdk11_asm7-J7667H6X6V4EBCRWUSKUMW4LMBBFILIHPFM47RV7V2XYHJFAOARA/linux-jdk9-m3.5.x_build/maven-plugin-plugin/target/it/plugin-info-jdk/build.log, /home/jenkins/jenkins-slave/workspace/ven-plugin-tools_jdk11_asm7-J7667H6X6V4EBCRWUSKUMW4LMBBFILIHPFM47RV7V2XYHJFAOARA/linux-jdk9-m3.5.x_build/maven-plugin-plugin/target/it/plugin-report-annotations/build.log, /home/jenkins/jenkins-slave/workspace/ven-plugin-tools_jdk11_asm7-J7667H6X6V4EBCRWUSKUMW4LMBBFILIHPFM47RV7V2XYHJFAOARA/linux-jdk9-m3.5.x_build/maven-plugin-plugin/target/it/plugin-report/build.log, /home/jenkins/jenkins-slave/workspace/ven-plugin-tools_jdk11_asm7-J7667H6X6V4EBCRWUSKUMW4LMBBFILIHPFM47RV7V2XYHJFAOARA/linux-jdk9-m3.5.x_build/maven-plugin-plugin/target/it/skip/build.log, /home/jenkins/jenkins-slave/workspace/ven-plugin-tools_jdk11_asm7-J7667H6X6V4EBCRWUSKUMW4LMBBFILIHPFM47RV7V2XYHJFAOARA/linux-jdk9-m3.5.x_build/maven-plugin-plugin/target/it/source-encoding/build.log]
[linux-jdk9-m3.5.x_build] Finished parsing Maven Invoker results (found 35)
[linux-jdk9-m3.5.x_build] [withMaven] junitPublisher - Archive test results for Maven artifact org.apache.maven.plugin-tools:maven-plugin-tools-api:3.6.0-SNAPSHOT generated by maven-surefire-plugin:test (default-test): linux-jdk9-m3.5.x_build/maven-plugin-tools-api/target/surefire-reports/*.xml
[linux-jdk9-m3.5.x_build] Recording test results
[linux-jdk9-m3.5.x_build] [withMaven] junitPublisher - Archive test results for Maven artifact org.apache.maven.plugin-tools:maven-plugin-tools-generators:3.6.0-SNAPSHOT generated by maven-surefire-plugin:test (default-test): linux-jdk9-m3.5.x_build/maven-plugin-tools-generators/target/surefire-reports/*.xml
[linux-jdk9-m3.5.x_build] Recording test results
[linux-jdk9-m3.5.x_build] [withMaven] junitPublisher - Archive test results for Maven artifact org.apache.maven.plugin-tools:maven-plugin-tools-java:3.6.0-SNAPSHOT generated by maven-surefire-plugin:test (default-test): linux-jdk9-m3.5.x_build/maven-plugin-tools-java/target/surefire-reports/*.xml
[linux-jdk9-m3.5.x_build] Recording test results
[linux-jdk9-m3.5.x_build] [withMaven] junitPublisher - Archive test results for Maven artifact org.apache.maven.plugin-tools:maven-plugin-annotations:3.6.0-SNAPSHOT generated by maven-surefire-plugin:test (default-test): linux-jdk9-m3.5.x_build/maven-plugin-annotations/target/surefire-reports/*.xml
[linux-jdk9-m3.5.x_build] Recording test results
[linux-jdk9-m3.5.x_build] None of the test reports contained any result
[linux-jdk9-m3.5.x_build] [withMaven] junitPublisher - Archive test results for Maven artifact org.apache.maven.plugin-tools:maven-plugin-tools-annotations:3.6.0-SNAPSHOT generated by maven-surefire-plugin:test (default-test): linux-jdk9-m3.5.x_build/maven-plugin-tools-annotations/target/surefire-reports/*.xml
[linux-jdk9-m3.5.x_build] Recording test results
[linux-jdk9-m3.5.x_build] [withMaven] junitPublisher - Archive test results for Maven artifact org.apache.maven.plugin-tools:maven-plugin-tools-model:3.6.0-SNAPSHOT generated by maven-surefire-plugin:test (default-test): linux-jdk9-m3.5.x_build/maven-script/maven-plugin-tools-model/target/surefire-reports/*.xml
[linux-jdk9-m3.5.x_build] Recording test results
[linux-jdk9-m3.5.x_build] [withMaven] junitPublisher - Archive test results for Maven artifact org.apache.maven.plugin-tools:maven-plugin-tools-ant:3.6.0-SNAPSHOT generated by maven-surefire-plugin:test (default-test): linux-jdk9-m3.5.x_build/maven-script/maven-plugin-tools-ant/target/surefire-reports/*.xml
[linux-jdk9-m3.5.x_build] Recording test results
[linux-jdk9-m3.5.x_build] [withMaven] junitPublisher - Archive test results for Maven artifact org.apache.maven.plugin-tools:maven-script-ant:3.6.0-SNAPSHOT generated by maven-surefire-plugin:test (default-test): linux-jdk9-m3.5.x_build/maven-script/maven-script-ant/target/surefire-reports/*.xml
[linux-jdk9-m3.5.x_build] Recording test results
[linux-jdk9-m3.5.x_build] [withMaven] junitPublisher - Archive test results for Maven artifact org.apache.maven.plugin-tools:maven-plugin-tools-beanshell:3.6.0-SNAPSHOT generated by maven-surefire-plugin:test (default-test): linux-jdk9-m3.5.x_build/maven-script/maven-plugin-tools-beanshell/target/surefire-reports/*.xml
[linux-jdk9-m3.5.x_build] Recording test results
[linux-jdk9-m3.5.x_build] None of the test reports contained any result
[linux-jdk9-m3.5.x_build] [withMaven] junitPublisher - Archive test results for Maven artifact org.apache.maven.plugin-tools:maven-script-beanshell:3.6.0-SNAPSHOT generated by maven-surefire-plugin:test (default-test): linux-jdk9-m3.5.x_build/maven-script/maven-script-beanshell/target/surefire-reports/*.xml
[linux-jdk9-m3.5.x_build] Recording test results
[linux-jdk9-m3.5.x_build] None of the test reports contained any result
[linux-jdk9-m3.5.x_build] [withMaven] junitPublisher - Archive test results for Maven artifact org.apache.maven.plugins:maven-plugin-plugin:3.6.0-SNAPSHOT generated by maven-surefire-plugin:test (default-test): linux-jdk9-m3.5.x_build/maven-plugin-plugin/target/surefire-reports/*.xml
[linux-jdk9-m3.5.x_build] Recording test results
[linux-jdk9-m3.5.x_build] None of the test reports contained any result
[linux-jdk9-m3.5.x_build] [withMaven] openTasksPublisher - Scan Tasks for Maven artifact org.apache.maven.plugin-tools:maven-plugin-tools-api:3.6.0-SNAPSHOT in source directory linux-jdk9-m3.5.x_build/maven-plugin-tools-api/src/main/java
[linux-jdk9-m3.5.x_build] [withMaven] openTasksPublisher - Scan Tasks for Maven artifact org.apache.maven.plugin-tools:maven-plugin-tools-generators:3.6.0-SNAPSHOT in source directory linux-jdk9-m3.5.x_build/maven-plugin-tools-generators/src/main/java
[linux-jdk9-m3.5.x_build] [withMaven] openTasksPublisher - Scan Tasks for Maven artifact org.apache.maven.plugin-tools:maven-plugin-tools-java:3.6.0-SNAPSHOT in source directory linux-jdk9-m3.5.x_build/maven-plugin-tools-java/src/main/java
[linux-jdk9-m3.5.x_build] [withMaven] openTasksPublisher - Scan Tasks for Maven artifact org.apache.maven.plugin-tools:maven-plugin-annotations:3.6.0-SNAPSHOT in source directory linux-jdk9-m3.5.x_build/maven-plugin-annotations/src/main/java
[linux-jdk9-m3.5.x_build] [withMaven] openTasksPublisher - Scan Tasks for Maven artifact org.apache.maven.plugin-tools:maven-plugin-tools-annotations:3.6.0-SNAPSHOT in source directory linux-jdk9-m3.5.x_build/maven-plugin-tools-annotations/src/main/java
[linux-jdk9-m3.5.x_build] [withMaven] openTasksPublisher - Scan Tasks for Maven artifact org.apache.maven.plugin-tools:maven-plugin-tools-model:3.6.0-SNAPSHOT in source directory linux-jdk9-m3.5.x_build/maven-script/maven-plugin-tools-model/src/main/java
[linux-jdk9-m3.5.x_build] [withMaven] openTasksPublisher - Scan Tasks for Maven artifact org.apache.maven.plugin-tools:maven-plugin-tools-ant:3.6.0-SNAPSHOT in source directory linux-jdk9-m3.5.x_build/maven-script/maven-plugin-tools-ant/src/main/java
[linux-jdk9-m3.5.x_build] [withMaven] openTasksPublisher - Scan Tasks for Maven artifact org.apache.maven.plugin-tools:maven-script-ant:3.6.0-SNAPSHOT in source directory linux-jdk9-m3.5.x_build/maven-script/maven-script-ant/src/main/java
[linux-jdk9-m3.5.x_build] [withMaven] openTasksPublisher - Scan Tasks for Maven artifact org.apache.maven.plugin-tools:maven-plugin-tools-beanshell:3.6.0-SNAPSHOT in source directory linux-jdk9-m3.5.x_build/maven-script/maven-plugin-tools-beanshell/src/main/java
[linux-jdk9-m3.5.x_build] [withMaven] openTasksPublisher - Scan Tasks for Maven artifact org.apache.maven.plugin-tools:maven-script-beanshell:3.6.0-SNAPSHOT in source directory linux-jdk9-m3.5.x_build/maven-script/maven-script-beanshell/src/main/java
[linux-jdk9-m3.5.x_build] [withMaven] openTasksPublisher - Scan Tasks for Maven artifact org.apache.maven.plugins:maven-plugin-plugin:3.6.0-SNAPSHOT in source directory linux-jdk9-m3.5.x_build/maven-plugin-plugin/src/main/java
[linux-jdk9-m3.5.x_build] [TASKS] Scanning folder '/home/jenkins/jenkins-slave/workspace/ven-plugin-tools_jdk11_asm7-J7667H6X6V4EBCRWUSKUMW4LMBBFILIHPFM47RV7V2XYHJFAOARA' for files matching the pattern 'linux-jdk9-m3.5.x_build/maven-plugin-tools-api/src/main/java/**/*,linux-jdk9-m3.5.x_build/maven-plugin-tools-generators/src/main/java/**/*,linux-jdk9-m3.5.x_build/maven-plugin-tools-java/src/main/java/**/*,linux-jdk9-m3.5.x_build/maven-plugin-annotations/src/main/java/**/*,linux-jdk9-m3.5.x_build/maven-plugin-tools-annotations/src/main/java/**/*,linux-jdk9-m3.5.x_build/maven-script/maven-plugin-tools-model/src/main/java/**/*,linux-jdk9-m3.5.x_build/maven-script/maven-plugin-tools-ant/src/main/java/**/*,linux-jdk9-m3.5.x_build/maven-script/maven-script-ant/src/main/java/**/*,linux-jdk9-m3.5.x_build/maven-script/maven-plugin-tools-beanshell/src/main/java/**/*,linux-jdk9-m3.5.x_build/maven-script/maven-script-beanshell/src/main/java/**/*,linux-jdk9-m3.5.x_build/maven-plugin-plugin/src/main/java/**/*' - excludes: null
[linux-jdk9-m3.5.x_build] [TASKS] Found 53 files to scan for tasks
[linux-jdk9-m3.5.x_build] [TASKS] Found 11 open tasks.
[linux-jdk9-m3.5.x_build] Skipping warnings blame since pipelines do not have an SCM link.%n
[linux-jdk9-m3.5.x_build] [TASKS] Computing warning deltas based on reference build #5
[Pipeline] [linux-jdk9-m3.5.x_build] // withMaven
[Pipeline] [linux-jdk9-m3.5.x_build] cleanWs
[linux-jdk9-m3.5.x_build] [WS-CLEANUP] Deleting project workspace...[WS-CLEANUP] done
[Pipeline] [linux-jdk9-m3.5.x_build] }
[Pipeline] [linux-jdk9-m3.5.x_build] // stage
[Pipeline] [linux-jdk9-m3.5.x_build] }
[Pipeline] [linux-jdk9-m3.5.x_build] // node
[Pipeline] [linux-jdk9-m3.5.x_build] }
[linux-jdk11-m3.5.x_build] [INFO] run post-build script verify.groovy
[linux-jdk11-m3.5.x_build] [INFO]           annotation-with-inheritance-from-deps/pom.xml .... SUCCESS (18.9 s)
[linux-jdk11-m3.5.x_build] [INFO] -------------------------------------------------
[linux-jdk11-m3.5.x_build] [INFO] Build Summary:
[linux-jdk11-m3.5.x_build] [INFO]   Passed: 35, Failed: 0, Errors: 0, Skipped: 0
[linux-jdk11-m3.5.x_build] [INFO] -------------------------------------------------
[linux-jdk11-m3.5.x_build] [INFO] 
[linux-jdk11-m3.5.x_build] [INFO] --- maven-checkstyle-plugin:3.0.0:check (checkstyle-check) @ maven-plugin-plugin ---
[linux-jdk11-m3.5.x_build] [INFO] ------------------------------------------------------------------------
[linux-jdk11-m3.5.x_build] [INFO] Reactor Summary:
[linux-jdk11-m3.5.x_build] [INFO] 
[linux-jdk11-m3.5.x_build] [INFO] Maven Plugin Tools 3.6.0-SNAPSHOT .................. SUCCESS [ 14.947 s]
[linux-jdk11-m3.5.x_build] [INFO] Maven Plugin Tools Extractor API ................... SUCCESS [  8.385 s]
[linux-jdk11-m3.5.x_build] [INFO] Maven Plugin Tools Generators ...................... SUCCESS [  5.515 s]
[linux-jdk11-m3.5.x_build] [INFO] Maven Plugin Tool for Java with Javadoc Tags ....... SUCCESS [  4.252 s]
[linux-jdk11-m3.5.x_build] [INFO] Maven Plugin Tools Java Annotations ................ SUCCESS [  0.726 s]
[linux-jdk11-m3.5.x_build] [INFO] Maven Plugin Tool for Java with Annotations ........ SUCCESS [  4.313 s]
[linux-jdk11-m3.5.x_build] [INFO] Maven Script Mojo Support .......................... SUCCESS [  0.455 s]
[linux-jdk11-m3.5.x_build] [INFO] Maven Plugin Metadata Model ........................ SUCCESS [  2.603 s]
[linux-jdk11-m3.5.x_build] [INFO] Maven Plugin Tool for Ant .......................... SUCCESS [  1.774 s]
[linux-jdk11-m3.5.x_build] [INFO] Maven Ant Mojo Support ............................. SUCCESS [  3.763 s]
[linux-jdk11-m3.5.x_build] [INFO] Maven Plugin Tool for Beanshell .................... SUCCESS [  0.984 s]
[linux-jdk11-m3.5.x_build] [INFO] Maven Beanshell Mojo Support ....................... SUCCESS [  0.564 s]
[linux-jdk11-m3.5.x_build] [INFO] Maven Plugin Plugin 3.6.0-SNAPSHOT ................. SUCCESS [06:16 min]
[linux-jdk11-m3.5.x_build] [INFO] ------------------------------------------------------------------------
[linux-jdk11-m3.5.x_build] [INFO] BUILD SUCCESS
[linux-jdk11-m3.5.x_build] [INFO] ------------------------------------------------------------------------
[linux-jdk11-m3.5.x_build] [INFO] Total time: 07:06 min
[linux-jdk11-m3.5.x_build] [INFO] Finished at: 2018-10-03T23:17:53Z
[linux-jdk11-m3.5.x_build] [INFO] ------------------------------------------------------------------------
[linux-jdk11-m3.5.x_build] [INFO] [jenkins-event-spy] Generated /home/jenkins/jenkins-slave/workspace/ven-plugin-tools_jdk11_asm7-J7667H6X6V4EBCRWUSKUMW4LMBBFILIHPFM47RV7V2XYHJFAOARA@tmp/withMavencfcfcd2c/maven-spy-20181003-231047-35915455124529963033567.log
[Pipeline] [linux-jdk11-m3.5.x_build] }
[Pipeline] [linux-jdk11-m3.5.x_build] // dir
[Pipeline] [linux-jdk11-m3.5.x_build] }
[linux-jdk11-m3.5.x_build] [withMaven] artifactsPublisher - Archive artifact linux-jdk11-m3.5.x_build/pom.xml under org/apache/maven/plugin-tools/maven-plugin-tools/3.6.0-SNAPSHOT/maven-plugin-tools-3.6.0-SNAPSHOT.pom
[linux-jdk11-m3.5.x_build] [withMaven] artifactsPublisher - Archive artifact linux-jdk11-m3.5.x_build/target/maven-plugin-tools-3.6.0-SNAPSHOT-site.xml under org/apache/maven/plugin-tools/maven-plugin-tools/3.6.0-SNAPSHOT/maven-plugin-tools-3.6.0-SNAPSHOT-site.xml
[linux-jdk11-m3.5.x_build] [withMaven] artifactsPublisher - Archive artifact linux-jdk11-m3.5.x_build/maven-plugin-tools-api/pom.xml under org/apache/maven/plugin-tools/maven-plugin-tools-api/3.6.0-SNAPSHOT/maven-plugin-tools-api-3.6.0-SNAPSHOT.pom
[linux-jdk11-m3.5.x_build] [withMaven] artifactsPublisher - Archive artifact linux-jdk11-m3.5.x_build/maven-plugin-tools-api/target/maven-plugin-tools-api-3.6.0-SNAPSHOT.jar under org/apache/maven/plugin-tools/maven-plugin-tools-api/3.6.0-SNAPSHOT/maven-plugin-tools-api-3.6.0-SNAPSHOT.jar
[linux-jdk11-m3.5.x_build] [withMaven] artifactsPublisher - Archive artifact linux-jdk11-m3.5.x_build/maven-plugin-tools-generators/pom.xml under org/apache/maven/plugin-tools/maven-plugin-tools-generators/3.6.0-SNAPSHOT/maven-plugin-tools-generators-3.6.0-SNAPSHOT.pom
[linux-jdk11-m3.5.x_build] [withMaven] artifactsPublisher - Archive artifact linux-jdk11-m3.5.x_build/maven-plugin-tools-generators/target/maven-plugin-tools-generators-3.6.0-SNAPSHOT.jar under org/apache/maven/plugin-tools/maven-plugin-tools-generators/3.6.0-SNAPSHOT/maven-plugin-tools-generators-3.6.0-SNAPSHOT.jar
[linux-jdk11-m3.5.x_build] [withMaven] artifactsPublisher - Archive artifact linux-jdk11-m3.5.x_build/maven-plugin-tools-java/pom.xml under org/apache/maven/plugin-tools/maven-plugin-tools-java/3.6.0-SNAPSHOT/maven-plugin-tools-java-3.6.0-SNAPSHOT.pom
[linux-jdk11-m3.5.x_build] [withMaven] artifactsPublisher - Archive artifact linux-jdk11-m3.5.x_build/maven-plugin-tools-java/target/maven-plugin-tools-java-3.6.0-SNAPSHOT.jar under org/apache/maven/plugin-tools/maven-plugin-tools-java/3.6.0-SNAPSHOT/maven-plugin-tools-java-3.6.0-SNAPSHOT.jar
[linux-jdk11-m3.5.x_build] [withMaven] artifactsPublisher - Archive artifact linux-jdk11-m3.5.x_build/maven-plugin-annotations/pom.xml under org/apache/maven/plugin-tools/maven-plugin-annotations/3.6.0-SNAPSHOT/maven-plugin-annotations-3.6.0-SNAPSHOT.pom
[linux-jdk11-m3.5.x_build] [withMaven] artifactsPublisher - Archive artifact linux-jdk11-m3.5.x_build/maven-plugin-annotations/target/maven-plugin-annotations-3.6.0-SNAPSHOT.jar under org/apache/maven/plugin-tools/maven-plugin-annotations/3.6.0-SNAPSHOT/maven-plugin-annotations-3.6.0-SNAPSHOT.jar
[linux-jdk11-m3.5.x_build] [withMaven] artifactsPublisher - Archive artifact linux-jdk11-m3.5.x_build/maven-plugin-tools-annotations/pom.xml under org/apache/maven/plugin-tools/maven-plugin-tools-annotations/3.6.0-SNAPSHOT/maven-plugin-tools-annotations-3.6.0-SNAPSHOT.pom
[linux-jdk11-m3.5.x_build] [withMaven] artifactsPublisher - Archive artifact linux-jdk11-m3.5.x_build/maven-plugin-tools-annotations/target/maven-plugin-tools-annotations-3.6.0-SNAPSHOT.jar under org/apache/maven/plugin-tools/maven-plugin-tools-annotations/3.6.0-SNAPSHOT/maven-plugin-tools-annotations-3.6.0-SNAPSHOT.jar
[linux-jdk11-m3.5.x_build] [withMaven] artifactsPublisher - Archive artifact linux-jdk11-m3.5.x_build/maven-plugin-tools-annotations/target/maven-plugin-tools-annotations-3.6.0-SNAPSHOT-tests.jar under org/apache/maven/plugin-tools/maven-plugin-tools-annotations/3.6.0-SNAPSHOT/maven-plugin-tools-annotations-3.6.0-SNAPSHOT-tests.jar
[linux-jdk11-m3.5.x_build] [withMaven] artifactsPublisher - Archive artifact linux-jdk11-m3.5.x_build/maven-plugin-tools-annotations/target/maven-plugin-tools-annotations-3.6.0-SNAPSHOT-test-sources.jar under org/apache/maven/plugin-tools/maven-plugin-tools-annotations/3.6.0-SNAPSHOT/maven-plugin-tools-annotations-3.6.0-SNAPSHOT-test-sources.jar
[linux-jdk11-m3.5.x_build] [withMaven] artifactsPublisher - Archive artifact linux-jdk11-m3.5.x_build/maven-script/pom.xml under org/apache/maven/plugin-tools/maven-script/3.6.0-SNAPSHOT/maven-script-3.6.0-SNAPSHOT.pom
[linux-jdk11-m3.5.x_build] [withMaven] artifactsPublisher - Archive artifact linux-jdk11-m3.5.x_build/maven-script/target/maven-script-3.6.0-SNAPSHOT-site.xml under org/apache/maven/plugin-tools/maven-script/3.6.0-SNAPSHOT/maven-script-3.6.0-SNAPSHOT-site.xml
[linux-jdk11-m3.5.x_build] [withMaven] artifactsPublisher - Archive artifact linux-jdk11-m3.5.x_build/maven-script/maven-plugin-tools-model/pom.xml under org/apache/maven/plugin-tools/maven-plugin-tools-model/3.6.0-SNAPSHOT/maven-plugin-tools-model-3.6.0-SNAPSHOT.pom
[linux-jdk11-m3.5.x_build] [withMaven] artifactsPublisher - Archive artifact linux-jdk11-m3.5.x_build/maven-script/maven-plugin-tools-model/target/maven-plugin-tools-model-3.6.0-SNAPSHOT.jar under org/apache/maven/plugin-tools/maven-plugin-tools-model/3.6.0-SNAPSHOT/maven-plugin-tools-model-3.6.0-SNAPSHOT.jar
[linux-jdk11-m3.5.x_build] [withMaven] artifactsPublisher - Archive artifact linux-jdk11-m3.5.x_build/maven-script/maven-plugin-tools-ant/pom.xml under org/apache/maven/plugin-tools/maven-plugin-tools-ant/3.6.0-SNAPSHOT/maven-plugin-tools-ant-3.6.0-SNAPSHOT.pom
[linux-jdk11-m3.5.x_build] [withMaven] artifactsPublisher - Archive artifact linux-jdk11-m3.5.x_build/maven-script/maven-plugin-tools-ant/target/maven-plugin-tools-ant-3.6.0-SNAPSHOT.jar under org/apache/maven/plugin-tools/maven-plugin-tools-ant/3.6.0-SNAPSHOT/maven-plugin-tools-ant-3.6.0-SNAPSHOT.jar
[linux-jdk11-m3.5.x_build] [withMaven] artifactsPublisher - Archive artifact linux-jdk11-m3.5.x_build/maven-script/maven-script-ant/pom.xml under org/apache/maven/plugin-tools/maven-script-ant/3.6.0-SNAPSHOT/maven-script-ant-3.6.0-SNAPSHOT.pom
[linux-jdk11-m3.5.x_build] [withMaven] artifactsPublisher - Archive artifact linux-jdk11-m3.5.x_build/maven-script/maven-script-ant/target/maven-script-ant-3.6.0-SNAPSHOT.jar under org/apache/maven/plugin-tools/maven-script-ant/3.6.0-SNAPSHOT/maven-script-ant-3.6.0-SNAPSHOT.jar
[linux-jdk11-m3.5.x_build] [withMaven] artifactsPublisher - Archive artifact linux-jdk11-m3.5.x_build/maven-script/maven-plugin-tools-beanshell/pom.xml under org/apache/maven/plugin-tools/maven-plugin-tools-beanshell/3.6.0-SNAPSHOT/maven-plugin-tools-beanshell-3.6.0-SNAPSHOT.pom
[linux-jdk11-m3.5.x_build] [withMaven] artifactsPublisher - Archive artifact linux-jdk11-m3.5.x_build/maven-script/maven-plugin-tools-beanshell/target/maven-plugin-tools-beanshell-3.6.0-SNAPSHOT.jar under org/apache/maven/plugin-tools/maven-plugin-tools-beanshell/3.6.0-SNAPSHOT/maven-plugin-tools-beanshell-3.6.0-SNAPSHOT.jar
[linux-jdk11-m3.5.x_build] [withMaven] artifactsPublisher - Archive artifact linux-jdk11-m3.5.x_build/maven-script/maven-script-beanshell/pom.xml under org/apache/maven/plugin-tools/maven-script-beanshell/3.6.0-SNAPSHOT/maven-script-beanshell-3.6.0-SNAPSHOT.pom
[linux-jdk11-m3.5.x_build] [withMaven] artifactsPublisher - Archive artifact linux-jdk11-m3.5.x_build/maven-script/maven-script-beanshell/target/maven-script-beanshell-3.6.0-SNAPSHOT.jar under org/apache/maven/plugin-tools/maven-script-beanshell/3.6.0-SNAPSHOT/maven-script-beanshell-3.6.0-SNAPSHOT.jar
[linux-jdk11-m3.5.x_build] [withMaven] artifactsPublisher - Archive artifact linux-jdk11-m3.5.x_build/maven-plugin-plugin/pom.xml under org/apache/maven/plugins/maven-plugin-plugin/3.6.0-SNAPSHOT/maven-plugin-plugin-3.6.0-SNAPSHOT.pom
[linux-jdk11-m3.5.x_build] [withMaven] artifactsPublisher - Archive artifact linux-jdk11-m3.5.x_build/maven-plugin-plugin/target/maven-plugin-plugin-3.6.0-SNAPSHOT.jar under org/apache/maven/plugins/maven-plugin-plugin/3.6.0-SNAPSHOT/maven-plugin-plugin-3.6.0-SNAPSHOT.jar
[linux-jdk11-m3.5.x_build] [withMaven] invokerPublisher - Archive invoker results for Maven artifact MavenArtifact{org.apache.maven.plugins:maven-plugin-plugin::3.6.0-SNAPSHOT(version: 3.6.0-SNAPSHOT, snapshot:false) } generated by PluginInvocation{org.apache.maven.plugins:maven-invoker-plugin:3.0.1@run  integration-test}: linux-jdk11-m3.5.x_build/maven-plugin-plugin/target/invoker-reports/*.xml
[linux-jdk11-m3.5.x_build] performing MavenInvokerRecorder, reportsFilenamePattern:'**/linux-jdk11-m3.5.x_build/maven-plugin-plugin/target/invoker-reports/BUILD*.xml', invokerBuildDir:'**/linux-jdk11-m3.5.x_build/maven-plugin-plugin/target/it'
[linux-jdk11-m3.5.x_build] Found reports:[/home/jenkins/jenkins-slave/workspace/ven-plugin-tools_jdk11_asm7-J7667H6X6V4EBCRWUSKUMW4LMBBFILIHPFM47RV7V2XYHJFAOARA/linux-jdk11-m3.5.x_build/maven-plugin-plugin/target/invoker-reports/BUILD-annotation-with-inheritance-from-deps.xml, /home/jenkins/jenkins-slave/workspace/ven-plugin-tools_jdk11_asm7-J7667H6X6V4EBCRWUSKUMW4LMBBFILIHPFM47RV7V2XYHJFAOARA/linux-jdk11-m3.5.x_build/maven-plugin-plugin/target/invoker-reports/BUILD-annotation-with-inheritance-reactor.xml, /home/jenkins/jenkins-slave/workspace/ven-plugin-tools_jdk11_asm7-J7667H6X6V4EBCRWUSKUMW4LMBBFILIHPFM47RV7V2XYHJFAOARA/linux-jdk11-m3.5.x_build/maven-plugin-plugin/target/invoker-reports/BUILD-annotation-with-inheritance.xml, /home/jenkins/jenkins-slave/workspace/ven-plugin-tools_jdk11_asm7-J7667H6X6V4EBCRWUSKUMW4LMBBFILIHPFM47RV7V2XYHJFAOARA/linux-jdk11-m3.5.x_build/maven-plugin-plugin/target/invoker-reports/BUILD-ant-basic.xml, /home/jenkins/jenkins-slave/workspace/ven-plugin-tools_jdk11_asm7-J7667H6X6V4EBCRWUSKUMW4LMBBFILIHPFM47RV7V2XYHJFAOARA/linux-jdk11-m3.5.x_build/maven-plugin-plugin/target/invoker-reports/BUILD-ant-reference-parameter.xml, /home/jenkins/jenkins-slave/workspace/ven-plugin-tools_jdk11_asm7-J7667H6X6V4EBCRWUSKUMW4LMBBFILIHPFM47RV7V2XYHJFAOARA/linux-jdk11-m3.5.x_build/maven-plugin-plugin/target/invoker-reports/BUILD-ant-simple-usage.xml, /home/jenkins/jenkins-slave/workspace/ven-plugin-tools_jdk11_asm7-J7667H6X6V4EBCRWUSKUMW4LMBBFILIHPFM47RV7V2XYHJFAOARA/linux-jdk11-m3.5.x_build/maven-plugin-plugin/target/invoker-reports/BUILD-ant-since-maven-plugin.xml, /home/jenkins/jenkins-slave/workspace/ven-plugin-tools_jdk11_asm7-J7667H6X6V4EBCRWUSKUMW4LMBBFILIHPFM47RV7V2XYHJFAOARA/linux-jdk11-m3.5.x_build/maven-plugin-plugin/target/invoker-reports/BUILD-asm-failure.xml, /home/jenkins/jenkins-slave/workspace/ven-plugin-tools_jdk11_asm7-J7667H6X6V4EBCRWUSKUMW4LMBBFILIHPFM47RV7V2XYHJFAOARA/linux-jdk11-m3.5.x_build/maven-plugin-plugin/target/invoker-reports/BUILD-beanshell-simple.xml, /home/jenkins/jenkins-slave/workspace/ven-plugin-tools_jdk11_asm7-J7667H6X6V4EBCRWUSKUMW4LMBBFILIHPFM47RV7V2XYHJFAOARA/linux-jdk11-m3.5.x_build/maven-plugin-plugin/target/invoker-reports/BUILD-fix-maven-since-3.x.xml, /home/jenkins/jenkins-slave/workspace/ven-plugin-tools_jdk11_asm7-J7667H6X6V4EBCRWUSKUMW4LMBBFILIHPFM47RV7V2XYHJFAOARA/linux-jdk11-m3.5.x_build/maven-plugin-plugin/target/invoker-reports/BUILD-help-basic-jdk11.xml, /home/jenkins/jenkins-slave/workspace/ven-plugin-tools_jdk11_asm7-J7667H6X6V4EBCRWUSKUMW4LMBBFILIHPFM47RV7V2XYHJFAOARA/linux-jdk11-m3.5.x_build/maven-plugin-plugin/target/invoker-reports/BUILD-help-basic.xml, /home/jenkins/jenkins-slave/workspace/ven-plugin-tools_jdk11_asm7-J7667H6X6V4EBCRWUSKUMW4LMBBFILIHPFM47RV7V2XYHJFAOARA/linux-jdk11-m3.5.x_build/maven-plugin-plugin/target/invoker-reports/BUILD-help-package.xml, /home/jenkins/jenkins-slave/workspace/ven-plugin-tools_jdk11_asm7-J7667H6X6V4EBCRWUSKUMW4LMBBFILIHPFM47RV7V2XYHJFAOARA/linux-jdk11-m3.5.x_build/maven-plugin-plugin/target/invoker-reports/BUILD-ignore-plugin-class-realm.xml, /home/jenkins/jenkins-slave/workspace/ven-plugin-tools_jdk11_asm7-J7667H6X6V4EBCRWUSKUMW4LMBBFILIHPFM47RV7V2XYHJFAOARA/linux-jdk11-m3.5.x_build/maven-plugin-plugin/target/invoker-reports/BUILD-java-basic-annotations-jdk11.xml, /home/jenkins/jenkins-slave/workspace/ven-plugin-tools_jdk11_asm7-J7667H6X6V4EBCRWUSKUMW4LMBBFILIHPFM47RV7V2XYHJFAOARA/linux-jdk11-m3.5.x_build/maven-plugin-plugin/target/invoker-reports/BUILD-java-basic-annotations-jdk8.xml, /home/jenkins/jenkins-slave/workspace/ven-plugin-tools_jdk11_asm7-J7667H6X6V4EBCRWUSKUMW4LMBBFILIHPFM47RV7V2XYHJFAOARA/linux-jdk11-m3.5.x_build/maven-plugin-plugin/target/invoker-reports/BUILD-java-basic-annotations.xml, /home/jenkins/jenkins-slave/workspace/ven-plugin-tools_jdk11_asm7-J7667H6X6V4EBCRWUSKUMW4LMBBFILIHPFM47RV7V2XYHJFAOARA/linux-jdk11-m3.5.x_build/maven-plugin-plugin/target/invoker-reports/BUILD-java-basic.xml, /home/jenkins/jenkins-slave/workspace/ven-plugin-tools_jdk11_asm7-J7667H6X6V4EBCRWUSKUMW4LMBBFILIHPFM47RV7V2XYHJFAOARA/linux-jdk11-m3.5.x_build/maven-plugin-plugin/target/invoker-reports/BUILD-mplugin-187.xml, /home/jenkins/jenkins-slave/workspace/ven-plugin-tools_jdk11_asm7-J7667H6X6V4EBCRWUSKUMW4LMBBFILIHPFM47RV7V2XYHJFAOARA/linux-jdk11-m3.5.x_build/maven-plugin-plugin/target/invoker-reports/BUILD-mplugin-191.xml, /home/jenkins/jenkins-slave/workspace/ven-plugin-tools_jdk11_asm7-J7667H6X6V4EBCRWUSKUMW4LMBBFILIHPFM47RV7V2XYHJFAOARA/linux-jdk11-m3.5.x_build/maven-plugin-plugin/target/invoker-reports/BUILD-mplugin-223.xml, /home/jenkins/jenkins-slave/workspace/ven-plugin-tools_jdk11_asm7-J7667H6X6V4EBCRWUSKUMW4LMBBFILIHPFM47RV7V2XYHJFAOARA/linux-jdk11-m3.5.x_build/maven-plugin-plugin/target/invoker-reports/BUILD-mplugin-272_java8.xml, /home/jenkins/jenkins-slave/workspace/ven-plugin-tools_jdk11_asm7-J7667H6X6V4EBCRWUSKUMW4LMBBFILIHPFM47RV7V2XYHJFAOARA/linux-jdk11-m3.5.x_build/maven-plugin-plugin/target/invoker-reports/BUILD-mplugin-299_no-configuration.xml, /home/jenkins/jenkins-slave/workspace/ven-plugin-tools_jdk11_asm7-J7667H6X6V4EBCRWUSKUMW4LMBBFILIHPFM47RV7V2XYHJFAOARA/linux-jdk11-m3.5.x_build/maven-plugin-plugin/target/invoker-reports/BUILD-mplugin-305_defaultMojoDependencies.xml, /home/jenkins/jenkins-slave/workspace/ven-plugin-tools_jdk11_asm7-J7667H6X6V4EBCRWUSKUMW4LMBBFILIHPFM47RV7V2XYHJFAOARA/linux-jdk11-m3.5.x_build/maven-plugin-plugin/target/invoker-reports/BUILD-mplugin-305_emptyMojoDependencies.xml, /home/jenkins/jenkins-slave/workspace/ven-plugin-tools_jdk11_asm7-J7667H6X6V4EBCRWUSKUMW4LMBBFILIHPFM47RV7V2XYHJFAOARA/linux-jdk11-m3.5.x_build/maven-plugin-plugin/target/invoker-reports/BUILD-mplugin-305_singleMojoDependencies.xml, /home/jenkins/jenkins-slave/workspace/ven-plugin-tools_jdk11_asm7-J7667H6X6V4EBCRWUSKUMW4LMBBFILIHPFM47RV7V2XYHJFAOARA/linux-jdk11-m3.5.x_build/maven-plugin-plugin/target/invoker-reports/BUILD-mplugin-319_report-since.xml, /home/jenkins/jenkins-slave/workspace/ven-plugin-tools_jdk11_asm7-J7667H6X6V4EBCRWUSKUMW4LMBBFILIHPFM47RV7V2XYHJFAOARA/linux-jdk11-m3.5.x_build/maven-plugin-plugin/target/invoker-reports/BUILD-mplugin-324_javadoc.xml, /home/jenkins/jenkins-slave/workspace/ven-plugin-tools_jdk11_asm7-J7667H6X6V4EBCRWUSKUMW4LMBBFILIHPFM47RV7V2XYHJFAOARA/linux-jdk11-m3.5.x_build/maven-plugin-plugin/target/invoker-reports/BUILD-packaging-jar.xml, /home/jenkins/jenkins-slave/workspace/ven-plugin-tools_jdk11_asm7-J7667H6X6V4EBCRWUSKUMW4LMBBFILIHPFM47RV7V2XYHJFAOARA/linux-jdk11-m3.5.x_build/maven-plugin-plugin/target/invoker-reports/BUILD-plugin-info-jdk-default-version.xml, /home/jenkins/jenkins-slave/workspace/ven-plugin-tools_jdk11_asm7-J7667H6X6V4EBCRWUSKUMW4LMBBFILIHPFM47RV7V2XYHJFAOARA/linux-jdk11-m3.5.x_build/maven-plugin-plugin/target/invoker-reports/BUILD-plugin-info-jdk.xml, /home/jenkins/jenkins-slave/workspace/ven-plugin-tools_jdk11_asm7-J7667H6X6V4EBCRWUSKUMW4LMBBFILIHPFM47RV7V2XYHJFAOARA/linux-jdk11-m3.5.x_build/maven-plugin-plugin/target/invoker-reports/BUILD-plugin-report-annotations.xml, /home/jenkins/jenkins-slave/workspace/ven-plugin-tools_jdk11_asm7-J7667H6X6V4EBCRWUSKUMW4LMBBFILIHPFM47RV7V2XYHJFAOARA/linux-jdk11-m3.5.x_build/maven-plugin-plugin/target/invoker-reports/BUILD-plugin-report.xml, /home/jenkins/jenkins-slave/workspace/ven-plugin-tools_jdk11_asm7-J7667H6X6V4EBCRWUSKUMW4LMBBFILIHPFM47RV7V2XYHJFAOARA/linux-jdk11-m3.5.x_build/maven-plugin-plugin/target/invoker-reports/BUILD-skip.xml, /home/jenkins/jenkins-slave/workspace/ven-plugin-tools_jdk11_asm7-J7667H6X6V4EBCRWUSKUMW4LMBBFILIHPFM47RV7V2XYHJFAOARA/linux-jdk11-m3.5.x_build/maven-plugin-plugin/target/invoker-reports/BUILD-source-encoding.xml]
[linux-jdk11-m3.5.x_build] Found logs:[/home/jenkins/jenkins-slave/workspace/ven-plugin-tools_jdk11_asm7-J7667H6X6V4EBCRWUSKUMW4LMBBFILIHPFM47RV7V2XYHJFAOARA/linux-jdk11-m3.5.x_build/maven-plugin-plugin/target/it/annotation-with-inheritance-from-deps/build.log, /home/jenkins/jenkins-slave/workspace/ven-plugin-tools_jdk11_asm7-J7667H6X6V4EBCRWUSKUMW4LMBBFILIHPFM47RV7V2XYHJFAOARA/linux-jdk11-m3.5.x_build/maven-plugin-plugin/target/it/annotation-with-inheritance-reactor/build.log, /home/jenkins/jenkins-slave/workspace/ven-plugin-tools_jdk11_asm7-J7667H6X6V4EBCRWUSKUMW4LMBBFILIHPFM47RV7V2XYHJFAOARA/linux-jdk11-m3.5.x_build/maven-plugin-plugin/target/it/annotation-with-inheritance/build.log, /home/jenkins/jenkins-slave/workspace/ven-plugin-tools_jdk11_asm7-J7667H6X6V4EBCRWUSKUMW4LMBBFILIHPFM47RV7V2XYHJFAOARA/linux-jdk11-m3.5.x_build/maven-plugin-plugin/target/it/ant-basic/build.log, /home/jenkins/jenkins-slave/workspace/ven-plugin-tools_jdk11_asm7-J7667H6X6V4EBCRWUSKUMW4LMBBFILIHPFM47RV7V2XYHJFAOARA/linux-jdk11-m3.5.x_build/maven-plugin-plugin/target/it/ant-reference-parameter/build.log, /home/jenkins/jenkins-slave/workspace/ven-plugin-tools_jdk11_asm7-J7667H6X6V4EBCRWUSKUMW4LMBBFILIHPFM47RV7V2XYHJFAOARA/linux-jdk11-m3.5.x_build/maven-plugin-plugin/target/it/ant-simple-usage/build.log, /home/jenkins/jenkins-slave/workspace/ven-plugin-tools_jdk11_asm7-J7667H6X6V4EBCRWUSKUMW4LMBBFILIHPFM47RV7V2XYHJFAOARA/linux-jdk11-m3.5.x_build/maven-plugin-plugin/target/it/ant-since-maven-plugin/build.log, /home/jenkins/jenkins-slave/workspace/ven-plugin-tools_jdk11_asm7-J7667H6X6V4EBCRWUSKUMW4LMBBFILIHPFM47RV7V2XYHJFAOARA/linux-jdk11-m3.5.x_build/maven-plugin-plugin/target/it/asm-failure/build.log, /home/jenkins/jenkins-slave/workspace/ven-plugin-tools_jdk11_asm7-J7667H6X6V4EBCRWUSKUMW4LMBBFILIHPFM47RV7V2XYHJFAOARA/linux-jdk11-m3.5.x_build/maven-plugin-plugin/target/it/beanshell-simple/build.log, /home/jenkins/jenkins-slave/workspace/ven-plugin-tools_jdk11_asm7-J7667H6X6V4EBCRWUSKUMW4LMBBFILIHPFM47RV7V2XYHJFAOARA/linux-jdk11-m3.5.x_build/maven-plugin-plugin/target/it/fix-maven-since-3.x/build.log, /home/jenkins/jenkins-slave/workspace/ven-plugin-tools_jdk11_asm7-J7667H6X6V4EBCRWUSKUMW4LMBBFILIHPFM47RV7V2XYHJFAOARA/linux-jdk11-m3.5.x_build/maven-plugin-plugin/target/it/help-basic-jdk11/build.log, /home/jenkins/jenkins-slave/workspace/ven-plugin-tools_jdk11_asm7-J7667H6X6V4EBCRWUSKUMW4LMBBFILIHPFM47RV7V2XYHJFAOARA/linux-jdk11-m3.5.x_build/maven-plugin-plugin/target/it/help-basic/build.log, /home/jenkins/jenkins-slave/workspace/ven-plugin-tools_jdk11_asm7-J7667H6X6V4EBCRWUSKUMW4LMBBFILIHPFM47RV7V2XYHJFAOARA/linux-jdk11-m3.5.x_build/maven-plugin-plugin/target/it/help-package/build.log, /home/jenkins/jenkins-slave/workspace/ven-plugin-tools_jdk11_asm7-J7667H6X6V4EBCRWUSKUMW4LMBBFILIHPFM47RV7V2XYHJFAOARA/linux-jdk11-m3.5.x_build/maven-plugin-plugin/target/it/ignore-plugin-class-realm/build.log, /home/jenkins/jenkins-slave/workspace/ven-plugin-tools_jdk11_asm7-J7667H6X6V4EBCRWUSKUMW4LMBBFILIHPFM47RV7V2XYHJFAOARA/linux-jdk11-m3.5.x_build/maven-plugin-plugin/target/it/java-basic-annotations-jdk11/build.log, /home/jenkins/jenkins-slave/workspace/ven-plugin-tools_jdk11_asm7-J7667H6X6V4EBCRWUSKUMW4LMBBFILIHPFM47RV7V2XYHJFAOARA/linux-jdk11-m3.5.x_build/maven-plugin-plugin/target/it/java-basic-annotations-jdk8/build.log, /home/jenkins/jenkins-slave/workspace/ven-plugin-tools_jdk11_asm7-J7667H6X6V4EBCRWUSKUMW4LMBBFILIHPFM47RV7V2XYHJFAOARA/linux-jdk11-m3.5.x_build/maven-plugin-plugin/target/it/java-basic-annotations/build.log, /home/jenkins/jenkins-slave/workspace/ven-plugin-tools_jdk11_asm7-J7667H6X6V4EBCRWUSKUMW4LMBBFILIHPFM47RV7V2XYHJFAOARA/linux-jdk11-m3.5.x_build/maven-plugin-plugin/target/it/java-basic/build.log, /home/jenkins/jenkins-slave/workspace/ven-plugin-tools_jdk11_asm7-J7667H6X6V4EBCRWUSKUMW4LMBBFILIHPFM47RV7V2XYHJFAOARA/linux-jdk11-m3.5.x_build/maven-plugin-plugin/target/it/mplugin-187/build.log, /home/jenkins/jenkins-slave/workspace/ven-plugin-tools_jdk11_asm7-J7667H6X6V4EBCRWUSKUMW4LMBBFILIHPFM47RV7V2XYHJFAOARA/linux-jdk11-m3.5.x_build/maven-plugin-plugin/target/it/mplugin-191/build.log, /home/jenkins/jenkins-slave/workspace/ven-plugin-tools_jdk11_asm7-J7667H6X6V4EBCRWUSKUMW4LMBBFILIHPFM47RV7V2XYHJFAOARA/linux-jdk11-m3.5.x_build/maven-plugin-plugin/target/it/mplugin-223/build.log, /home/jenkins/jenkins-slave/workspace/ven-plugin-tools_jdk11_asm7-J7667H6X6V4EBCRWUSKUMW4LMBBFILIHPFM47RV7V2XYHJFAOARA/linux-jdk11-m3.5.x_build/maven-plugin-plugin/target/it/mplugin-272_java8/build.log, /home/jenkins/jenkins-slave/workspace/ven-plugin-tools_jdk11_asm7-J7667H6X6V4EBCRWUSKUMW4LMBBFILIHPFM47RV7V2XYHJFAOARA/linux-jdk11-m3.5.x_build/maven-plugin-plugin/target/it/mplugin-299_no-configuration/build.log, /home/jenkins/jenkins-slave/workspace/ven-plugin-tools_jdk11_asm7-J7667H6X6V4EBCRWUSKUMW4LMBBFILIHPFM47RV7V2XYHJFAOARA/linux-jdk11-m3.5.x_build/maven-plugin-plugin/target/it/mplugin-305_defaultMojoDependencies/build.log, /home/jenkins/jenkins-slave/workspace/ven-plugin-tools_jdk11_asm7-J7667H6X6V4EBCRWUSKUMW4LMBBFILIHPFM47RV7V2XYHJFAOARA/linux-jdk11-m3.5.x_build/maven-plugin-plugin/target/it/mplugin-305_emptyMojoDependencies/build.log, /home/jenkins/jenkins-slave/workspace/ven-plugin-tools_jdk11_asm7-J7667H6X6V4EBCRWUSKUMW4LMBBFILIHPFM47RV7V2XYHJFAOARA/linux-jdk11-m3.5.x_build/maven-plugin-plugin/target/it/mplugin-305_singleMojoDependencies/build.log, /home/jenkins/jenkins-slave/workspace/ven-plugin-tools_jdk11_asm7-J7667H6X6V4EBCRWUSKUMW4LMBBFILIHPFM47RV7V2XYHJFAOARA/linux-jdk11-m3.5.x_build/maven-plugin-plugin/target/it/mplugin-319_report-since/build.log, /home/jenkins/jenkins-slave/workspace/ven-plugin-tools_jdk11_asm7-J7667H6X6V4EBCRWUSKUMW4LMBBFILIHPFM47RV7V2XYHJFAOARA/linux-jdk11-m3.5.x_build/maven-plugin-plugin/target/it/mplugin-324_javadoc/build.log, /home/jenkins/jenkins-slave/workspace/ven-plugin-tools_jdk11_asm7-J7667H6X6V4EBCRWUSKUMW4LMBBFILIHPFM47RV7V2XYHJFAOARA/linux-jdk11-m3.5.x_build/maven-plugin-plugin/target/it/packaging-jar/build.log, /home/jenkins/jenkins-slave/workspace/ven-plugin-tools_jdk11_asm7-J7667H6X6V4EBCRWUSKUMW4LMBBFILIHPFM47RV7V2XYHJFAOARA/linux-jdk11-m3.5.x_build/maven-plugin-plugin/target/it/plugin-info-jdk-default-version/build.log, /home/jenkins/jenkins-slave/workspace/ven-plugin-tools_jdk11_asm7-J7667H6X6V4EBCRWUSKUMW4LMBBFILIHPFM47RV7V2XYHJFAOARA/linux-jdk11-m3.5.x_build/maven-plugin-plugin/target/it/plugin-info-jdk/build.log, /home/jenkins/jenkins-slave/workspace/ven-plugin-tools_jdk11_asm7-J7667H6X6V4EBCRWUSKUMW4LMBBFILIHPFM47RV7V2XYHJFAOARA/linux-jdk11-m3.5.x_build/maven-plugin-plugin/target/it/plugin-report-annotations/build.log, /home/jenkins/jenkins-slave/workspace/ven-plugin-tools_jdk11_asm7-J7667H6X6V4EBCRWUSKUMW4LMBBFILIHPFM47RV7V2XYHJFAOARA/linux-jdk11-m3.5.x_build/maven-plugin-plugin/target/it/plugin-report/build.log, /home/jenkins/jenkins-slave/workspace/ven-plugin-tools_jdk11_asm7-J7667H6X6V4EBCRWUSKUMW4LMBBFILIHPFM47RV7V2XYHJFAOARA/linux-jdk11-m3.5.x_build/maven-plugin-plugin/target/it/skip/build.log, /home/jenkins/jenkins-slave/workspace/ven-plugin-tools_jdk11_asm7-J7667H6X6V4EBCRWUSKUMW4LMBBFILIHPFM47RV7V2XYHJFAOARA/linux-jdk11-m3.5.x_build/maven-plugin-plugin/target/it/source-encoding/build.log]
[linux-jdk11-m3.5.x_build] Finished parsing Maven Invoker results (found 35)
[linux-jdk11-m3.5.x_build] [withMaven] junitPublisher - Archive test results for Maven artifact org.apache.maven.plugin-tools:maven-plugin-tools-api:3.6.0-SNAPSHOT generated by maven-surefire-plugin:test (default-test): linux-jdk11-m3.5.x_build/maven-plugin-tools-api/target/surefire-reports/*.xml
[linux-jdk11-m3.5.x_build] Recording test results
[linux-jdk11-m3.5.x_build] [withMaven] junitPublisher - Archive test results for Maven artifact org.apache.maven.plugin-tools:maven-plugin-tools-generators:3.6.0-SNAPSHOT generated by maven-surefire-plugin:test (default-test): linux-jdk11-m3.5.x_build/maven-plugin-tools-generators/target/surefire-reports/*.xml
[linux-jdk11-m3.5.x_build] Recording test results
[linux-jdk11-m3.5.x_build] [withMaven] junitPublisher - Archive test results for Maven artifact org.apache.maven.plugin-tools:maven-plugin-tools-java:3.6.0-SNAPSHOT generated by maven-surefire-plugin:test (default-test): linux-jdk11-m3.5.x_build/maven-plugin-tools-java/target/surefire-reports/*.xml
[linux-jdk11-m3.5.x_build] Recording test results
[linux-jdk11-m3.5.x_build] [withMaven] junitPublisher - Archive test results for Maven artifact org.apache.maven.plugin-tools:maven-plugin-annotations:3.6.0-SNAPSHOT generated by maven-surefire-plugin:test (default-test): linux-jdk11-m3.5.x_build/maven-plugin-annotations/target/surefire-reports/*.xml
[linux-jdk11-m3.5.x_build] Recording test results
[linux-jdk11-m3.5.x_build] None of the test reports contained any result
[linux-jdk11-m3.5.x_build] [withMaven] junitPublisher - Archive test results for Maven artifact org.apache.maven.plugin-tools:maven-plugin-tools-annotations:3.6.0-SNAPSHOT generated by maven-surefire-plugin:test (default-test): linux-jdk11-m3.5.x_build/maven-plugin-tools-annotations/target/surefire-reports/*.xml
[linux-jdk11-m3.5.x_build] Recording test results
[linux-jdk11-m3.5.x_build] [withMaven] junitPublisher - Archive test results for Maven artifact org.apache.maven.plugin-tools:maven-plugin-tools-model:3.6.0-SNAPSHOT generated by maven-surefire-plugin:test (default-test): linux-jdk11-m3.5.x_build/maven-script/maven-plugin-tools-model/target/surefire-reports/*.xml
[linux-jdk11-m3.5.x_build] Recording test results
[linux-jdk11-m3.5.x_build] [withMaven] junitPublisher - Archive test results for Maven artifact org.apache.maven.plugin-tools:maven-plugin-tools-ant:3.6.0-SNAPSHOT generated by maven-surefire-plugin:test (default-test): linux-jdk11-m3.5.x_build/maven-script/maven-plugin-tools-ant/target/surefire-reports/*.xml
[linux-jdk11-m3.5.x_build] Recording test results
[linux-jdk11-m3.5.x_build] [withMaven] junitPublisher - Archive test results for Maven artifact org.apache.maven.plugin-tools:maven-script-ant:3.6.0-SNAPSHOT generated by maven-surefire-plugin:test (default-test): linux-jdk11-m3.5.x_build/maven-script/maven-script-ant/target/surefire-reports/*.xml
[linux-jdk11-m3.5.x_build] Recording test results
[linux-jdk11-m3.5.x_build] [withMaven] junitPublisher - Archive test results for Maven artifact org.apache.maven.plugin-tools:maven-plugin-tools-beanshell:3.6.0-SNAPSHOT generated by maven-surefire-plugin:test (default-test): linux-jdk11-m3.5.x_build/maven-script/maven-plugin-tools-beanshell/target/surefire-reports/*.xml
[linux-jdk11-m3.5.x_build] Recording test results
[linux-jdk11-m3.5.x_build] None of the test reports contained any result
[linux-jdk11-m3.5.x_build] [withMaven] junitPublisher - Archive test results for Maven artifact org.apache.maven.plugin-tools:maven-script-beanshell:3.6.0-SNAPSHOT generated by maven-surefire-plugin:test (default-test): linux-jdk11-m3.5.x_build/maven-script/maven-script-beanshell/target/surefire-reports/*.xml
[linux-jdk11-m3.5.x_build] Recording test results
[linux-jdk11-m3.5.x_build] None of the test reports contained any result
[linux-jdk11-m3.5.x_build] [withMaven] junitPublisher - Archive test results for Maven artifact org.apache.maven.plugins:maven-plugin-plugin:3.6.0-SNAPSHOT generated by maven-surefire-plugin:test (default-test): linux-jdk11-m3.5.x_build/maven-plugin-plugin/target/surefire-reports/*.xml
[linux-jdk11-m3.5.x_build] Recording test results
[linux-jdk11-m3.5.x_build] None of the test reports contained any result
[linux-jdk11-m3.5.x_build] [withMaven] openTasksPublisher - Scan Tasks for Maven artifact org.apache.maven.plugin-tools:maven-plugin-tools-api:3.6.0-SNAPSHOT in source directory linux-jdk11-m3.5.x_build/maven-plugin-tools-api/src/main/java
[linux-jdk11-m3.5.x_build] [withMaven] openTasksPublisher - Scan Tasks for Maven artifact org.apache.maven.plugin-tools:maven-plugin-tools-generators:3.6.0-SNAPSHOT in source directory linux-jdk11-m3.5.x_build/maven-plugin-tools-generators/src/main/java
[linux-jdk11-m3.5.x_build] [withMaven] openTasksPublisher - Scan Tasks for Maven artifact org.apache.maven.plugin-tools:maven-plugin-tools-java:3.6.0-SNAPSHOT in source directory linux-jdk11-m3.5.x_build/maven-plugin-tools-java/src/main/java
[linux-jdk11-m3.5.x_build] [withMaven] openTasksPublisher - Scan Tasks for Maven artifact org.apache.maven.plugin-tools:maven-plugin-annotations:3.6.0-SNAPSHOT in source directory linux-jdk11-m3.5.x_build/maven-plugin-annotations/src/main/java
[linux-jdk11-m3.5.x_build] [withMaven] openTasksPublisher - Scan Tasks for Maven artifact org.apache.maven.plugin-tools:maven-plugin-tools-annotations:3.6.0-SNAPSHOT in source directory linux-jdk11-m3.5.x_build/maven-plugin-tools-annotations/src/main/java
[linux-jdk11-m3.5.x_build] [withMaven] openTasksPublisher - Scan Tasks for Maven artifact org.apache.maven.plugin-tools:maven-plugin-tools-model:3.6.0-SNAPSHOT in source directory linux-jdk11-m3.5.x_build/maven-script/maven-plugin-tools-model/src/main/java
[linux-jdk11-m3.5.x_build] [withMaven] openTasksPublisher - Scan Tasks for Maven artifact org.apache.maven.plugin-tools:maven-plugin-tools-ant:3.6.0-SNAPSHOT in source directory linux-jdk11-m3.5.x_build/maven-script/maven-plugin-tools-ant/src/main/java
[linux-jdk11-m3.5.x_build] [withMaven] openTasksPublisher - Scan Tasks for Maven artifact org.apache.maven.plugin-tools:maven-script-ant:3.6.0-SNAPSHOT in source directory linux-jdk11-m3.5.x_build/maven-script/maven-script-ant/src/main/java
[linux-jdk11-m3.5.x_build] [withMaven] openTasksPublisher - Scan Tasks for Maven artifact org.apache.maven.plugin-tools:maven-plugin-tools-beanshell:3.6.0-SNAPSHOT in source directory linux-jdk11-m3.5.x_build/maven-script/maven-plugin-tools-beanshell/src/main/java
[linux-jdk11-m3.5.x_build] [withMaven] openTasksPublisher - Scan Tasks for Maven artifact org.apache.maven.plugin-tools:maven-script-beanshell:3.6.0-SNAPSHOT in source directory linux-jdk11-m3.5.x_build/maven-script/maven-script-beanshell/src/main/java
[linux-jdk11-m3.5.x_build] [withMaven] openTasksPublisher - Scan Tasks for Maven artifact org.apache.maven.plugins:maven-plugin-plugin:3.6.0-SNAPSHOT in source directory linux-jdk11-m3.5.x_build/maven-plugin-plugin/src/main/java
[linux-jdk11-m3.5.x_build] [TASKS] Scanning folder '/home/jenkins/jenkins-slave/workspace/ven-plugin-tools_jdk11_asm7-J7667H6X6V4EBCRWUSKUMW4LMBBFILIHPFM47RV7V2XYHJFAOARA' for files matching the pattern 'linux-jdk11-m3.5.x_build/maven-plugin-tools-api/src/main/java/**/*,linux-jdk11-m3.5.x_build/maven-plugin-tools-generators/src/main/java/**/*,linux-jdk11-m3.5.x_build/maven-plugin-tools-java/src/main/java/**/*,linux-jdk11-m3.5.x_build/maven-plugin-annotations/src/main/java/**/*,linux-jdk11-m3.5.x_build/maven-plugin-tools-annotations/src/main/java/**/*,linux-jdk11-m3.5.x_build/maven-script/maven-plugin-tools-model/src/main/java/**/*,linux-jdk11-m3.5.x_build/maven-script/maven-plugin-tools-ant/src/main/java/**/*,linux-jdk11-m3.5.x_build/maven-script/maven-script-ant/src/main/java/**/*,linux-jdk11-m3.5.x_build/maven-script/maven-plugin-tools-beanshell/src/main/java/**/*,linux-jdk11-m3.5.x_build/maven-script/maven-script-beanshell/src/main/java/**/*,linux-jdk11-m3.5.x_build/maven-plugin-plugin/src/main/java/**/*' - excludes: null
[linux-jdk11-m3.5.x_build] [TASKS] Found 53 files to scan for tasks
[linux-jdk11-m3.5.x_build] [TASKS] Found 11 open tasks.
[linux-jdk11-m3.5.x_build] Skipping warnings blame since pipelines do not have an SCM link.%n
[linux-jdk11-m3.5.x_build] [TASKS] Computing warning deltas based on reference build #5
[Pipeline] [linux-jdk11-m3.5.x_build] // withMaven
[Pipeline] [linux-jdk11-m3.5.x_build] cleanWs
[linux-jdk11-m3.5.x_build] [WS-CLEANUP] Deleting project workspace...[WS-CLEANUP] done
[Pipeline] [linux-jdk11-m3.5.x_build] }
[Pipeline] [linux-jdk11-m3.5.x_build] // stage
[Pipeline] [linux-jdk11-m3.5.x_build] }
[Pipeline] [linux-jdk11-m3.5.x_build] // node
[Pipeline] [linux-jdk11-m3.5.x_build] }
[Pipeline] // parallel
[Pipeline] stage
[Pipeline] { (Notifications)
[Pipeline] echo
Build result: UNSTABLE
[Pipeline] jiraIssueSelector
[Pipeline] emailext
Mime
  • Unnamed multipart/mixed (inline, None, 0 bytes)
View raw message