maven-notifications mailing list archives

Site index · List index
Message view « Date » · « Thread »
Top « Date » · « Thread »
From Apache Jenkins Server <jenk...@builds.apache.org>
Subject Build failed in Jenkins: Maven TLP » maven-plugin-tools » jdk11_asm7 #1
Date Wed, 03 Oct 2018 11:30:42 GMT
See https://builds.apache.org/job/maven-box/job/maven-plugin-tools/job/jdk11_asm7/1/

No changes.

1 tests failed.
FAILED:  org.apache.maven.tools.plugin.generator.PluginHelpGeneratorTest.testGenerator

Error Message:
C:\Users\jenkins\AppData\Local\Temp\testGenerator-outDir\org\apache\maven\tools\plugin\generator\HelpMojo.java (The system cannot find the path specified)

Stack Trace:
org.apache.maven.tools.plugin.generator.GeneratorException: C:\Users\jenkins\AppData\Local\Temp\testGenerator-outDir\org\apache\maven\tools\plugin\generator\HelpMojo.java (The system cannot find the path specified)
	at org.apache.maven.tools.plugin.generator.PluginHelpGenerator.execute(PluginHelpGenerator.java:159)
	at org.apache.maven.tools.plugin.generator.AbstractGeneratorTestCase.testGenerator(AbstractGeneratorTestCase.java:123)
	at java.base/jdk.internal.reflect.NativeMethodAccessorImpl.invoke0(Native Method)
	at java.base/jdk.internal.reflect.NativeMethodAccessorImpl.invoke(NativeMethodAccessorImpl.java:62)
	at java.base/jdk.internal.reflect.DelegatingMethodAccessorImpl.invoke(DelegatingMethodAccessorImpl.java:43)
	at java.base/java.lang.reflect.Method.invoke(Method.java:564)
	at junit.framework.TestCase.runTest(TestCase.java:164)
	at junit.framework.TestCase.runBare(TestCase.java:130)
	at junit.framework.TestResult$1.protect(TestResult.java:106)
	at junit.framework.TestResult.runProtected(TestResult.java:124)
	at junit.framework.TestResult.run(TestResult.java:109)
	at junit.framework.TestCase.run(TestCase.java:120)
	at junit.framework.TestSuite.runTest(TestSuite.java:230)
	at junit.framework.TestSuite.run(TestSuite.java:225)
	at java.base/jdk.internal.reflect.NativeMethodAccessorImpl.invoke0(Native Method)
	at java.base/jdk.internal.reflect.NativeMethodAccessorImpl.invoke(NativeMethodAccessorImpl.java:62)
	at java.base/jdk.internal.reflect.DelegatingMethodAccessorImpl.invoke(DelegatingMethodAccessorImpl.java:43)
	at java.base/java.lang.reflect.Method.invoke(Method.java:564)
	at org.apache.maven.surefire.junit.JUnitTestSet.execute(JUnitTestSet.java:100)
	at org.apache.maven.surefire.junit.JUnit3Provider.executeTestSet(JUnit3Provider.java:140)
	at org.apache.maven.surefire.junit.JUnit3Provider.invoke(JUnit3Provider.java:113)
	at org.apache.maven.surefire.booter.ForkedBooter.invokeProviderInSameClassLoader(ForkedBooter.java:383)
	at org.apache.maven.surefire.booter.ForkedBooter.runSuitesInProcess(ForkedBooter.java:344)
	at org.apache.maven.surefire.booter.ForkedBooter.execute(ForkedBooter.java:125)
	at org.apache.maven.surefire.booter.ForkedBooter.main(ForkedBooter.java:417)
Caused by: java.io.FileNotFoundException: C:\Users\jenkins\AppData\Local\Temp\testGenerator-outDir\org\apache\maven\tools\plugin\generator\HelpMojo.java (The system cannot find the path specified)
	at java.base/java.io.FileOutputStream.open0(Native Method)
	at java.base/java.io.FileOutputStream.open(FileOutputStream.java:299)
	at java.base/java.io.FileOutputStream.<init>(FileOutputStream.java:238)
	at java.base/java.io.FileOutputStream.<init>(FileOutputStream.java:188)
	at org.codehaus.plexus.util.FileUtils.fileWrite(FileUtils.java:508)
	at org.apache.maven.tools.plugin.generator.PluginHelpGenerator.execute(PluginHelpGenerator.java:155)
	... 24 more
Caused by: java.io.FileNotFoundException: C:\Users\jenkins\AppData\Local\Temp\testGenerator-outDir\org\apache\maven\tools\plugin\generator\HelpMojo.java (The system cannot find the path specified)
	at java.base/java.io.FileOutputStream.open0(Native Method)
	at java.base/java.io.FileOutputStream.open(FileOutputStream.java:299)
	at java.base/java.io.FileOutputStream.<init>(FileOutputStream.java:238)
	at java.base/java.io.FileOutputStream.<init>(FileOutputStream.java:188)
	at org.codehaus.plexus.util.FileUtils.fileWrite(FileUtils.java:508)
	at org.apache.maven.tools.plugin.generator.PluginHelpGenerator.execute(PluginHelpGenerator.java:155)
	... 24 more




Build log:
[...truncated 2.94 MB...]
[Pipeline] [windows-jdk8] }
[windows-jdk8] [withMaven] invokerPublisher - Archive invoker results for Maven artifact MavenArtifact{org.apache.maven.plugins:maven-plugin-plugin::3.6-SNAPSHOT(version: 3.6-SNAPSHOT, snapshot:false) } generated by PluginInvocation{org.apache.maven.plugins:maven-invoker-plugin:3.0.1@run  integration-test}: m\maven-plugin-plugin\target\invoker-reports\*.xml
[windows-jdk8] performing MavenInvokerRecorder, reportsFilenamePattern:'**/m\maven-plugin-plugin\target\invoker-reports/BUILD*.xml', invokerBuildDir:'**/m\maven-plugin-plugin\target\it'
[windows-jdk8] Found reports:[f:\jenkins\jenkins-slave\workspace\ven-plugin-tools_jdk11_asm7-J7667H6X6V4EBCRWUSKUMW4LMBBFILIHPFM47RV7V2XYHJFAOARA\m\maven-plugin-plugin\target\invoker-reports\BUILD-annotation-with-inheritance-from-deps.xml, f:\jenkins\jenkins-slave\workspace\ven-plugin-tools_jdk11_asm7-J7667H6X6V4EBCRWUSKUMW4LMBBFILIHPFM47RV7V2XYHJFAOARA\m\maven-plugin-plugin\target\invoker-reports\BUILD-annotation-with-inheritance-reactor.xml, f:\jenkins\jenkins-slave\workspace\ven-plugin-tools_jdk11_asm7-J7667H6X6V4EBCRWUSKUMW4LMBBFILIHPFM47RV7V2XYHJFAOARA\m\maven-plugin-plugin\target\invoker-reports\BUILD-annotation-with-inheritance.xml, f:\jenkins\jenkins-slave\workspace\ven-plugin-tools_jdk11_asm7-J7667H6X6V4EBCRWUSKUMW4LMBBFILIHPFM47RV7V2XYHJFAOARA\m\maven-plugin-plugin\target\invoker-reports\BUILD-ant-basic.xml, f:\jenkins\jenkins-slave\workspace\ven-plugin-tools_jdk11_asm7-J7667H6X6V4EBCRWUSKUMW4LMBBFILIHPFM47RV7V2XYHJFAOARA\m\maven-plugin-plugin\target\invoker-reports\BUILD-ant-reference-parameter.xml, f:\jenkins\jenkins-slave\workspace\ven-plugin-tools_jdk11_asm7-J7667H6X6V4EBCRWUSKUMW4LMBBFILIHPFM47RV7V2XYHJFAOARA\m\maven-plugin-plugin\target\invoker-reports\BUILD-ant-simple-usage.xml, f:\jenkins\jenkins-slave\workspace\ven-plugin-tools_jdk11_asm7-J7667H6X6V4EBCRWUSKUMW4LMBBFILIHPFM47RV7V2XYHJFAOARA\m\maven-plugin-plugin\target\invoker-reports\BUILD-ant-since-maven-plugin.xml, f:\jenkins\jenkins-slave\workspace\ven-plugin-tools_jdk11_asm7-J7667H6X6V4EBCRWUSKUMW4LMBBFILIHPFM47RV7V2XYHJFAOARA\m\maven-plugin-plugin\target\invoker-reports\BUILD-asm-failure.xml, f:\jenkins\jenkins-slave\workspace\ven-plugin-tools_jdk11_asm7-J7667H6X6V4EBCRWUSKUMW4LMBBFILIHPFM47RV7V2XYHJFAOARA\m\maven-plugin-plugin\target\invoker-reports\BUILD-beanshell-simple.xml, f:\jenkins\jenkins-slave\workspace\ven-plugin-tools_jdk11_asm7-J7667H6X6V4EBCRWUSKUMW4LMBBFILIHPFM47RV7V2XYHJFAOARA\m\maven-plugin-plugin\target\invoker-reports\BUILD-fix-maven-since-3.x.xml, f:\jenkins\jenkins-slave\workspace\ven-plugin-tools_jdk11_asm7-J7667H6X6V4EBCRWUSKUMW4LMBBFILIHPFM47RV7V2XYHJFAOARA\m\maven-plugin-plugin\target\invoker-reports\BUILD-help-basic-jdk11.xml, f:\jenkins\jenkins-slave\workspace\ven-plugin-tools_jdk11_asm7-J7667H6X6V4EBCRWUSKUMW4LMBBFILIHPFM47RV7V2XYHJFAOARA\m\maven-plugin-plugin\target\invoker-reports\BUILD-help-basic.xml, f:\jenkins\jenkins-slave\workspace\ven-plugin-tools_jdk11_asm7-J7667H6X6V4EBCRWUSKUMW4LMBBFILIHPFM47RV7V2XYHJFAOARA\m\maven-plugin-plugin\target\invoker-reports\BUILD-help-package.xml, f:\jenkins\jenkins-slave\workspace\ven-plugin-tools_jdk11_asm7-J7667H6X6V4EBCRWUSKUMW4LMBBFILIHPFM47RV7V2XYHJFAOARA\m\maven-plugin-plugin\target\invoker-reports\BUILD-ignore-plugin-class-realm.xml, f:\jenkins\jenkins-slave\workspace\ven-plugin-tools_jdk11_asm7-J7667H6X6V4EBCRWUSKUMW4LMBBFILIHPFM47RV7V2XYHJFAOARA\m\maven-plugin-plugin\target\invoker-reports\BUILD-java-basic-annotations-jdk11.xml, f:\jenkins\jenkins-slave\workspace\ven-plugin-tools_jdk11_asm7-J7667H6X6V4EBCRWUSKUMW4LMBBFILIHPFM47RV7V2XYHJFAOARA\m\maven-plugin-plugin\target\invoker-reports\BUILD-java-basic-annotations-jdk8.xml, f:\jenkins\jenkins-slave\workspace\ven-plugin-tools_jdk11_asm7-J7667H6X6V4EBCRWUSKUMW4LMBBFILIHPFM47RV7V2XYHJFAOARA\m\maven-plugin-plugin\target\invoker-reports\BUILD-java-basic-annotations.xml, f:\jenkins\jenkins-slave\workspace\ven-plugin-tools_jdk11_asm7-J7667H6X6V4EBCRWUSKUMW4LMBBFILIHPFM47RV7V2XYHJFAOARA\m\maven-plugin-plugin\target\invoker-reports\BUILD-java-basic.xml, f:\jenkins\jenkins-slave\workspace\ven-plugin-tools_jdk11_asm7-J7667H6X6V4EBCRWUSKUMW4LMBBFILIHPFM47RV7V2XYHJFAOARA\m\maven-plugin-plugin\target\invoker-reports\BUILD-mplugin-187.xml, f:\jenkins\jenkins-slave\workspace\ven-plugin-tools_jdk11_asm7-J7667H6X6V4EBCRWUSKUMW4LMBBFILIHPFM47RV7V2XYHJFAOARA\m\maven-plugin-plugin\target\invoker-reports\BUILD-mplugin-191.xml, f:\jenkins\jenkins-slave\workspace\ven-plugin-tools_jdk11_asm7-J7667H6X6V4EBCRWUSKUMW4LMBBFILIHPFM47RV7V2XYHJFAOARA\m\maven-plugin-plugin\target\invoker-reports\BUILD-mplugin-223.xml, f:\jenkins\jenkins-slave\workspace\ven-plugin-tools_jdk11_asm7-J7667H6X6V4EBCRWUSKUMW4LMBBFILIHPFM47RV7V2XYHJFAOARA\m\maven-plugin-plugin\target\invoker-reports\BUILD-mplugin-272_java8.xml, f:\jenkins\jenkins-slave\workspace\ven-plugin-tools_jdk11_asm7-J7667H6X6V4EBCRWUSKUMW4LMBBFILIHPFM47RV7V2XYHJFAOARA\m\maven-plugin-plugin\target\invoker-reports\BUILD-mplugin-299_no-configuration.xml, f:\jenkins\jenkins-slave\workspace\ven-plugin-tools_jdk11_asm7-J7667H6X6V4EBCRWUSKUMW4LMBBFILIHPFM47RV7V2XYHJFAOARA\m\maven-plugin-plugin\target\invoker-reports\BUILD-mplugin-305_defaultMojoDependencies.xml, f:\jenkins\jenkins-slave\workspace\ven-plugin-tools_jdk11_asm7-J7667H6X6V4EBCRWUSKUMW4LMBBFILIHPFM47RV7V2XYHJFAOARA\m\maven-plugin-plugin\target\invoker-reports\BUILD-mplugin-305_emptyMojoDependencies.xml, f:\jenkins\jenkins-slave\workspace\ven-plugin-tools_jdk11_asm7-J7667H6X6V4EBCRWUSKUMW4LMBBFILIHPFM47RV7V2XYHJFAOARA\m\maven-plugin-plugin\target\invoker-reports\BUILD-mplugin-305_singleMojoDependencies.xml, f:\jenkins\jenkins-slave\workspace\ven-plugin-tools_jdk11_asm7-J7667H6X6V4EBCRWUSKUMW4LMBBFILIHPFM47RV7V2XYHJFAOARA\m\maven-plugin-plugin\target\invoker-reports\BUILD-mplugin-319_report-since.xml, f:\jenkins\jenkins-slave\workspace\ven-plugin-tools_jdk11_asm7-J7667H6X6V4EBCRWUSKUMW4LMBBFILIHPFM47RV7V2XYHJFAOARA\m\maven-plugin-plugin\target\invoker-reports\BUILD-mplugin-324_javadoc.xml, f:\jenkins\jenkins-slave\workspace\ven-plugin-tools_jdk11_asm7-J7667H6X6V4EBCRWUSKUMW4LMBBFILIHPFM47RV7V2XYHJFAOARA\m\maven-plugin-plugin\target\invoker-reports\BUILD-packaging-jar.xml, f:\jenkins\jenkins-slave\workspace\ven-plugin-tools_jdk11_asm7-J7667H6X6V4EBCRWUSKUMW4LMBBFILIHPFM47RV7V2XYHJFAOARA\m\maven-plugin-plugin\target\invoker-reports\BUILD-plugin-info-jdk-default-version.xml, f:\jenkins\jenkins-slave\workspace\ven-plugin-tools_jdk11_asm7-J7667H6X6V4EBCRWUSKUMW4LMBBFILIHPFM47RV7V2XYHJFAOARA\m\maven-plugin-plugin\target\invoker-reports\BUILD-plugin-info-jdk.xml, f:\jenkins\jenkins-slave\workspace\ven-plugin-tools_jdk11_asm7-J7667H6X6V4EBCRWUSKUMW4LMBBFILIHPFM47RV7V2XYHJFAOARA\m\maven-plugin-plugin\target\invoker-reports\BUILD-plugin-report-annotations.xml, f:\jenkins\jenkins-slave\workspace\ven-plugin-tools_jdk11_asm7-J7667H6X6V4EBCRWUSKUMW4LMBBFILIHPFM47RV7V2XYHJFAOARA\m\maven-plugin-plugin\target\invoker-reports\BUILD-plugin-report.xml, f:\jenkins\jenkins-slave\workspace\ven-plugin-tools_jdk11_asm7-J7667H6X6V4EBCRWUSKUMW4LMBBFILIHPFM47RV7V2XYHJFAOARA\m\maven-plugin-plugin\target\invoker-reports\BUILD-skip.xml, f:\jenkins\jenkins-slave\workspace\ven-plugin-tools_jdk11_asm7-J7667H6X6V4EBCRWUSKUMW4LMBBFILIHPFM47RV7V2XYHJFAOARA\m\maven-plugin-plugin\target\invoker-reports\BUILD-source-encoding.xml]
[windows-jdk8] Found logs:[f:\jenkins\jenkins-slave\workspace\ven-plugin-tools_jdk11_asm7-J7667H6X6V4EBCRWUSKUMW4LMBBFILIHPFM47RV7V2XYHJFAOARA\m\maven-plugin-plugin\target\it\annotation-with-inheritance-from-deps\build.log, f:\jenkins\jenkins-slave\workspace\ven-plugin-tools_jdk11_asm7-J7667H6X6V4EBCRWUSKUMW4LMBBFILIHPFM47RV7V2XYHJFAOARA\m\maven-plugin-plugin\target\it\annotation-with-inheritance-reactor\build.log, f:\jenkins\jenkins-slave\workspace\ven-plugin-tools_jdk11_asm7-J7667H6X6V4EBCRWUSKUMW4LMBBFILIHPFM47RV7V2XYHJFAOARA\m\maven-plugin-plugin\target\it\annotation-with-inheritance\build.log, f:\jenkins\jenkins-slave\workspace\ven-plugin-tools_jdk11_asm7-J7667H6X6V4EBCRWUSKUMW4LMBBFILIHPFM47RV7V2XYHJFAOARA\m\maven-plugin-plugin\target\it\ant-basic\build.log, f:\jenkins\jenkins-slave\workspace\ven-plugin-tools_jdk11_asm7-J7667H6X6V4EBCRWUSKUMW4LMBBFILIHPFM47RV7V2XYHJFAOARA\m\maven-plugin-plugin\target\it\ant-reference-parameter\build.log, f:\jenkins\jenkins-slave\workspace\ven-plugin-tools_jdk11_asm7-J7667H6X6V4EBCRWUSKUMW4LMBBFILIHPFM47RV7V2XYHJFAOARA\m\maven-plugin-plugin\target\it\ant-simple-usage\build.log, f:\jenkins\jenkins-slave\workspace\ven-plugin-tools_jdk11_asm7-J7667H6X6V4EBCRWUSKUMW4LMBBFILIHPFM47RV7V2XYHJFAOARA\m\maven-plugin-plugin\target\it\ant-since-maven-plugin\build.log, f:\jenkins\jenkins-slave\workspace\ven-plugin-tools_jdk11_asm7-J7667H6X6V4EBCRWUSKUMW4LMBBFILIHPFM47RV7V2XYHJFAOARA\m\maven-plugin-plugin\target\it\asm-failure\build.log, f:\jenkins\jenkins-slave\workspace\ven-plugin-tools_jdk11_asm7-J7667H6X6V4EBCRWUSKUMW4LMBBFILIHPFM47RV7V2XYHJFAOARA\m\maven-plugin-plugin\target\it\beanshell-simple\build.log, f:\jenkins\jenkins-slave\workspace\ven-plugin-tools_jdk11_asm7-J7667H6X6V4EBCRWUSKUMW4LMBBFILIHPFM47RV7V2XYHJFAOARA\m\maven-plugin-plugin\target\it\fix-maven-since-3.x\build.log, f:\jenkins\jenkins-slave\workspace\ven-plugin-tools_jdk11_asm7-J7667H6X6V4EBCRWUSKUMW4LMBBFILIHPFM47RV7V2XYHJFAOARA\m\maven-plugin-plugin\target\it\help-basic\build.log, f:\jenkins\jenkins-slave\workspace\ven-plugin-tools_jdk11_asm7-J7667H6X6V4EBCRWUSKUMW4LMBBFILIHPFM47RV7V2XYHJFAOARA\m\maven-plugin-plugin\target\it\help-package\build.log, f:\jenkins\jenkins-slave\workspace\ven-plugin-tools_jdk11_asm7-J7667H6X6V4EBCRWUSKUMW4LMBBFILIHPFM47RV7V2XYHJFAOARA\m\maven-plugin-plugin\target\it\ignore-plugin-class-realm\build.log, f:\jenkins\jenkins-slave\workspace\ven-plugin-tools_jdk11_asm7-J7667H6X6V4EBCRWUSKUMW4LMBBFILIHPFM47RV7V2XYHJFAOARA\m\maven-plugin-plugin\target\it\java-basic-annotations-jdk11\build.log, f:\jenkins\jenkins-slave\workspace\ven-plugin-tools_jdk11_asm7-J7667H6X6V4EBCRWUSKUMW4LMBBFILIHPFM47RV7V2XYHJFAOARA\m\maven-plugin-plugin\target\it\java-basic-annotations-jdk8\build.log, f:\jenkins\jenkins-slave\workspace\ven-plugin-tools_jdk11_asm7-J7667H6X6V4EBCRWUSKUMW4LMBBFILIHPFM47RV7V2XYHJFAOARA\m\maven-plugin-plugin\target\it\java-basic-annotations\build.log, f:\jenkins\jenkins-slave\workspace\ven-plugin-tools_jdk11_asm7-J7667H6X6V4EBCRWUSKUMW4LMBBFILIHPFM47RV7V2XYHJFAOARA\m\maven-plugin-plugin\target\it\java-basic\build.log, f:\jenkins\jenkins-slave\workspace\ven-plugin-tools_jdk11_asm7-J7667H6X6V4EBCRWUSKUMW4LMBBFILIHPFM47RV7V2XYHJFAOARA\m\maven-plugin-plugin\target\it\mplugin-187\build.log, f:\jenkins\jenkins-slave\workspace\ven-plugin-tools_jdk11_asm7-J7667H6X6V4EBCRWUSKUMW4LMBBFILIHPFM47RV7V2XYHJFAOARA\m\maven-plugin-plugin\target\it\mplugin-191\build.log, f:\jenkins\jenkins-slave\workspace\ven-plugin-tools_jdk11_asm7-J7667H6X6V4EBCRWUSKUMW4LMBBFILIHPFM47RV7V2XYHJFAOARA\m\maven-plugin-plugin\target\it\mplugin-223\build.log, f:\jenkins\jenkins-slave\workspace\ven-plugin-tools_jdk11_asm7-J7667H6X6V4EBCRWUSKUMW4LMBBFILIHPFM47RV7V2XYHJFAOARA\m\maven-plugin-plugin\target\it\mplugin-272_java8\build.log, f:\jenkins\jenkins-slave\workspace\ven-plugin-tools_jdk11_asm7-J7667H6X6V4EBCRWUSKUMW4LMBBFILIHPFM47RV7V2XYHJFAOARA\m\maven-plugin-plugin\target\it\mplugin-299_no-configuration\build.log, f:\jenkins\jenkins-slave\workspace\ven-plugin-tools_jdk11_asm7-J7667H6X6V4EBCRWUSKUMW4LMBBFILIHPFM47RV7V2XYHJFAOARA\m\maven-plugin-plugin\target\it\mplugin-305_defaultMojoDependencies\build.log, f:\jenkins\jenkins-slave\workspace\ven-plugin-tools_jdk11_asm7-J7667H6X6V4EBCRWUSKUMW4LMBBFILIHPFM47RV7V2XYHJFAOARA\m\maven-plugin-plugin\target\it\mplugin-305_emptyMojoDependencies\build.log, f:\jenkins\jenkins-slave\workspace\ven-plugin-tools_jdk11_asm7-J7667H6X6V4EBCRWUSKUMW4LMBBFILIHPFM47RV7V2XYHJFAOARA\m\maven-plugin-plugin\target\it\mplugin-305_singleMojoDependencies\build.log, f:\jenkins\jenkins-slave\workspace\ven-plugin-tools_jdk11_asm7-J7667H6X6V4EBCRWUSKUMW4LMBBFILIHPFM47RV7V2XYHJFAOARA\m\maven-plugin-plugin\target\it\mplugin-319_report-since\build.log, f:\jenkins\jenkins-slave\workspace\ven-plugin-tools_jdk11_asm7-J7667H6X6V4EBCRWUSKUMW4LMBBFILIHPFM47RV7V2XYHJFAOARA\m\maven-plugin-plugin\target\it\mplugin-324_javadoc\build.log, f:\jenkins\jenkins-slave\workspace\ven-plugin-tools_jdk11_asm7-J7667H6X6V4EBCRWUSKUMW4LMBBFILIHPFM47RV7V2XYHJFAOARA\m\maven-plugin-plugin\target\it\packaging-jar\build.log, f:\jenkins\jenkins-slave\workspace\ven-plugin-tools_jdk11_asm7-J7667H6X6V4EBCRWUSKUMW4LMBBFILIHPFM47RV7V2XYHJFAOARA\m\maven-plugin-plugin\target\it\plugin-info-jdk-default-version\build.log, f:\jenkins\jenkins-slave\workspace\ven-plugin-tools_jdk11_asm7-J7667H6X6V4EBCRWUSKUMW4LMBBFILIHPFM47RV7V2XYHJFAOARA\m\maven-plugin-plugin\target\it\plugin-info-jdk\build.log, f:\jenkins\jenkins-slave\workspace\ven-plugin-tools_jdk11_asm7-J7667H6X6V4EBCRWUSKUMW4LMBBFILIHPFM47RV7V2XYHJFAOARA\m\maven-plugin-plugin\target\it\plugin-report-annotations\build.log, f:\jenkins\jenkins-slave\workspace\ven-plugin-tools_jdk11_asm7-J7667H6X6V4EBCRWUSKUMW4LMBBFILIHPFM47RV7V2XYHJFAOARA\m\maven-plugin-plugin\target\it\plugin-report\build.log, f:\jenkins\jenkins-slave\workspace\ven-plugin-tools_jdk11_asm7-J7667H6X6V4EBCRWUSKUMW4LMBBFILIHPFM47RV7V2XYHJFAOARA\m\maven-plugin-plugin\target\it\skip\build.log, f:\jenkins\jenkins-slave\workspace\ven-plugin-tools_jdk11_asm7-J7667H6X6V4EBCRWUSKUMW4LMBBFILIHPFM47RV7V2XYHJFAOARA\m\maven-plugin-plugin\target\it\source-encoding\build.log]
[windows-jdk8] Finished parsing Maven Invoker results (found 35)
[windows-jdk8] [withMaven] junitPublisher - Archive test results for Maven artifact org.apache.maven.plugin-tools:maven-plugin-tools-api:3.6-SNAPSHOT generated by maven-surefire-plugin:test (default-test): m\maven-plugin-tools-api\target\surefire-reports\*.xml
[windows-jdk8] Recording test results
[windows-jdk8] [withMaven] junitPublisher - Archive test results for Maven artifact org.apache.maven.plugin-tools:maven-plugin-tools-generators:3.6-SNAPSHOT generated by maven-surefire-plugin:test (default-test): m\maven-plugin-tools-generators\target\surefire-reports\*.xml
[windows-jdk8] Recording test results
[windows-jdk8] [withMaven] junitPublisher - Archive test results for Maven artifact org.apache.maven.plugin-tools:maven-plugin-tools-java:3.6-SNAPSHOT generated by maven-surefire-plugin:test (default-test): m\maven-plugin-tools-java\target\surefire-reports\*.xml
[windows-jdk8] Recording test results
[windows-jdk8] [withMaven] junitPublisher - Archive test results for Maven artifact org.apache.maven.plugin-tools:maven-plugin-annotations:3.6-SNAPSHOT generated by maven-surefire-plugin:test (default-test): m\maven-plugin-annotations\target\surefire-reports\*.xml
[windows-jdk8] Recording test results
[windows-jdk8] None of the test reports contained any result
[windows-jdk8] [withMaven] junitPublisher - Archive test results for Maven artifact org.apache.maven.plugin-tools:maven-plugin-tools-annotations:3.6-SNAPSHOT generated by maven-surefire-plugin:test (default-test): m\maven-plugin-tools-annotations\target\surefire-reports\*.xml
[windows-jdk8] Recording test results
[windows-jdk8] [withMaven] junitPublisher - Archive test results for Maven artifact org.apache.maven.plugin-tools:maven-plugin-tools-model:3.6-SNAPSHOT generated by maven-surefire-plugin:test (default-test): m\maven-script\maven-plugin-tools-model\target\surefire-reports\*.xml
[windows-jdk8] Recording test results
[windows-jdk8] [withMaven] junitPublisher - Archive test results for Maven artifact org.apache.maven.plugin-tools:maven-plugin-tools-ant:3.6-SNAPSHOT generated by maven-surefire-plugin:test (default-test): m\maven-script\maven-plugin-tools-ant\target\surefire-reports\*.xml
[windows-jdk8] Recording test results
[windows-jdk8] [withMaven] junitPublisher - Archive test results for Maven artifact org.apache.maven.plugin-tools:maven-script-ant:3.6-SNAPSHOT generated by maven-surefire-plugin:test (default-test): m\maven-script\maven-script-ant\target\surefire-reports\*.xml
[windows-jdk8] Recording test results
[windows-jdk8] [withMaven] junitPublisher - Archive test results for Maven artifact org.apache.maven.plugin-tools:maven-plugin-tools-beanshell:3.6-SNAPSHOT generated by maven-surefire-plugin:test (default-test): m\maven-script\maven-plugin-tools-beanshell\target\surefire-reports\*.xml
[windows-jdk8] Recording test results
[windows-jdk8] None of the test reports contained any result
[windows-jdk8] [withMaven] junitPublisher - Archive test results for Maven artifact org.apache.maven.plugin-tools:maven-script-beanshell:3.6-SNAPSHOT generated by maven-surefire-plugin:test (default-test): m\maven-script\maven-script-beanshell\target\surefire-reports\*.xml
[windows-jdk8] Recording test results
[windows-jdk8] None of the test reports contained any result
[windows-jdk8] [withMaven] junitPublisher - Archive test results for Maven artifact org.apache.maven.plugins:maven-plugin-plugin:3.6-SNAPSHOT generated by maven-surefire-plugin:test (default-test): m\maven-plugin-plugin\target\surefire-reports\*.xml
[windows-jdk8] Recording test results
[windows-jdk8] None of the test reports contained any result
[Pipeline] [windows-jdk8] // withMaven
[Pipeline] [windows-jdk8] cleanWs
[windows-jdk8] [WS-CLEANUP] Deleting project workspace...[WS-CLEANUP] done
[Pipeline] [windows-jdk8] }
[Pipeline] [windows-jdk8] // stage
[Pipeline] [windows-jdk8] }
[Pipeline] [windows-jdk8] // node
[Pipeline] [windows-jdk8] }
[windows-jdk9] [INFO] run post-build script verify.groovy
[windows-jdk9] [INFO]           mplugin-305_emptyMojoDependencies\pom.xml ........ SUCCESS (12.0 s)
[windows-jdk9] [INFO] Building: mplugin-305_singleMojoDependencies\pom.xml
[windows-jdk10] [INFO] run post-build script verify.groovy
[windows-jdk10] [INFO]           plugin-info-jdk\pom.xml .......................... SUCCESS (19.2 s)
[windows-jdk10] [INFO] Building: plugin-info-jdk-default-version\pom.xml
[windows-jdk9] [INFO] run post-build script verify.groovy
[windows-jdk9] [INFO]           mplugin-305_singleMojoDependencies\pom.xml ....... SUCCESS (12.4 s)
[windows-jdk9] [INFO] Building: mplugin-319_report-since\pom.xml
[windows-jdk10] [INFO] run post-build script verify.groovy
[windows-jdk10] [INFO]           plugin-info-jdk-default-version\pom.xml .......... SUCCESS (9.5 s)
[windows-jdk10] [INFO] Building: plugin-report\pom.xml
[windows-jdk9] [INFO] run post-build script verify.groovy
[windows-jdk9] [INFO]           mplugin-319_report-since\pom.xml ................. SUCCESS (14.3 s)
[windows-jdk9] [INFO] Building: mplugin-324_javadoc\pom.xml
[windows-jdk10] [INFO] run post-build script verify.bsh
[windows-jdk10] [INFO]           plugin-report\pom.xml ............................ SUCCESS (25.6 s)
[windows-jdk10] [INFO] Building: plugin-report-annotations\pom.xml
[windows-jdk9] [INFO]           mplugin-324_javadoc\pom.xml ...................... SUCCESS (23.0 s)
[windows-jdk9] [INFO] Building: packaging-jar\pom.xml
[windows-jdk10] [INFO] run post-build script verify.bsh
[windows-jdk10] [INFO]           plugin-report-annotations\pom.xml ................ SUCCESS (16.8 s)
[windows-jdk10] [INFO] Building: skip\pom.xml
[windows-jdk9] [INFO] run post-build script verify.groovy
[windows-jdk9] [INFO]           packaging-jar\pom.xml ............................ SUCCESS (12.0 s)
[windows-jdk9] [INFO] Building: plugin-info-jdk\pom.xml
[windows-jdk10] [INFO] run post-build script verify.groovy
[windows-jdk10] [INFO]           skip\pom.xml ..................................... SUCCESS (9.3 s)
[windows-jdk10] [INFO] Building: source-encoding\pom.xml
[windows-jdk10] [INFO] run post-build script verify.groovy
[windows-jdk10] [INFO]           source-encoding\pom.xml .......................... SUCCESS (10.1 s)
[windows-jdk10] [INFO] -------------------------------------------------
[windows-jdk10] [INFO] Build Summary:
[windows-jdk10] [INFO]   Passed: 32, Failed: 2, Errors: 0, Skipped: 1
[windows-jdk10] [INFO] -------------------------------------------------
[windows-jdk10] [WARNING] The following builds failed:
[windows-jdk10] [WARNING] *  asm-failure\pom.xml
[windows-jdk10] [WARNING] *  java-basic-annotations-jdk11\pom.xml
[windows-jdk10] [INFO] -------------------------------------------------
[windows-jdk10] [WARNING] Ignoring that 2 builds failed.
[windows-jdk10] [INFO] 
[windows-jdk10] [INFO] --- maven-checkstyle-plugin:3.0.0:check (checkstyle-check) @ maven-plugin-plugin ---
[windows-jdk10] [INFO] ------------------------------------------------------------------------
[windows-jdk10] [INFO] Reactor Summary:
[windows-jdk10] [INFO] 
[windows-jdk10] [INFO] Maven Plugin Tools ................................. SUCCESS [ 20.550 s]
[windows-jdk10] [INFO] Maven Plugin Tools Extractor API ................... SUCCESS [ 14.893 s]
[windows-jdk10] [INFO] Maven Plugin Tools Generators ...................... SUCCESS [  8.945 s]
[windows-jdk10] [INFO] Maven Plugin Tool for Java with Javadoc Tags ....... SUCCESS [  8.200 s]
[windows-jdk10] [INFO] Maven Plugin Tools Java Annotations ................ SUCCESS [  1.074 s]
[windows-jdk10] [INFO] Maven Plugin Tool for Java with Annotations ........ SUCCESS [  6.789 s]
[windows-jdk10] [INFO] Maven Script Mojo Support .......................... SUCCESS [  0.699 s]
[windows-jdk10] [INFO] Maven Plugin Metadata Model ........................ SUCCESS [  4.202 s]
[windows-jdk10] [INFO] Maven Plugin Tool for Ant .......................... SUCCESS [  2.706 s]
[windows-jdk10] [INFO] Maven Ant Mojo Support ............................. SUCCESS [  5.408 s]
[windows-jdk10] [INFO] Maven Plugin Tool for Beanshell .................... SUCCESS [  1.578 s]
[windows-jdk10] [INFO] Maven Beanshell Mojo Support ....................... SUCCESS [  1.084 s]
[windows-jdk10] [INFO] Maven Plugin Plugin ................................ SUCCESS [09:03 min]
[windows-jdk10] [INFO] ------------------------------------------------------------------------
[windows-jdk10] [INFO] BUILD SUCCESS
[windows-jdk10] [INFO] ------------------------------------------------------------------------
[windows-jdk10] [INFO] Total time: 10:21 min
[windows-jdk10] [INFO] Finished at: 2018-10-03T11:29:38Z
[windows-jdk10] [INFO] Final Memory: 57M/197M
[windows-jdk10] [INFO] ------------------------------------------------------------------------
[windows-jdk10] [INFO] [jenkins-event-spy] Generated F:\jenkins\jenkins-slave\workspace\ven-plugin-tools_jdk11_asm7-J7667H6X6V4EBCRWUSKUMW4LMBBFILIHPFM47RV7V2XYHJFAOARA@2@tmp\withMaven9a9061e6\maven-spy-20181003-111916-40013549794853900901501.log
[Pipeline] [windows-jdk10] }
[Pipeline] [windows-jdk10] // dir
[windows-jdk9] [INFO] run post-build script verify.groovy
[windows-jdk9] [INFO]           plugin-info-jdk\pom.xml .......................... SUCCESS (20.3 s)
[windows-jdk9] [INFO] Building: plugin-info-jdk-default-version\pom.xml
[Pipeline] [windows-jdk10] }
[windows-jdk10] [withMaven] invokerPublisher - Archive invoker results for Maven artifact MavenArtifact{org.apache.maven.plugins:maven-plugin-plugin::3.6-SNAPSHOT(version: 3.6-SNAPSHOT, snapshot:false) } generated by PluginInvocation{org.apache.maven.plugins:maven-invoker-plugin:3.0.1@run  integration-test}: m\maven-plugin-plugin\target\invoker-reports\*.xml
[windows-jdk10] performing MavenInvokerRecorder, reportsFilenamePattern:'**/m\maven-plugin-plugin\target\invoker-reports/BUILD*.xml', invokerBuildDir:'**/m\maven-plugin-plugin\target\it'
[windows-jdk10] Found reports:[f:\jenkins\jenkins-slave\workspace\ven-plugin-tools_jdk11_asm7-J7667H6X6V4EBCRWUSKUMW4LMBBFILIHPFM47RV7V2XYHJFAOARA@2\m\maven-plugin-plugin\target\invoker-reports\BUILD-annotation-with-inheritance-from-deps.xml, f:\jenkins\jenkins-slave\workspace\ven-plugin-tools_jdk11_asm7-J7667H6X6V4EBCRWUSKUMW4LMBBFILIHPFM47RV7V2XYHJFAOARA@2\m\maven-plugin-plugin\target\invoker-reports\BUILD-annotation-with-inheritance-reactor.xml, f:\jenkins\jenkins-slave\workspace\ven-plugin-tools_jdk11_asm7-J7667H6X6V4EBCRWUSKUMW4LMBBFILIHPFM47RV7V2XYHJFAOARA@2\m\maven-plugin-plugin\target\invoker-reports\BUILD-annotation-with-inheritance.xml, f:\jenkins\jenkins-slave\workspace\ven-plugin-tools_jdk11_asm7-J7667H6X6V4EBCRWUSKUMW4LMBBFILIHPFM47RV7V2XYHJFAOARA@2\m\maven-plugin-plugin\target\invoker-reports\BUILD-ant-basic.xml, f:\jenkins\jenkins-slave\workspace\ven-plugin-tools_jdk11_asm7-J7667H6X6V4EBCRWUSKUMW4LMBBFILIHPFM47RV7V2XYHJFAOARA@2\m\maven-plugin-plugin\target\invoker-reports\BUILD-ant-reference-parameter.xml, f:\jenkins\jenkins-slave\workspace\ven-plugin-tools_jdk11_asm7-J7667H6X6V4EBCRWUSKUMW4LMBBFILIHPFM47RV7V2XYHJFAOARA@2\m\maven-plugin-plugin\target\invoker-reports\BUILD-ant-simple-usage.xml, f:\jenkins\jenkins-slave\workspace\ven-plugin-tools_jdk11_asm7-J7667H6X6V4EBCRWUSKUMW4LMBBFILIHPFM47RV7V2XYHJFAOARA@2\m\maven-plugin-plugin\target\invoker-reports\BUILD-ant-since-maven-plugin.xml, f:\jenkins\jenkins-slave\workspace\ven-plugin-tools_jdk11_asm7-J7667H6X6V4EBCRWUSKUMW4LMBBFILIHPFM47RV7V2XYHJFAOARA@2\m\maven-plugin-plugin\target\invoker-reports\BUILD-asm-failure.xml, f:\jenkins\jenkins-slave\workspace\ven-plugin-tools_jdk11_asm7-J7667H6X6V4EBCRWUSKUMW4LMBBFILIHPFM47RV7V2XYHJFAOARA@2\m\maven-plugin-plugin\target\invoker-reports\BUILD-beanshell-simple.xml, f:\jenkins\jenkins-slave\workspace\ven-plugin-tools_jdk11_asm7-J7667H6X6V4EBCRWUSKUMW4LMBBFILIHPFM47RV7V2XYHJFAOARA@2\m\maven-plugin-plugin\target\invoker-reports\BUILD-fix-maven-since-3.x.xml, f:\jenkins\jenkins-slave\workspace\ven-plugin-tools_jdk11_asm7-J7667H6X6V4EBCRWUSKUMW4LMBBFILIHPFM47RV7V2XYHJFAOARA@2\m\maven-plugin-plugin\target\invoker-reports\BUILD-help-basic-jdk11.xml, f:\jenkins\jenkins-slave\workspace\ven-plugin-tools_jdk11_asm7-J7667H6X6V4EBCRWUSKUMW4LMBBFILIHPFM47RV7V2XYHJFAOARA@2\m\maven-plugin-plugin\target\invoker-reports\BUILD-help-basic.xml, f:\jenkins\jenkins-slave\workspace\ven-plugin-tools_jdk11_asm7-J7667H6X6V4EBCRWUSKUMW4LMBBFILIHPFM47RV7V2XYHJFAOARA@2\m\maven-plugin-plugin\target\invoker-reports\BUILD-help-package.xml, f:\jenkins\jenkins-slave\workspace\ven-plugin-tools_jdk11_asm7-J7667H6X6V4EBCRWUSKUMW4LMBBFILIHPFM47RV7V2XYHJFAOARA@2\m\maven-plugin-plugin\target\invoker-reports\BUILD-ignore-plugin-class-realm.xml, f:\jenkins\jenkins-slave\workspace\ven-plugin-tools_jdk11_asm7-J7667H6X6V4EBCRWUSKUMW4LMBBFILIHPFM47RV7V2XYHJFAOARA@2\m\maven-plugin-plugin\target\invoker-reports\BUILD-java-basic-annotations-jdk11.xml, f:\jenkins\jenkins-slave\workspace\ven-plugin-tools_jdk11_asm7-J7667H6X6V4EBCRWUSKUMW4LMBBFILIHPFM47RV7V2XYHJFAOARA@2\m\maven-plugin-plugin\target\invoker-reports\BUILD-java-basic-annotations-jdk8.xml, f:\jenkins\jenkins-slave\workspace\ven-plugin-tools_jdk11_asm7-J7667H6X6V4EBCRWUSKUMW4LMBBFILIHPFM47RV7V2XYHJFAOARA@2\m\maven-plugin-plugin\target\invoker-reports\BUILD-java-basic-annotations.xml, f:\jenkins\jenkins-slave\workspace\ven-plugin-tools_jdk11_asm7-J7667H6X6V4EBCRWUSKUMW4LMBBFILIHPFM47RV7V2XYHJFAOARA@2\m\maven-plugin-plugin\target\invoker-reports\BUILD-java-basic.xml, f:\jenkins\jenkins-slave\workspace\ven-plugin-tools_jdk11_asm7-J7667H6X6V4EBCRWUSKUMW4LMBBFILIHPFM47RV7V2XYHJFAOARA@2\m\maven-plugin-plugin\target\invoker-reports\BUILD-mplugin-187.xml, f:\jenkins\jenkins-slave\workspace\ven-plugin-tools_jdk11_asm7-J7667H6X6V4EBCRWUSKUMW4LMBBFILIHPFM47RV7V2XYHJFAOARA@2\m\maven-plugin-plugin\target\invoker-reports\BUILD-mplugin-191.xml, f:\jenkins\jenkins-slave\workspace\ven-plugin-tools_jdk11_asm7-J7667H6X6V4EBCRWUSKUMW4LMBBFILIHPFM47RV7V2XYHJFAOARA@2\m\maven-plugin-plugin\target\invoker-reports\BUILD-mplugin-223.xml, f:\jenkins\jenkins-slave\workspace\ven-plugin-tools_jdk11_asm7-J7667H6X6V4EBCRWUSKUMW4LMBBFILIHPFM47RV7V2XYHJFAOARA@2\m\maven-plugin-plugin\target\invoker-reports\BUILD-mplugin-272_java8.xml, f:\jenkins\jenkins-slave\workspace\ven-plugin-tools_jdk11_asm7-J7667H6X6V4EBCRWUSKUMW4LMBBFILIHPFM47RV7V2XYHJFAOARA@2\m\maven-plugin-plugin\target\invoker-reports\BUILD-mplugin-299_no-configuration.xml, f:\jenkins\jenkins-slave\workspace\ven-plugin-tools_jdk11_asm7-J7667H6X6V4EBCRWUSKUMW4LMBBFILIHPFM47RV7V2XYHJFAOARA@2\m\maven-plugin-plugin\target\invoker-reports\BUILD-mplugin-305_defaultMojoDependencies.xml, f:\jenkins\jenkins-slave\workspace\ven-plugin-tools_jdk11_asm7-J7667H6X6V4EBCRWUSKUMW4LMBBFILIHPFM47RV7V2XYHJFAOARA@2\m\maven-plugin-plugin\target\invoker-reports\BUILD-mplugin-305_emptyMojoDependencies.xml, f:\jenkins\jenkins-slave\workspace\ven-plugin-tools_jdk11_asm7-J7667H6X6V4EBCRWUSKUMW4LMBBFILIHPFM47RV7V2XYHJFAOARA@2\m\maven-plugin-plugin\target\invoker-reports\BUILD-mplugin-305_singleMojoDependencies.xml, f:\jenkins\jenkins-slave\workspace\ven-plugin-tools_jdk11_asm7-J7667H6X6V4EBCRWUSKUMW4LMBBFILIHPFM47RV7V2XYHJFAOARA@2\m\maven-plugin-plugin\target\invoker-reports\BUILD-mplugin-319_report-since.xml, f:\jenkins\jenkins-slave\workspace\ven-plugin-tools_jdk11_asm7-J7667H6X6V4EBCRWUSKUMW4LMBBFILIHPFM47RV7V2XYHJFAOARA@2\m\maven-plugin-plugin\target\invoker-reports\BUILD-mplugin-324_javadoc.xml, f:\jenkins\jenkins-slave\workspace\ven-plugin-tools_jdk11_asm7-J7667H6X6V4EBCRWUSKUMW4LMBBFILIHPFM47RV7V2XYHJFAOARA@2\m\maven-plugin-plugin\target\invoker-reports\BUILD-packaging-jar.xml, f:\jenkins\jenkins-slave\workspace\ven-plugin-tools_jdk11_asm7-J7667H6X6V4EBCRWUSKUMW4LMBBFILIHPFM47RV7V2XYHJFAOARA@2\m\maven-plugin-plugin\target\invoker-reports\BUILD-plugin-info-jdk-default-version.xml, f:\jenkins\jenkins-slave\workspace\ven-plugin-tools_jdk11_asm7-J7667H6X6V4EBCRWUSKUMW4LMBBFILIHPFM47RV7V2XYHJFAOARA@2\m\maven-plugin-plugin\target\invoker-reports\BUILD-plugin-info-jdk.xml, f:\jenkins\jenkins-slave\workspace\ven-plugin-tools_jdk11_asm7-J7667H6X6V4EBCRWUSKUMW4LMBBFILIHPFM47RV7V2XYHJFAOARA@2\m\maven-plugin-plugin\target\invoker-reports\BUILD-plugin-report-annotations.xml, f:\jenkins\jenkins-slave\workspace\ven-plugin-tools_jdk11_asm7-J7667H6X6V4EBCRWUSKUMW4LMBBFILIHPFM47RV7V2XYHJFAOARA@2\m\maven-plugin-plugin\target\invoker-reports\BUILD-plugin-report.xml, f:\jenkins\jenkins-slave\workspace\ven-plugin-tools_jdk11_asm7-J7667H6X6V4EBCRWUSKUMW4LMBBFILIHPFM47RV7V2XYHJFAOARA@2\m\maven-plugin-plugin\target\invoker-reports\BUILD-skip.xml, f:\jenkins\jenkins-slave\workspace\ven-plugin-tools_jdk11_asm7-J7667H6X6V4EBCRWUSKUMW4LMBBFILIHPFM47RV7V2XYHJFAOARA@2\m\maven-plugin-plugin\target\invoker-reports\BUILD-source-encoding.xml]
[windows-jdk10] Found logs:[f:\jenkins\jenkins-slave\workspace\ven-plugin-tools_jdk11_asm7-J7667H6X6V4EBCRWUSKUMW4LMBBFILIHPFM47RV7V2XYHJFAOARA@2\m\maven-plugin-plugin\target\it\annotation-with-inheritance-from-deps\build.log, f:\jenkins\jenkins-slave\workspace\ven-plugin-tools_jdk11_asm7-J7667H6X6V4EBCRWUSKUMW4LMBBFILIHPFM47RV7V2XYHJFAOARA@2\m\maven-plugin-plugin\target\it\annotation-with-inheritance-reactor\build.log, f:\jenkins\jenkins-slave\workspace\ven-plugin-tools_jdk11_asm7-J7667H6X6V4EBCRWUSKUMW4LMBBFILIHPFM47RV7V2XYHJFAOARA@2\m\maven-plugin-plugin\target\it\annotation-with-inheritance\build.log, f:\jenkins\jenkins-slave\workspace\ven-plugin-tools_jdk11_asm7-J7667H6X6V4EBCRWUSKUMW4LMBBFILIHPFM47RV7V2XYHJFAOARA@2\m\maven-plugin-plugin\target\it\ant-basic\build.log, f:\jenkins\jenkins-slave\workspace\ven-plugin-tools_jdk11_asm7-J7667H6X6V4EBCRWUSKUMW4LMBBFILIHPFM47RV7V2XYHJFAOARA@2\m\maven-plugin-plugin\target\it\ant-reference-parameter\build.log, f:\jenkins\jenkins-slave\workspace\ven-plugin-tools_jdk11_asm7-J7667H6X6V4EBCRWUSKUMW4LMBBFILIHPFM47RV7V2XYHJFAOARA@2\m\maven-plugin-plugin\target\it\ant-simple-usage\build.log, f:\jenkins\jenkins-slave\workspace\ven-plugin-tools_jdk11_asm7-J7667H6X6V4EBCRWUSKUMW4LMBBFILIHPFM47RV7V2XYHJFAOARA@2\m\maven-plugin-plugin\target\it\ant-since-maven-plugin\build.log, f:\jenkins\jenkins-slave\workspace\ven-plugin-tools_jdk11_asm7-J7667H6X6V4EBCRWUSKUMW4LMBBFILIHPFM47RV7V2XYHJFAOARA@2\m\maven-plugin-plugin\target\it\asm-failure\build.log, f:\jenkins\jenkins-slave\workspace\ven-plugin-tools_jdk11_asm7-J7667H6X6V4EBCRWUSKUMW4LMBBFILIHPFM47RV7V2XYHJFAOARA@2\m\maven-plugin-plugin\target\it\beanshell-simple\build.log, f:\jenkins\jenkins-slave\workspace\ven-plugin-tools_jdk11_asm7-J7667H6X6V4EBCRWUSKUMW4LMBBFILIHPFM47RV7V2XYHJFAOARA@2\m\maven-plugin-plugin\target\it\fix-maven-since-3.x\build.log, f:\jenkins\jenkins-slave\workspace\ven-plugin-tools_jdk11_asm7-J7667H6X6V4EBCRWUSKUMW4LMBBFILIHPFM47RV7V2XYHJFAOARA@2\m\maven-plugin-plugin\target\it\help-basic\build.log, f:\jenkins\jenkins-slave\workspace\ven-plugin-tools_jdk11_asm7-J7667H6X6V4EBCRWUSKUMW4LMBBFILIHPFM47RV7V2XYHJFAOARA@2\m\maven-plugin-plugin\target\it\help-package\build.log, f:\jenkins\jenkins-slave\workspace\ven-plugin-tools_jdk11_asm7-J7667H6X6V4EBCRWUSKUMW4LMBBFILIHPFM47RV7V2XYHJFAOARA@2\m\maven-plugin-plugin\target\it\ignore-plugin-class-realm\build.log, f:\jenkins\jenkins-slave\workspace\ven-plugin-tools_jdk11_asm7-J7667H6X6V4EBCRWUSKUMW4LMBBFILIHPFM47RV7V2XYHJFAOARA@2\m\maven-plugin-plugin\target\it\java-basic-annotations-jdk11\build.log, f:\jenkins\jenkins-slave\workspace\ven-plugin-tools_jdk11_asm7-J7667H6X6V4EBCRWUSKUMW4LMBBFILIHPFM47RV7V2XYHJFAOARA@2\m\maven-plugin-plugin\target\it\java-basic-annotations-jdk8\build.log, f:\jenkins\jenkins-slave\workspace\ven-plugin-tools_jdk11_asm7-J7667H6X6V4EBCRWUSKUMW4LMBBFILIHPFM47RV7V2XYHJFAOARA@2\m\maven-plugin-plugin\target\it\java-basic-annotations\build.log, f:\jenkins\jenkins-slave\workspace\ven-plugin-tools_jdk11_asm7-J7667H6X6V4EBCRWUSKUMW4LMBBFILIHPFM47RV7V2XYHJFAOARA@2\m\maven-plugin-plugin\target\it\java-basic\build.log, f:\jenkins\jenkins-slave\workspace\ven-plugin-tools_jdk11_asm7-J7667H6X6V4EBCRWUSKUMW4LMBBFILIHPFM47RV7V2XYHJFAOARA@2\m\maven-plugin-plugin\target\it\mplugin-187\build.log, f:\jenkins\jenkins-slave\workspace\ven-plugin-tools_jdk11_asm7-J7667H6X6V4EBCRWUSKUMW4LMBBFILIHPFM47RV7V2XYHJFAOARA@2\m\maven-plugin-plugin\target\it\mplugin-191\build.log, f:\jenkins\jenkins-slave\workspace\ven-plugin-tools_jdk11_asm7-J7667H6X6V4EBCRWUSKUMW4LMBBFILIHPFM47RV7V2XYHJFAOARA@2\m\maven-plugin-plugin\target\it\mplugin-223\build.log, f:\jenkins\jenkins-slave\workspace\ven-plugin-tools_jdk11_asm7-J7667H6X6V4EBCRWUSKUMW4LMBBFILIHPFM47RV7V2XYHJFAOARA@2\m\maven-plugin-plugin\target\it\mplugin-272_java8\build.log, f:\jenkins\jenkins-slave\workspace\ven-plugin-tools_jdk11_asm7-J7667H6X6V4EBCRWUSKUMW4LMBBFILIHPFM47RV7V2XYHJFAOARA@2\m\maven-plugin-plugin\target\it\mplugin-299_no-configuration\build.log, f:\jenkins\jenkins-slave\workspace\ven-plugin-tools_jdk11_asm7-J7667H6X6V4EBCRWUSKUMW4LMBBFILIHPFM47RV7V2XYHJFAOARA@2\m\maven-plugin-plugin\target\it\mplugin-305_defaultMojoDependencies\build.log, f:\jenkins\jenkins-slave\workspace\ven-plugin-tools_jdk11_asm7-J7667H6X6V4EBCRWUSKUMW4LMBBFILIHPFM47RV7V2XYHJFAOARA@2\m\maven-plugin-plugin\target\it\mplugin-305_emptyMojoDependencies\build.log, f:\jenkins\jenkins-slave\workspace\ven-plugin-tools_jdk11_asm7-J7667H6X6V4EBCRWUSKUMW4LMBBFILIHPFM47RV7V2XYHJFAOARA@2\m\maven-plugin-plugin\target\it\mplugin-305_singleMojoDependencies\build.log, f:\jenkins\jenkins-slave\workspace\ven-plugin-tools_jdk11_asm7-J7667H6X6V4EBCRWUSKUMW4LMBBFILIHPFM47RV7V2XYHJFAOARA@2\m\maven-plugin-plugin\target\it\mplugin-319_report-since\build.log, f:\jenkins\jenkins-slave\workspace\ven-plugin-tools_jdk11_asm7-J7667H6X6V4EBCRWUSKUMW4LMBBFILIHPFM47RV7V2XYHJFAOARA@2\m\maven-plugin-plugin\target\it\mplugin-324_javadoc\build.log, f:\jenkins\jenkins-slave\workspace\ven-plugin-tools_jdk11_asm7-J7667H6X6V4EBCRWUSKUMW4LMBBFILIHPFM47RV7V2XYHJFAOARA@2\m\maven-plugin-plugin\target\it\packaging-jar\build.log, f:\jenkins\jenkins-slave\workspace\ven-plugin-tools_jdk11_asm7-J7667H6X6V4EBCRWUSKUMW4LMBBFILIHPFM47RV7V2XYHJFAOARA@2\m\maven-plugin-plugin\target\it\plugin-info-jdk-default-version\build.log, f:\jenkins\jenkins-slave\workspace\ven-plugin-tools_jdk11_asm7-J7667H6X6V4EBCRWUSKUMW4LMBBFILIHPFM47RV7V2XYHJFAOARA@2\m\maven-plugin-plugin\target\it\plugin-info-jdk\build.log, f:\jenkins\jenkins-slave\workspace\ven-plugin-tools_jdk11_asm7-J7667H6X6V4EBCRWUSKUMW4LMBBFILIHPFM47RV7V2XYHJFAOARA@2\m\maven-plugin-plugin\target\it\plugin-report-annotations\build.log, f:\jenkins\jenkins-slave\workspace\ven-plugin-tools_jdk11_asm7-J7667H6X6V4EBCRWUSKUMW4LMBBFILIHPFM47RV7V2XYHJFAOARA@2\m\maven-plugin-plugin\target\it\plugin-report\build.log, f:\jenkins\jenkins-slave\workspace\ven-plugin-tools_jdk11_asm7-J7667H6X6V4EBCRWUSKUMW4LMBBFILIHPFM47RV7V2XYHJFAOARA@2\m\maven-plugin-plugin\target\it\skip\build.log, f:\jenkins\jenkins-slave\workspace\ven-plugin-tools_jdk11_asm7-J7667H6X6V4EBCRWUSKUMW4LMBBFILIHPFM47RV7V2XYHJFAOARA@2\m\maven-plugin-plugin\target\it\source-encoding\build.log]
[windows-jdk10] Finished parsing Maven Invoker results (found 35)
[windows-jdk10] [withMaven] junitPublisher - Archive test results for Maven artifact org.apache.maven.plugin-tools:maven-plugin-tools-api:3.6-SNAPSHOT generated by maven-surefire-plugin:test (default-test): m\maven-plugin-tools-api\target\surefire-reports\*.xml
[windows-jdk10] Recording test results
[windows-jdk10] [withMaven] junitPublisher - Archive test results for Maven artifact org.apache.maven.plugin-tools:maven-plugin-tools-generators:3.6-SNAPSHOT generated by maven-surefire-plugin:test (default-test): m\maven-plugin-tools-generators\target\surefire-reports\*.xml
[windows-jdk10] Recording test results
[windows-jdk10] [withMaven] junitPublisher - Archive test results for Maven artifact org.apache.maven.plugin-tools:maven-plugin-tools-java:3.6-SNAPSHOT generated by maven-surefire-plugin:test (default-test): m\maven-plugin-tools-java\target\surefire-reports\*.xml
[windows-jdk10] Recording test results
[windows-jdk10] [withMaven] junitPublisher - Archive test results for Maven artifact org.apache.maven.plugin-tools:maven-plugin-annotations:3.6-SNAPSHOT generated by maven-surefire-plugin:test (default-test): m\maven-plugin-annotations\target\surefire-reports\*.xml
[windows-jdk10] Recording test results
[windows-jdk10] None of the test reports contained any result
[windows-jdk10] [withMaven] junitPublisher - Archive test results for Maven artifact org.apache.maven.plugin-tools:maven-plugin-tools-annotations:3.6-SNAPSHOT generated by maven-surefire-plugin:test (default-test): m\maven-plugin-tools-annotations\target\surefire-reports\*.xml
[windows-jdk10] Recording test results
[windows-jdk10] [withMaven] junitPublisher - Archive test results for Maven artifact org.apache.maven.plugin-tools:maven-plugin-tools-model:3.6-SNAPSHOT generated by maven-surefire-plugin:test (default-test): m\maven-script\maven-plugin-tools-model\target\surefire-reports\*.xml
[windows-jdk10] Recording test results
[windows-jdk10] [withMaven] junitPublisher - Archive test results for Maven artifact org.apache.maven.plugin-tools:maven-plugin-tools-ant:3.6-SNAPSHOT generated by maven-surefire-plugin:test (default-test): m\maven-script\maven-plugin-tools-ant\target\surefire-reports\*.xml
[windows-jdk10] Recording test results
[windows-jdk10] [withMaven] junitPublisher - Archive test results for Maven artifact org.apache.maven.plugin-tools:maven-script-ant:3.6-SNAPSHOT generated by maven-surefire-plugin:test (default-test): m\maven-script\maven-script-ant\target\surefire-reports\*.xml
[windows-jdk10] Recording test results
[windows-jdk10] [withMaven] junitPublisher - Archive test results for Maven artifact org.apache.maven.plugin-tools:maven-plugin-tools-beanshell:3.6-SNAPSHOT generated by maven-surefire-plugin:test (default-test): m\maven-script\maven-plugin-tools-beanshell\target\surefire-reports\*.xml
[windows-jdk10] Recording test results
[windows-jdk10] None of the test reports contained any result
[windows-jdk10] [withMaven] junitPublisher - Archive test results for Maven artifact org.apache.maven.plugin-tools:maven-script-beanshell:3.6-SNAPSHOT generated by maven-surefire-plugin:test (default-test): m\maven-script\maven-script-beanshell\target\surefire-reports\*.xml
[windows-jdk10] Recording test results
[windows-jdk10] None of the test reports contained any result
[windows-jdk10] [withMaven] junitPublisher - Archive test results for Maven artifact org.apache.maven.plugins:maven-plugin-plugin:3.6-SNAPSHOT generated by maven-surefire-plugin:test (default-test): m\maven-plugin-plugin\target\surefire-reports\*.xml
[windows-jdk10] Recording test results
[windows-jdk10] None of the test reports contained any result
[Pipeline] [windows-jdk10] // withMaven
[Pipeline] [windows-jdk10] cleanWs
[windows-jdk10] [WS-CLEANUP] Deleting project workspace...[WS-CLEANUP] done
[Pipeline] [windows-jdk10] }
[Pipeline] [windows-jdk10] // stage
[Pipeline] [windows-jdk10] }
[Pipeline] [windows-jdk10] // node
[Pipeline] [windows-jdk10] }
[windows-jdk9] [INFO] run post-build script verify.groovy
[windows-jdk9] [INFO]           plugin-info-jdk-default-version\pom.xml .......... SUCCESS (8.5 s)
[windows-jdk9] [INFO] Building: plugin-report\pom.xml
[windows-jdk9] [INFO] run post-build script verify.bsh
[windows-jdk9] [INFO]           plugin-report\pom.xml ............................ SUCCESS (21.9 s)
[windows-jdk9] [INFO] Building: plugin-report-annotations\pom.xml
[windows-jdk9] [INFO] run post-build script verify.bsh
[windows-jdk9] [INFO]           plugin-report-annotations\pom.xml ................ SUCCESS (11.7 s)
[windows-jdk9] [INFO] Building: skip\pom.xml
[windows-jdk9] [INFO] run post-build script verify.groovy
[windows-jdk9] [INFO]           skip\pom.xml ..................................... SUCCESS (6.7 s)
[windows-jdk9] [INFO] Building: source-encoding\pom.xml
[windows-jdk9] [INFO] run post-build script verify.groovy
[windows-jdk9] [INFO]           source-encoding\pom.xml .......................... SUCCESS (7.4 s)
[windows-jdk9] [INFO] -------------------------------------------------
[windows-jdk9] [INFO] Build Summary:
[windows-jdk9] [INFO]   Passed: 32, Failed: 2, Errors: 0, Skipped: 1
[windows-jdk9] [INFO] -------------------------------------------------
[windows-jdk9] [WARNING] The following builds failed:
[windows-jdk9] [WARNING] *  asm-failure\pom.xml
[windows-jdk9] [WARNING] *  java-basic-annotations-jdk11\pom.xml
[windows-jdk9] [INFO] -------------------------------------------------
[windows-jdk9] [WARNING] Ignoring that 2 builds failed.
[windows-jdk9] [INFO] 
[windows-jdk9] [INFO] --- maven-checkstyle-plugin:3.0.0:check (checkstyle-check) @ maven-plugin-plugin ---
[windows-jdk9] [INFO] ------------------------------------------------------------------------
[windows-jdk9] [INFO] Reactor Summary:
[windows-jdk9] [INFO] 
[windows-jdk9] [INFO] Maven Plugin Tools ................................. SUCCESS [ 20.653 s]
[windows-jdk9] [INFO] Maven Plugin Tools Extractor API ................... SUCCESS [ 14.093 s]
[windows-jdk9] [INFO] Maven Plugin Tools Generators ...................... SUCCESS [ 10.071 s]
[windows-jdk9] [INFO] Maven Plugin Tool for Java with Javadoc Tags ....... SUCCESS [  8.634 s]
[windows-jdk9] [INFO] Maven Plugin Tools Java Annotations ................ SUCCESS [  2.163 s]
[windows-jdk9] [INFO] Maven Plugin Tool for Java with Annotations ........ SUCCESS [  5.985 s]
[windows-jdk9] [INFO] Maven Script Mojo Support .......................... SUCCESS [  1.168 s]
[windows-jdk9] [INFO] Maven Plugin Metadata Model ........................ SUCCESS [  3.863 s]
[windows-jdk9] [INFO] Maven Plugin Tool for Ant .......................... SUCCESS [  3.613 s]
[windows-jdk9] [INFO] Maven Ant Mojo Support ............................. SUCCESS [  6.294 s]
[windows-jdk9] [INFO] Maven Plugin Tool for Beanshell .................... SUCCESS [  1.788 s]
[windows-jdk9] [INFO] Maven Beanshell Mojo Support ....................... SUCCESS [  1.706 s]
[windows-jdk9] [INFO] Maven Plugin Plugin ................................ SUCCESS [09:58 min]
[windows-jdk9] [INFO] ------------------------------------------------------------------------
[windows-jdk9] [INFO] BUILD SUCCESS
[windows-jdk9] [INFO] ------------------------------------------------------------------------
[windows-jdk9] [INFO] Total time: 11:20 min
[windows-jdk9] [INFO] Finished at: 2018-10-03T11:30:37Z
[windows-jdk9] [INFO] Final Memory: 57M/191M
[windows-jdk9] [INFO] ------------------------------------------------------------------------
[windows-jdk9] [INFO] [jenkins-event-spy] Generated F:\jenkins\jenkins-slave\workspace\ven-plugin-tools_jdk11_asm7-J7667H6X6V4EBCRWUSKUMW4LMBBFILIHPFM47RV7V2XYHJFAOARA@tmp\withMaven6ab7934b\maven-spy-20181003-111916-432877982476086053236.log
[Pipeline] [windows-jdk9] }
[Pipeline] [windows-jdk9] // dir
[Pipeline] [windows-jdk9] }
[windows-jdk9] [withMaven] invokerPublisher - Archive invoker results for Maven artifact MavenArtifact{org.apache.maven.plugins:maven-plugin-plugin::3.6-SNAPSHOT(version: 3.6-SNAPSHOT, snapshot:false) } generated by PluginInvocation{org.apache.maven.plugins:maven-invoker-plugin:3.0.1@run  integration-test}: m\maven-plugin-plugin\target\invoker-reports\*.xml
[windows-jdk9] performing MavenInvokerRecorder, reportsFilenamePattern:'**/m\maven-plugin-plugin\target\invoker-reports/BUILD*.xml', invokerBuildDir:'**/m\maven-plugin-plugin\target\it'
[windows-jdk9] Found reports:[f:\jenkins\jenkins-slave\workspace\ven-plugin-tools_jdk11_asm7-J7667H6X6V4EBCRWUSKUMW4LMBBFILIHPFM47RV7V2XYHJFAOARA\m\maven-plugin-plugin\target\invoker-reports\BUILD-annotation-with-inheritance-from-deps.xml, f:\jenkins\jenkins-slave\workspace\ven-plugin-tools_jdk11_asm7-J7667H6X6V4EBCRWUSKUMW4LMBBFILIHPFM47RV7V2XYHJFAOARA\m\maven-plugin-plugin\target\invoker-reports\BUILD-annotation-with-inheritance-reactor.xml, f:\jenkins\jenkins-slave\workspace\ven-plugin-tools_jdk11_asm7-J7667H6X6V4EBCRWUSKUMW4LMBBFILIHPFM47RV7V2XYHJFAOARA\m\maven-plugin-plugin\target\invoker-reports\BUILD-annotation-with-inheritance.xml, f:\jenkins\jenkins-slave\workspace\ven-plugin-tools_jdk11_asm7-J7667H6X6V4EBCRWUSKUMW4LMBBFILIHPFM47RV7V2XYHJFAOARA\m\maven-plugin-plugin\target\invoker-reports\BUILD-ant-basic.xml, f:\jenkins\jenkins-slave\workspace\ven-plugin-tools_jdk11_asm7-J7667H6X6V4EBCRWUSKUMW4LMBBFILIHPFM47RV7V2XYHJFAOARA\m\maven-plugin-plugin\target\invoker-reports\BUILD-ant-reference-parameter.xml, f:\jenkins\jenkins-slave\workspace\ven-plugin-tools_jdk11_asm7-J7667H6X6V4EBCRWUSKUMW4LMBBFILIHPFM47RV7V2XYHJFAOARA\m\maven-plugin-plugin\target\invoker-reports\BUILD-ant-simple-usage.xml, f:\jenkins\jenkins-slave\workspace\ven-plugin-tools_jdk11_asm7-J7667H6X6V4EBCRWUSKUMW4LMBBFILIHPFM47RV7V2XYHJFAOARA\m\maven-plugin-plugin\target\invoker-reports\BUILD-ant-since-maven-plugin.xml, f:\jenkins\jenkins-slave\workspace\ven-plugin-tools_jdk11_asm7-J7667H6X6V4EBCRWUSKUMW4LMBBFILIHPFM47RV7V2XYHJFAOARA\m\maven-plugin-plugin\target\invoker-reports\BUILD-asm-failure.xml, f:\jenkins\jenkins-slave\workspace\ven-plugin-tools_jdk11_asm7-J7667H6X6V4EBCRWUSKUMW4LMBBFILIHPFM47RV7V2XYHJFAOARA\m\maven-plugin-plugin\target\invoker-reports\BUILD-beanshell-simple.xml, f:\jenkins\jenkins-slave\workspace\ven-plugin-tools_jdk11_asm7-J7667H6X6V4EBCRWUSKUMW4LMBBFILIHPFM47RV7V2XYHJFAOARA\m\maven-plugin-plugin\target\invoker-reports\BUILD-fix-maven-since-3.x.xml, f:\jenkins\jenkins-slave\workspace\ven-plugin-tools_jdk11_asm7-J7667H6X6V4EBCRWUSKUMW4LMBBFILIHPFM47RV7V2XYHJFAOARA\m\maven-plugin-plugin\target\invoker-reports\BUILD-help-basic-jdk11.xml, f:\jenkins\jenkins-slave\workspace\ven-plugin-tools_jdk11_asm7-J7667H6X6V4EBCRWUSKUMW4LMBBFILIHPFM47RV7V2XYHJFAOARA\m\maven-plugin-plugin\target\invoker-reports\BUILD-help-basic.xml, f:\jenkins\jenkins-slave\workspace\ven-plugin-tools_jdk11_asm7-J7667H6X6V4EBCRWUSKUMW4LMBBFILIHPFM47RV7V2XYHJFAOARA\m\maven-plugin-plugin\target\invoker-reports\BUILD-help-package.xml, f:\jenkins\jenkins-slave\workspace\ven-plugin-tools_jdk11_asm7-J7667H6X6V4EBCRWUSKUMW4LMBBFILIHPFM47RV7V2XYHJFAOARA\m\maven-plugin-plugin\target\invoker-reports\BUILD-ignore-plugin-class-realm.xml, f:\jenkins\jenkins-slave\workspace\ven-plugin-tools_jdk11_asm7-J7667H6X6V4EBCRWUSKUMW4LMBBFILIHPFM47RV7V2XYHJFAOARA\m\maven-plugin-plugin\target\invoker-reports\BUILD-java-basic-annotations-jdk11.xml, f:\jenkins\jenkins-slave\workspace\ven-plugin-tools_jdk11_asm7-J7667H6X6V4EBCRWUSKUMW4LMBBFILIHPFM47RV7V2XYHJFAOARA\m\maven-plugin-plugin\target\invoker-reports\BUILD-java-basic-annotations-jdk8.xml, f:\jenkins\jenkins-slave\workspace\ven-plugin-tools_jdk11_asm7-J7667H6X6V4EBCRWUSKUMW4LMBBFILIHPFM47RV7V2XYHJFAOARA\m\maven-plugin-plugin\target\invoker-reports\BUILD-java-basic-annotations.xml, f:\jenkins\jenkins-slave\workspace\ven-plugin-tools_jdk11_asm7-J7667H6X6V4EBCRWUSKUMW4LMBBFILIHPFM47RV7V2XYHJFAOARA\m\maven-plugin-plugin\target\invoker-reports\BUILD-java-basic.xml, f:\jenkins\jenkins-slave\workspace\ven-plugin-tools_jdk11_asm7-J7667H6X6V4EBCRWUSKUMW4LMBBFILIHPFM47RV7V2XYHJFAOARA\m\maven-plugin-plugin\target\invoker-reports\BUILD-mplugin-187.xml, f:\jenkins\jenkins-slave\workspace\ven-plugin-tools_jdk11_asm7-J7667H6X6V4EBCRWUSKUMW4LMBBFILIHPFM47RV7V2XYHJFAOARA\m\maven-plugin-plugin\target\invoker-reports\BUILD-mplugin-191.xml, f:\jenkins\jenkins-slave\workspace\ven-plugin-tools_jdk11_asm7-J7667H6X6V4EBCRWUSKUMW4LMBBFILIHPFM47RV7V2XYHJFAOARA\m\maven-plugin-plugin\target\invoker-reports\BUILD-mplugin-223.xml, f:\jenkins\jenkins-slave\workspace\ven-plugin-tools_jdk11_asm7-J7667H6X6V4EBCRWUSKUMW4LMBBFILIHPFM47RV7V2XYHJFAOARA\m\maven-plugin-plugin\target\invoker-reports\BUILD-mplugin-272_java8.xml, f:\jenkins\jenkins-slave\workspace\ven-plugin-tools_jdk11_asm7-J7667H6X6V4EBCRWUSKUMW4LMBBFILIHPFM47RV7V2XYHJFAOARA\m\maven-plugin-plugin\target\invoker-reports\BUILD-mplugin-299_no-configuration.xml, f:\jenkins\jenkins-slave\workspace\ven-plugin-tools_jdk11_asm7-J7667H6X6V4EBCRWUSKUMW4LMBBFILIHPFM47RV7V2XYHJFAOARA\m\maven-plugin-plugin\target\invoker-reports\BUILD-mplugin-305_defaultMojoDependencies.xml, f:\jenkins\jenkins-slave\workspace\ven-plugin-tools_jdk11_asm7-J7667H6X6V4EBCRWUSKUMW4LMBBFILIHPFM47RV7V2XYHJFAOARA\m\maven-plugin-plugin\target\invoker-reports\BUILD-mplugin-305_emptyMojoDependencies.xml, f:\jenkins\jenkins-slave\workspace\ven-plugin-tools_jdk11_asm7-J7667H6X6V4EBCRWUSKUMW4LMBBFILIHPFM47RV7V2XYHJFAOARA\m\maven-plugin-plugin\target\invoker-reports\BUILD-mplugin-305_singleMojoDependencies.xml, f:\jenkins\jenkins-slave\workspace\ven-plugin-tools_jdk11_asm7-J7667H6X6V4EBCRWUSKUMW4LMBBFILIHPFM47RV7V2XYHJFAOARA\m\maven-plugin-plugin\target\invoker-reports\BUILD-mplugin-319_report-since.xml, f:\jenkins\jenkins-slave\workspace\ven-plugin-tools_jdk11_asm7-J7667H6X6V4EBCRWUSKUMW4LMBBFILIHPFM47RV7V2XYHJFAOARA\m\maven-plugin-plugin\target\invoker-reports\BUILD-mplugin-324_javadoc.xml, f:\jenkins\jenkins-slave\workspace\ven-plugin-tools_jdk11_asm7-J7667H6X6V4EBCRWUSKUMW4LMBBFILIHPFM47RV7V2XYHJFAOARA\m\maven-plugin-plugin\target\invoker-reports\BUILD-packaging-jar.xml, f:\jenkins\jenkins-slave\workspace\ven-plugin-tools_jdk11_asm7-J7667H6X6V4EBCRWUSKUMW4LMBBFILIHPFM47RV7V2XYHJFAOARA\m\maven-plugin-plugin\target\invoker-reports\BUILD-plugin-info-jdk-default-version.xml, f:\jenkins\jenkins-slave\workspace\ven-plugin-tools_jdk11_asm7-J7667H6X6V4EBCRWUSKUMW4LMBBFILIHPFM47RV7V2XYHJFAOARA\m\maven-plugin-plugin\target\invoker-reports\BUILD-plugin-info-jdk.xml, f:\jenkins\jenkins-slave\workspace\ven-plugin-tools_jdk11_asm7-J7667H6X6V4EBCRWUSKUMW4LMBBFILIHPFM47RV7V2XYHJFAOARA\m\maven-plugin-plugin\target\invoker-reports\BUILD-plugin-report-annotations.xml, f:\jenkins\jenkins-slave\workspace\ven-plugin-tools_jdk11_asm7-J7667H6X6V4EBCRWUSKUMW4LMBBFILIHPFM47RV7V2XYHJFAOARA\m\maven-plugin-plugin\target\invoker-reports\BUILD-plugin-report.xml, f:\jenkins\jenkins-slave\workspace\ven-plugin-tools_jdk11_asm7-J7667H6X6V4EBCRWUSKUMW4LMBBFILIHPFM47RV7V2XYHJFAOARA\m\maven-plugin-plugin\target\invoker-reports\BUILD-skip.xml, f:\jenkins\jenkins-slave\workspace\ven-plugin-tools_jdk11_asm7-J7667H6X6V4EBCRWUSKUMW4LMBBFILIHPFM47RV7V2XYHJFAOARA\m\maven-plugin-plugin\target\invoker-reports\BUILD-source-encoding.xml]
[windows-jdk9] Found logs:[f:\jenkins\jenkins-slave\workspace\ven-plugin-tools_jdk11_asm7-J7667H6X6V4EBCRWUSKUMW4LMBBFILIHPFM47RV7V2XYHJFAOARA\m\maven-plugin-plugin\target\it\annotation-with-inheritance-from-deps\build.log, f:\jenkins\jenkins-slave\workspace\ven-plugin-tools_jdk11_asm7-J7667H6X6V4EBCRWUSKUMW4LMBBFILIHPFM47RV7V2XYHJFAOARA\m\maven-plugin-plugin\target\it\annotation-with-inheritance-reactor\build.log, f:\jenkins\jenkins-slave\workspace\ven-plugin-tools_jdk11_asm7-J7667H6X6V4EBCRWUSKUMW4LMBBFILIHPFM47RV7V2XYHJFAOARA\m\maven-plugin-plugin\target\it\annotation-with-inheritance\build.log, f:\jenkins\jenkins-slave\workspace\ven-plugin-tools_jdk11_asm7-J7667H6X6V4EBCRWUSKUMW4LMBBFILIHPFM47RV7V2XYHJFAOARA\m\maven-plugin-plugin\target\it\ant-basic\build.log, f:\jenkins\jenkins-slave\workspace\ven-plugin-tools_jdk11_asm7-J7667H6X6V4EBCRWUSKUMW4LMBBFILIHPFM47RV7V2XYHJFAOARA\m\maven-plugin-plugin\target\it\ant-reference-parameter\build.log, f:\jenkins\jenkins-slave\workspace\ven-plugin-tools_jdk11_asm7-J7667H6X6V4EBCRWUSKUMW4LMBBFILIHPFM47RV7V2XYHJFAOARA\m\maven-plugin-plugin\target\it\ant-simple-usage\build.log, f:\jenkins\jenkins-slave\workspace\ven-plugin-tools_jdk11_asm7-J7667H6X6V4EBCRWUSKUMW4LMBBFILIHPFM47RV7V2XYHJFAOARA\m\maven-plugin-plugin\target\it\ant-since-maven-plugin\build.log, f:\jenkins\jenkins-slave\workspace\ven-plugin-tools_jdk11_asm7-J7667H6X6V4EBCRWUSKUMW4LMBBFILIHPFM47RV7V2XYHJFAOARA\m\maven-plugin-plugin\target\it\asm-failure\build.log, f:\jenkins\jenkins-slave\workspace\ven-plugin-tools_jdk11_asm7-J7667H6X6V4EBCRWUSKUMW4LMBBFILIHPFM47RV7V2XYHJFAOARA\m\maven-plugin-plugin\target\it\beanshell-simple\build.log, f:\jenkins\jenkins-slave\workspace\ven-plugin-tools_jdk11_asm7-J7667H6X6V4EBCRWUSKUMW4LMBBFILIHPFM47RV7V2XYHJFAOARA\m\maven-plugin-plugin\target\it\fix-maven-since-3.x\build.log, f:\jenkins\jenkins-slave\workspace\ven-plugin-tools_jdk11_asm7-J7667H6X6V4EBCRWUSKUMW4LMBBFILIHPFM47RV7V2XYHJFAOARA\m\maven-plugin-plugin\target\it\help-basic\build.log, f:\jenkins\jenkins-slave\workspace\ven-plugin-tools_jdk11_asm7-J7667H6X6V4EBCRWUSKUMW4LMBBFILIHPFM47RV7V2XYHJFAOARA\m\maven-plugin-plugin\target\it\help-package\build.log, f:\jenkins\jenkins-slave\workspace\ven-plugin-tools_jdk11_asm7-J7667H6X6V4EBCRWUSKUMW4LMBBFILIHPFM47RV7V2XYHJFAOARA\m\maven-plugin-plugin\target\it\ignore-plugin-class-realm\build.log, f:\jenkins\jenkins-slave\workspace\ven-plugin-tools_jdk11_asm7-J7667H6X6V4EBCRWUSKUMW4LMBBFILIHPFM47RV7V2XYHJFAOARA\m\maven-plugin-plugin\target\it\java-basic-annotations-jdk11\build.log, f:\jenkins\jenkins-slave\workspace\ven-plugin-tools_jdk11_asm7-J7667H6X6V4EBCRWUSKUMW4LMBBFILIHPFM47RV7V2XYHJFAOARA\m\maven-plugin-plugin\target\it\java-basic-annotations-jdk8\build.log, f:\jenkins\jenkins-slave\workspace\ven-plugin-tools_jdk11_asm7-J7667H6X6V4EBCRWUSKUMW4LMBBFILIHPFM47RV7V2XYHJFAOARA\m\maven-plugin-plugin\target\it\java-basic-annotations\build.log, f:\jenkins\jenkins-slave\workspace\ven-plugin-tools_jdk11_asm7-J7667H6X6V4EBCRWUSKUMW4LMBBFILIHPFM47RV7V2XYHJFAOARA\m\maven-plugin-plugin\target\it\java-basic\build.log, f:\jenkins\jenkins-slave\workspace\ven-plugin-tools_jdk11_asm7-J7667H6X6V4EBCRWUSKUMW4LMBBFILIHPFM47RV7V2XYHJFAOARA\m\maven-plugin-plugin\target\it\mplugin-187\build.log, f:\jenkins\jenkins-slave\workspace\ven-plugin-tools_jdk11_asm7-J7667H6X6V4EBCRWUSKUMW4LMBBFILIHPFM47RV7V2XYHJFAOARA\m\maven-plugin-plugin\target\it\mplugin-191\build.log, f:\jenkins\jenkins-slave\workspace\ven-plugin-tools_jdk11_asm7-J7667H6X6V4EBCRWUSKUMW4LMBBFILIHPFM47RV7V2XYHJFAOARA\m\maven-plugin-plugin\target\it\mplugin-223\build.log, f:\jenkins\jenkins-slave\workspace\ven-plugin-tools_jdk11_asm7-J7667H6X6V4EBCRWUSKUMW4LMBBFILIHPFM47RV7V2XYHJFAOARA\m\maven-plugin-plugin\target\it\mplugin-272_java8\build.log, f:\jenkins\jenkins-slave\workspace\ven-plugin-tools_jdk11_asm7-J7667H6X6V4EBCRWUSKUMW4LMBBFILIHPFM47RV7V2XYHJFAOARA\m\maven-plugin-plugin\target\it\mplugin-299_no-configuration\build.log, f:\jenkins\jenkins-slave\workspace\ven-plugin-tools_jdk11_asm7-J7667H6X6V4EBCRWUSKUMW4LMBBFILIHPFM47RV7V2XYHJFAOARA\m\maven-plugin-plugin\target\it\mplugin-305_defaultMojoDependencies\build.log, f:\jenkins\jenkins-slave\workspace\ven-plugin-tools_jdk11_asm7-J7667H6X6V4EBCRWUSKUMW4LMBBFILIHPFM47RV7V2XYHJFAOARA\m\maven-plugin-plugin\target\it\mplugin-305_emptyMojoDependencies\build.log, f:\jenkins\jenkins-slave\workspace\ven-plugin-tools_jdk11_asm7-J7667H6X6V4EBCRWUSKUMW4LMBBFILIHPFM47RV7V2XYHJFAOARA\m\maven-plugin-plugin\target\it\mplugin-305_singleMojoDependencies\build.log, f:\jenkins\jenkins-slave\workspace\ven-plugin-tools_jdk11_asm7-J7667H6X6V4EBCRWUSKUMW4LMBBFILIHPFM47RV7V2XYHJFAOARA\m\maven-plugin-plugin\target\it\mplugin-319_report-since\build.log, f:\jenkins\jenkins-slave\workspace\ven-plugin-tools_jdk11_asm7-J7667H6X6V4EBCRWUSKUMW4LMBBFILIHPFM47RV7V2XYHJFAOARA\m\maven-plugin-plugin\target\it\mplugin-324_javadoc\build.log, f:\jenkins\jenkins-slave\workspace\ven-plugin-tools_jdk11_asm7-J7667H6X6V4EBCRWUSKUMW4LMBBFILIHPFM47RV7V2XYHJFAOARA\m\maven-plugin-plugin\target\it\packaging-jar\build.log, f:\jenkins\jenkins-slave\workspace\ven-plugin-tools_jdk11_asm7-J7667H6X6V4EBCRWUSKUMW4LMBBFILIHPFM47RV7V2XYHJFAOARA\m\maven-plugin-plugin\target\it\plugin-info-jdk-default-version\build.log, f:\jenkins\jenkins-slave\workspace\ven-plugin-tools_jdk11_asm7-J7667H6X6V4EBCRWUSKUMW4LMBBFILIHPFM47RV7V2XYHJFAOARA\m\maven-plugin-plugin\target\it\plugin-info-jdk\build.log, f:\jenkins\jenkins-slave\workspace\ven-plugin-tools_jdk11_asm7-J7667H6X6V4EBCRWUSKUMW4LMBBFILIHPFM47RV7V2XYHJFAOARA\m\maven-plugin-plugin\target\it\plugin-report-annotations\build.log, f:\jenkins\jenkins-slave\workspace\ven-plugin-tools_jdk11_asm7-J7667H6X6V4EBCRWUSKUMW4LMBBFILIHPFM47RV7V2XYHJFAOARA\m\maven-plugin-plugin\target\it\plugin-report\build.log, f:\jenkins\jenkins-slave\workspace\ven-plugin-tools_jdk11_asm7-J7667H6X6V4EBCRWUSKUMW4LMBBFILIHPFM47RV7V2XYHJFAOARA\m\maven-plugin-plugin\target\it\skip\build.log, f:\jenkins\jenkins-slave\workspace\ven-plugin-tools_jdk11_asm7-J7667H6X6V4EBCRWUSKUMW4LMBBFILIHPFM47RV7V2XYHJFAOARA\m\maven-plugin-plugin\target\it\source-encoding\build.log]
[windows-jdk9] Finished parsing Maven Invoker results (found 35)
[windows-jdk9] [withMaven] junitPublisher - Archive test results for Maven artifact org.apache.maven.plugin-tools:maven-plugin-tools-api:3.6-SNAPSHOT generated by maven-surefire-plugin:test (default-test): m\maven-plugin-tools-api\target\surefire-reports\*.xml
[windows-jdk9] Recording test results
[windows-jdk9] [withMaven] junitPublisher - Archive test results for Maven artifact org.apache.maven.plugin-tools:maven-plugin-tools-generators:3.6-SNAPSHOT generated by maven-surefire-plugin:test (default-test): m\maven-plugin-tools-generators\target\surefire-reports\*.xml
[windows-jdk9] Recording test results
[windows-jdk9] [withMaven] junitPublisher - Archive test results for Maven artifact org.apache.maven.plugin-tools:maven-plugin-tools-java:3.6-SNAPSHOT generated by maven-surefire-plugin:test (default-test): m\maven-plugin-tools-java\target\surefire-reports\*.xml
[windows-jdk9] Recording test results
[windows-jdk9] [withMaven] junitPublisher - Archive test results for Maven artifact org.apache.maven.plugin-tools:maven-plugin-annotations:3.6-SNAPSHOT generated by maven-surefire-plugin:test (default-test): m\maven-plugin-annotations\target\surefire-reports\*.xml
[windows-jdk9] Recording test results
[windows-jdk9] None of the test reports contained any result
[windows-jdk9] [withMaven] junitPublisher - Archive test results for Maven artifact org.apache.maven.plugin-tools:maven-plugin-tools-annotations:3.6-SNAPSHOT generated by maven-surefire-plugin:test (default-test): m\maven-plugin-tools-annotations\target\surefire-reports\*.xml
[windows-jdk9] Recording test results
[windows-jdk9] [withMaven] junitPublisher - Archive test results for Maven artifact org.apache.maven.plugin-tools:maven-plugin-tools-model:3.6-SNAPSHOT generated by maven-surefire-plugin:test (default-test): m\maven-script\maven-plugin-tools-model\target\surefire-reports\*.xml
[windows-jdk9] Recording test results
[windows-jdk9] [withMaven] junitPublisher - Archive test results for Maven artifact org.apache.maven.plugin-tools:maven-plugin-tools-ant:3.6-SNAPSHOT generated by maven-surefire-plugin:test (default-test): m\maven-script\maven-plugin-tools-ant\target\surefire-reports\*.xml
[windows-jdk9] Recording test results
[windows-jdk9] [withMaven] junitPublisher - Archive test results for Maven artifact org.apache.maven.plugin-tools:maven-script-ant:3.6-SNAPSHOT generated by maven-surefire-plugin:test (default-test): m\maven-script\maven-script-ant\target\surefire-reports\*.xml
[windows-jdk9] Recording test results
[windows-jdk9] [withMaven] junitPublisher - Archive test results for Maven artifact org.apache.maven.plugin-tools:maven-plugin-tools-beanshell:3.6-SNAPSHOT generated by maven-surefire-plugin:test (default-test): m\maven-script\maven-plugin-tools-beanshell\target\surefire-reports\*.xml
[windows-jdk9] Recording test results
[windows-jdk9] None of the test reports contained any result
[windows-jdk9] [withMaven] junitPublisher - Archive test results for Maven artifact org.apache.maven.plugin-tools:maven-script-beanshell:3.6-SNAPSHOT generated by maven-surefire-plugin:test (default-test): m\maven-script\maven-script-beanshell\target\surefire-reports\*.xml
[windows-jdk9] Recording test results
[windows-jdk9] None of the test reports contained any result
[windows-jdk9] [withMaven] junitPublisher - Archive test results for Maven artifact org.apache.maven.plugins:maven-plugin-plugin:3.6-SNAPSHOT generated by maven-surefire-plugin:test (default-test): m\maven-plugin-plugin\target\surefire-reports\*.xml
[windows-jdk9] Recording test results
[windows-jdk9] None of the test reports contained any result
[Pipeline] [windows-jdk9] // withMaven
[Pipeline] [windows-jdk9] cleanWs
[windows-jdk9] [WS-CLEANUP] Deleting project workspace...[WS-CLEANUP] done
[Pipeline] [windows-jdk9] }
[Pipeline] [windows-jdk9] // stage
[Pipeline] [windows-jdk9] }
[Pipeline] [windows-jdk9] // node
[Pipeline] [windows-jdk9] }
[Pipeline] // parallel
[Pipeline] stage
[Pipeline] { (Notifications)
[Pipeline] echo
Build result: FAILURE
[Pipeline] jiraIssueSelector
[Pipeline] emailext
Mime
  • Unnamed multipart/mixed (inline, None, 0 bytes)
View raw message