maven-notifications mailing list archives

Site index · List index
Message view « Date » · « Thread »
Top « Date » · « Thread »
From Apache Jenkins Server <jenk...@builds.apache.org>
Subject Build unstable in Jenkins: Maven TLP » maven-archetype » ARCHETYPE-553 #19
Date Wed, 03 Oct 2018 20:08:21 GMT
See https://builds.apache.org/job/maven-box/job/maven-archetype/job/ARCHETYPE-553/19/

Changes:

* no need to test anymore with '3.0.x'
* Add Java 11 to defaults
* [MNGSITE-341] use https for sigs, hashes and KEYS
* [MPOM-205] use sha512 checksums instead of sha1
* upgraded parent POM from 32 to 33
* [MNGSITE-341] use https for sigs, hashes and KEYS
* [MPOM-205] use sha512 checksums instead of sha1
* upgraded parent POM from 32 to 33
* [MNGSITE-341] use https for sigs, hashes and KEYS
* [MPOM-205] use sha512 checksums instead of sha1
* upgraded parent POM from 32 to 33
* [MNGSITE-341] use https for sigs, hashes and KEYS
* [MPOM-205] use sha512 checksums instead of sha1
* upgraded parent POM from 32 to 33
* [MNGSITE-341] use https for sigs, hashes and KEYS
* [MPOM-205] use sha512 checksums instead of sha1
* upgraded parent POM from 32 to 33
* [MNGSITE-341] use https for sigs, hashes and KEYS
* [MPOM-205] use sha512 checksums instead of sha1
* upgraded parent POM from 32 to 33

39 tests failed.
FAILED:  org.apache.maven.archetype.creator.DefaultArchetypeCreatorIT.testIncludeFileWithNoExtension

Error Message:
Error while executing process.

Stack Trace:
org.codehaus.plexus.util.cli.CommandLineException: Error while executing process.
	at org.apache.maven.archetype.creator.DefaultArchetypeCreatorIT.createFilesetArchetype(DefaultArchetypeCreatorIT.java:136)
	at org.apache.maven.archetype.creator.DefaultArchetypeCreatorIT.testIncludeFileWithNoExtension(DefaultArchetypeCreatorIT.java:189)
Caused by: java.io.IOException: Cannot run program "F:\jenkins\tools\maven\apache-maven-3.2.5\bin\mvn.bat" (in directory "F:\jenkins\jenkins-slave\workspace\ven-archetype_ARCHETYPE-553-J4FOCNZGBVSFDFI4P3DBC7GXGJK62NFN5QH7Q5I46GZ5AP3FIVLQ\windows-jdk7-m3.2.x_build\archetype-testing\archetype-final\target\test-classes\projects\include-file-with-no-extension\target\generated-sources\archetype"): CreateProcess error=267, The directory name is invalid
	at org.apache.maven.archetype.creator.DefaultArchetypeCreatorIT.createFilesetArchetype(DefaultArchetypeCreatorIT.java:136)
	at org.apache.maven.archetype.creator.DefaultArchetypeCreatorIT.testIncludeFileWithNoExtension(DefaultArchetypeCreatorIT.java:189)
Caused by: java.io.IOException: CreateProcess error=267, The directory name is invalid
	at org.apache.maven.archetype.creator.DefaultArchetypeCreatorIT.createFilesetArchetype(DefaultArchetypeCreatorIT.java:136)
	at org.apache.maven.archetype.creator.DefaultArchetypeCreatorIT.testIncludeFileWithNoExtension(DefaultArchetypeCreatorIT.java:189)


FAILED:  org.apache.maven.archetype.creator.DefaultArchetypeCreatorIT.testSystemPropertiesAreIncluded

Error Message:
Error while executing process.

Stack Trace:
org.codehaus.plexus.util.cli.CommandLineException: Error while executing process.
	at org.apache.maven.archetype.creator.DefaultArchetypeCreatorIT.createFilesetArchetype(DefaultArchetypeCreatorIT.java:136)
	at org.apache.maven.archetype.creator.DefaultArchetypeCreatorIT.testSystemPropertiesAreIncluded(DefaultArchetypeCreatorIT.java:200)
Caused by: java.io.IOException: Cannot run program "F:\jenkins\tools\maven\apache-maven-3.2.5\bin\mvn.bat" (in directory "F:\jenkins\jenkins-slave\workspace\ven-archetype_ARCHETYPE-553-J4FOCNZGBVSFDFI4P3DBC7GXGJK62NFN5QH7Q5I46GZ5AP3FIVLQ\windows-jdk7-m3.2.x_build\archetype-testing\archetype-final\target\test-classes\projects\included-system-properties\target\generated-sources\archetype"): CreateProcess error=267, The directory name is invalid
	at org.apache.maven.archetype.creator.DefaultArchetypeCreatorIT.createFilesetArchetype(DefaultArchetypeCreatorIT.java:136)
	at org.apache.maven.archetype.creator.DefaultArchetypeCreatorIT.testSystemPropertiesAreIncluded(DefaultArchetypeCreatorIT.java:200)
Caused by: java.io.IOException: CreateProcess error=267, The directory name is invalid
	at org.apache.maven.archetype.creator.DefaultArchetypeCreatorIT.createFilesetArchetype(DefaultArchetypeCreatorIT.java:136)
	at org.apache.maven.archetype.creator.DefaultArchetypeCreatorIT.testSystemPropertiesAreIncluded(DefaultArchetypeCreatorIT.java:200)


FAILED:  org.apache.maven.archetype.creator.DefaultArchetypeCreatorIT.testChangeJavaFilenameWhenCustomPropertyEqualsClassName

Error Message:
Error while executing process.

Stack Trace:
org.codehaus.plexus.util.cli.CommandLineException: Error while executing process.
	at org.apache.maven.archetype.creator.DefaultArchetypeCreatorIT.createFilesetArchetype(DefaultArchetypeCreatorIT.java:136)
	at org.apache.maven.archetype.creator.DefaultArchetypeCreatorIT.testChangeJavaFilenameWhenCustomPropertyEqualsClassName(DefaultArchetypeCreatorIT.java:151)
Caused by: java.io.IOException: Cannot run program "F:\jenkins\tools\maven\apache-maven-3.2.5\bin\mvn.bat" (in directory "F:\jenkins\jenkins-slave\workspace\ven-archetype_ARCHETYPE-553-J4FOCNZGBVSFDFI4P3DBC7GXGJK62NFN5QH7Q5I46GZ5AP3FIVLQ\windows-jdk7-m3.2.x_build\archetype-testing\archetype-final\target\test-classes\projects\change-file-with-property\target\generated-sources\archetype"): CreateProcess error=267, The directory name is invalid
	at org.apache.maven.archetype.creator.DefaultArchetypeCreatorIT.createFilesetArchetype(DefaultArchetypeCreatorIT.java:136)
	at org.apache.maven.archetype.creator.DefaultArchetypeCreatorIT.testChangeJavaFilenameWhenCustomPropertyEqualsClassName(DefaultArchetypeCreatorIT.java:151)
Caused by: java.io.IOException: CreateProcess error=267, The directory name is invalid
	at org.apache.maven.archetype.creator.DefaultArchetypeCreatorIT.createFilesetArchetype(DefaultArchetypeCreatorIT.java:136)
	at org.apache.maven.archetype.creator.DefaultArchetypeCreatorIT.testChangeJavaFilenameWhenCustomPropertyEqualsClassName(DefaultArchetypeCreatorIT.java:151)


FAILED:  org.apache.maven.archetype.creator.DefaultArchetypeCreatorIT.testIncludeFileWithNoExtension

Error Message:
Error while executing process.

Stack Trace:
org.codehaus.plexus.util.cli.CommandLineException: Error while executing process.
	at org.apache.maven.archetype.creator.DefaultArchetypeCreatorIT.createFilesetArchetype(DefaultArchetypeCreatorIT.java:136)
	at org.apache.maven.archetype.creator.DefaultArchetypeCreatorIT.testIncludeFileWithNoExtension(DefaultArchetypeCreatorIT.java:189)
Caused by: java.io.IOException: Cannot run program "F:\jenkins\tools\maven\apache-maven-3.5.2\bin\mvn.cmd" (in directory "F:\jenkins\jenkins-slave\workspace\ven-archetype_ARCHETYPE-553-J4FOCNZGBVSFDFI4P3DBC7GXGJK62NFN5QH7Q5I46GZ5AP3FIVLQ@2\windows-jdk10-m3.5.x_build\archetype-testing\archetype-final\target\test-classes\projects\include-file-with-no-extension\target\generated-sources\archetype"): CreateProcess error=267, The directory name is invalid
	at org.apache.maven.archetype.creator.DefaultArchetypeCreatorIT.createFilesetArchetype(DefaultArchetypeCreatorIT.java:136)
	at org.apache.maven.archetype.creator.DefaultArchetypeCreatorIT.testIncludeFileWithNoExtension(DefaultArchetypeCreatorIT.java:189)
Caused by: java.io.IOException: CreateProcess error=267, The directory name is invalid
	at org.apache.maven.archetype.creator.DefaultArchetypeCreatorIT.createFilesetArchetype(DefaultArchetypeCreatorIT.java:136)
	at org.apache.maven.archetype.creator.DefaultArchetypeCreatorIT.testIncludeFileWithNoExtension(DefaultArchetypeCreatorIT.java:189)


FAILED:  org.apache.maven.archetype.creator.DefaultArchetypeCreatorIT.testSystemPropertiesAreIncluded

Error Message:
Error while executing process.

Stack Trace:
org.codehaus.plexus.util.cli.CommandLineException: Error while executing process.
	at org.apache.maven.archetype.creator.DefaultArchetypeCreatorIT.createFilesetArchetype(DefaultArchetypeCreatorIT.java:136)
	at org.apache.maven.archetype.creator.DefaultArchetypeCreatorIT.testSystemPropertiesAreIncluded(DefaultArchetypeCreatorIT.java:200)
Caused by: java.io.IOException: Cannot run program "F:\jenkins\tools\maven\apache-maven-3.5.2\bin\mvn.cmd" (in directory "F:\jenkins\jenkins-slave\workspace\ven-archetype_ARCHETYPE-553-J4FOCNZGBVSFDFI4P3DBC7GXGJK62NFN5QH7Q5I46GZ5AP3FIVLQ@2\windows-jdk10-m3.5.x_build\archetype-testing\archetype-final\target\test-classes\projects\included-system-properties\target\generated-sources\archetype"): CreateProcess error=267, The directory name is invalid
	at org.apache.maven.archetype.creator.DefaultArchetypeCreatorIT.createFilesetArchetype(DefaultArchetypeCreatorIT.java:136)
	at org.apache.maven.archetype.creator.DefaultArchetypeCreatorIT.testSystemPropertiesAreIncluded(DefaultArchetypeCreatorIT.java:200)
Caused by: java.io.IOException: CreateProcess error=267, The directory name is invalid
	at org.apache.maven.archetype.creator.DefaultArchetypeCreatorIT.createFilesetArchetype(DefaultArchetypeCreatorIT.java:136)
	at org.apache.maven.archetype.creator.DefaultArchetypeCreatorIT.testSystemPropertiesAreIncluded(DefaultArchetypeCreatorIT.java:200)


FAILED:  org.apache.maven.archetype.creator.DefaultArchetypeCreatorIT.testExcludePatternsMustExcludeDirectory

Error Message:
Error while executing process.

Stack Trace:
org.codehaus.plexus.util.cli.CommandLineException: Error while executing process.
	at org.apache.maven.archetype.creator.DefaultArchetypeCreatorIT.createFilesetArchetype(DefaultArchetypeCreatorIT.java:136)
	at org.apache.maven.archetype.creator.DefaultArchetypeCreatorIT.testExcludePatternsMustExcludeDirectory(DefaultArchetypeCreatorIT.java:163)
Caused by: java.io.IOException: Cannot run program "F:\jenkins\tools\maven\apache-maven-3.5.2\bin\mvn.cmd" (in directory "F:\jenkins\jenkins-slave\workspace\ven-archetype_ARCHETYPE-553-J4FOCNZGBVSFDFI4P3DBC7GXGJK62NFN5QH7Q5I46GZ5AP3FIVLQ@2\windows-jdk10-m3.5.x_build\archetype-testing\archetype-final\target\test-classes\projects\exclude-patterns\target\generated-sources\archetype"): CreateProcess error=267, The directory name is invalid
	at org.apache.maven.archetype.creator.DefaultArchetypeCreatorIT.createFilesetArchetype(DefaultArchetypeCreatorIT.java:136)
	at org.apache.maven.archetype.creator.DefaultArchetypeCreatorIT.testExcludePatternsMustExcludeDirectory(DefaultArchetypeCreatorIT.java:163)
Caused by: java.io.IOException: CreateProcess error=267, The directory name is invalid
	at org.apache.maven.archetype.creator.DefaultArchetypeCreatorIT.createFilesetArchetype(DefaultArchetypeCreatorIT.java:136)
	at org.apache.maven.archetype.creator.DefaultArchetypeCreatorIT.testExcludePatternsMustExcludeDirectory(DefaultArchetypeCreatorIT.java:163)


FAILED:  org.apache.maven.archetype.creator.DefaultArchetypeCreatorIT.testExcludePatternsContainingFilesSameExtension

Error Message:
Error while executing process.

Stack Trace:
org.codehaus.plexus.util.cli.CommandLineException: Error while executing process.
	at org.apache.maven.archetype.creator.DefaultArchetypeCreatorIT.createFilesetArchetype(DefaultArchetypeCreatorIT.java:136)
	at org.apache.maven.archetype.creator.DefaultArchetypeCreatorIT.testExcludePatternsContainingFilesSameExtension(DefaultArchetypeCreatorIT.java:177)
Caused by: java.io.IOException: Cannot run program "F:\jenkins\tools\maven\apache-maven-3.5.2\bin\mvn.cmd" (in directory "F:\jenkins\jenkins-slave\workspace\ven-archetype_ARCHETYPE-553-J4FOCNZGBVSFDFI4P3DBC7GXGJK62NFN5QH7Q5I46GZ5AP3FIVLQ@2\windows-jdk10-m3.5.x_build\archetype-testing\archetype-final\target\test-classes\projects\exclude-patterns-2\target\generated-sources\archetype"): CreateProcess error=267, The directory name is invalid
	at org.apache.maven.archetype.creator.DefaultArchetypeCreatorIT.createFilesetArchetype(DefaultArchetypeCreatorIT.java:136)
	at org.apache.maven.archetype.creator.DefaultArchetypeCreatorIT.testExcludePatternsContainingFilesSameExtension(DefaultArchetypeCreatorIT.java:177)
Caused by: java.io.IOException: CreateProcess error=267, The directory name is invalid
	at org.apache.maven.archetype.creator.DefaultArchetypeCreatorIT.createFilesetArchetype(DefaultArchetypeCreatorIT.java:136)
	at org.apache.maven.archetype.creator.DefaultArchetypeCreatorIT.testExcludePatternsContainingFilesSameExtension(DefaultArchetypeCreatorIT.java:177)


FAILED:  org.apache.maven.archetype.creator.DefaultArchetypeCreatorIT.testChangeJavaFilenameWhenCustomPropertyEqualsClassName

Error Message:
Error while executing process.

Stack Trace:
org.codehaus.plexus.util.cli.CommandLineException: Error while executing process.
	at org.apache.maven.archetype.creator.DefaultArchetypeCreatorIT.createFilesetArchetype(DefaultArchetypeCreatorIT.java:136)
	at org.apache.maven.archetype.creator.DefaultArchetypeCreatorIT.testChangeJavaFilenameWhenCustomPropertyEqualsClassName(DefaultArchetypeCreatorIT.java:151)
Caused by: java.io.IOException: Cannot run program "F:\jenkins\tools\maven\apache-maven-3.5.2\bin\mvn.cmd" (in directory "F:\jenkins\jenkins-slave\workspace\ven-archetype_ARCHETYPE-553-J4FOCNZGBVSFDFI4P3DBC7GXGJK62NFN5QH7Q5I46GZ5AP3FIVLQ@2\windows-jdk10-m3.5.x_build\archetype-testing\archetype-final\target\test-classes\projects\change-file-with-property\target\generated-sources\archetype"): CreateProcess error=267, The directory name is invalid
	at org.apache.maven.archetype.creator.DefaultArchetypeCreatorIT.createFilesetArchetype(DefaultArchetypeCreatorIT.java:136)
	at org.apache.maven.archetype.creator.DefaultArchetypeCreatorIT.testChangeJavaFilenameWhenCustomPropertyEqualsClassName(DefaultArchetypeCreatorIT.java:151)
Caused by: java.io.IOException: CreateProcess error=267, The directory name is invalid
	at org.apache.maven.archetype.creator.DefaultArchetypeCreatorIT.createFilesetArchetype(DefaultArchetypeCreatorIT.java:136)
	at org.apache.maven.archetype.creator.DefaultArchetypeCreatorIT.testChangeJavaFilenameWhenCustomPropertyEqualsClassName(DefaultArchetypeCreatorIT.java:151)


FAILED:  org.apache.maven.archetype.creator.DefaultArchetypeCreatorIT.testIncludeFileWithNoExtension

Error Message:
Error while executing process.

Stack Trace:
org.codehaus.plexus.util.cli.CommandLineException: Error while executing process.
	at org.apache.maven.archetype.creator.DefaultArchetypeCreatorIT.createFilesetArchetype(DefaultArchetypeCreatorIT.java:136)
	at org.apache.maven.archetype.creator.DefaultArchetypeCreatorIT.testIncludeFileWithNoExtension(DefaultArchetypeCreatorIT.java:189)
Caused by: java.io.IOException: Cannot run program "F:\jenkins\tools\maven\apache-maven-3.5.2\bin\mvn.cmd" (in directory "F:\jenkins\jenkins-slave\workspace\ven-archetype_ARCHETYPE-553-J4FOCNZGBVSFDFI4P3DBC7GXGJK62NFN5QH7Q5I46GZ5AP3FIVLQ\windows-jdk9-m3.5.x_build\archetype-testing\archetype-final\target\test-classes\projects\include-file-with-no-extension\target\generated-sources\archetype"): CreateProcess error=267, The directory name is invalid
	at org.apache.maven.archetype.creator.DefaultArchetypeCreatorIT.createFilesetArchetype(DefaultArchetypeCreatorIT.java:136)
	at org.apache.maven.archetype.creator.DefaultArchetypeCreatorIT.testIncludeFileWithNoExtension(DefaultArchetypeCreatorIT.java:189)
Caused by: java.io.IOException: CreateProcess error=267, The directory name is invalid
	at org.apache.maven.archetype.creator.DefaultArchetypeCreatorIT.createFilesetArchetype(DefaultArchetypeCreatorIT.java:136)
	at org.apache.maven.archetype.creator.DefaultArchetypeCreatorIT.testIncludeFileWithNoExtension(DefaultArchetypeCreatorIT.java:189)


FAILED:  org.apache.maven.archetype.creator.DefaultArchetypeCreatorIT.testSystemPropertiesAreIncluded

Error Message:
Error while executing process.

Stack Trace:
org.codehaus.plexus.util.cli.CommandLineException: Error while executing process.
	at org.apache.maven.archetype.creator.DefaultArchetypeCreatorIT.createFilesetArchetype(DefaultArchetypeCreatorIT.java:136)
	at org.apache.maven.archetype.creator.DefaultArchetypeCreatorIT.testSystemPropertiesAreIncluded(DefaultArchetypeCreatorIT.java:200)
Caused by: java.io.IOException: Cannot run program "F:\jenkins\tools\maven\apache-maven-3.5.2\bin\mvn.cmd" (in directory "F:\jenkins\jenkins-slave\workspace\ven-archetype_ARCHETYPE-553-J4FOCNZGBVSFDFI4P3DBC7GXGJK62NFN5QH7Q5I46GZ5AP3FIVLQ\windows-jdk9-m3.5.x_build\archetype-testing\archetype-final\target\test-classes\projects\included-system-properties\target\generated-sources\archetype"): CreateProcess error=267, The directory name is invalid
	at org.apache.maven.archetype.creator.DefaultArchetypeCreatorIT.createFilesetArchetype(DefaultArchetypeCreatorIT.java:136)
	at org.apache.maven.archetype.creator.DefaultArchetypeCreatorIT.testSystemPropertiesAreIncluded(DefaultArchetypeCreatorIT.java:200)
Caused by: java.io.IOException: CreateProcess error=267, The directory name is invalid
	at org.apache.maven.archetype.creator.DefaultArchetypeCreatorIT.createFilesetArchetype(DefaultArchetypeCreatorIT.java:136)
	at org.apache.maven.archetype.creator.DefaultArchetypeCreatorIT.testSystemPropertiesAreIncluded(DefaultArchetypeCreatorIT.java:200)


FAILED:  org.apache.maven.archetype.creator.DefaultArchetypeCreatorIT.testChangeJavaFilenameWhenCustomPropertyEqualsClassName

Error Message:
Error while executing process.

Stack Trace:
org.codehaus.plexus.util.cli.CommandLineException: Error while executing process.
	at org.apache.maven.archetype.creator.DefaultArchetypeCreatorIT.createFilesetArchetype(DefaultArchetypeCreatorIT.java:136)
	at org.apache.maven.archetype.creator.DefaultArchetypeCreatorIT.testChangeJavaFilenameWhenCustomPropertyEqualsClassName(DefaultArchetypeCreatorIT.java:151)
Caused by: java.io.IOException: Cannot run program "F:\jenkins\tools\maven\apache-maven-3.5.2\bin\mvn.cmd" (in directory "F:\jenkins\jenkins-slave\workspace\ven-archetype_ARCHETYPE-553-J4FOCNZGBVSFDFI4P3DBC7GXGJK62NFN5QH7Q5I46GZ5AP3FIVLQ\windows-jdk9-m3.5.x_build\archetype-testing\archetype-final\target\test-classes\projects\change-file-with-property\target\generated-sources\archetype"): CreateProcess error=267, The directory name is invalid
	at org.apache.maven.archetype.creator.DefaultArchetypeCreatorIT.createFilesetArchetype(DefaultArchetypeCreatorIT.java:136)
	at org.apache.maven.archetype.creator.DefaultArchetypeCreatorIT.testChangeJavaFilenameWhenCustomPropertyEqualsClassName(DefaultArchetypeCreatorIT.java:151)
Caused by: java.io.IOException: CreateProcess error=267, The directory name is invalid
	at org.apache.maven.archetype.creator.DefaultArchetypeCreatorIT.createFilesetArchetype(DefaultArchetypeCreatorIT.java:136)
	at org.apache.maven.archetype.creator.DefaultArchetypeCreatorIT.testChangeJavaFilenameWhenCustomPropertyEqualsClassName(DefaultArchetypeCreatorIT.java:151)


FAILED:  org.apache.maven.archetype.creator.DefaultArchetypeCreatorIT.testIncludeFileWithNoExtension

Error Message:
Error while executing process.

Stack Trace:
org.codehaus.plexus.util.cli.CommandLineException: Error while executing process.
	at org.apache.maven.archetype.creator.DefaultArchetypeCreatorIT.createFilesetArchetype(DefaultArchetypeCreatorIT.java:136)
	at org.apache.maven.archetype.creator.DefaultArchetypeCreatorIT.testIncludeFileWithNoExtension(DefaultArchetypeCreatorIT.java:189)
Caused by: java.io.IOException: Cannot run program "F:\jenkins\tools\maven\apache-maven-3.3.9\bin\mvn.cmd" (in directory "F:\jenkins\jenkins-slave\workspace\ven-archetype_ARCHETYPE-553-J4FOCNZGBVSFDFI4P3DBC7GXGJK62NFN5QH7Q5I46GZ5AP3FIVLQ\windows-jdk7-m3.3.x_build\archetype-testing\archetype-final\target\test-classes\projects\include-file-with-no-extension\target\generated-sources\archetype"): CreateProcess error=267, The directory name is invalid
	at org.apache.maven.archetype.creator.DefaultArchetypeCreatorIT.createFilesetArchetype(DefaultArchetypeCreatorIT.java:136)
	at org.apache.maven.archetype.creator.DefaultArchetypeCreatorIT.testIncludeFileWithNoExtension(DefaultArchetypeCreatorIT.java:189)
Caused by: java.io.IOException: CreateProcess error=267, The directory name is invalid
	at org.apache.maven.archetype.creator.DefaultArchetypeCreatorIT.createFilesetArchetype(DefaultArchetypeCreatorIT.java:136)
	at org.apache.maven.archetype.creator.DefaultArchetypeCreatorIT.testIncludeFileWithNoExtension(DefaultArchetypeCreatorIT.java:189)


FAILED:  org.apache.maven.archetype.creator.DefaultArchetypeCreatorIT.testSystemPropertiesAreIncluded

Error Message:
Error while executing process.

Stack Trace:
org.codehaus.plexus.util.cli.CommandLineException: Error while executing process.
	at org.apache.maven.archetype.creator.DefaultArchetypeCreatorIT.createFilesetArchetype(DefaultArchetypeCreatorIT.java:136)
	at org.apache.maven.archetype.creator.DefaultArchetypeCreatorIT.testSystemPropertiesAreIncluded(DefaultArchetypeCreatorIT.java:200)
Caused by: java.io.IOException: Cannot run program "F:\jenkins\tools\maven\apache-maven-3.3.9\bin\mvn.cmd" (in directory "F:\jenkins\jenkins-slave\workspace\ven-archetype_ARCHETYPE-553-J4FOCNZGBVSFDFI4P3DBC7GXGJK62NFN5QH7Q5I46GZ5AP3FIVLQ\windows-jdk7-m3.3.x_build\archetype-testing\archetype-final\target\test-classes\projects\included-system-properties\target\generated-sources\archetype"): CreateProcess error=267, The directory name is invalid
	at org.apache.maven.archetype.creator.DefaultArchetypeCreatorIT.createFilesetArchetype(DefaultArchetypeCreatorIT.java:136)
	at org.apache.maven.archetype.creator.DefaultArchetypeCreatorIT.testSystemPropertiesAreIncluded(DefaultArchetypeCreatorIT.java:200)
Caused by: java.io.IOException: CreateProcess error=267, The directory name is invalid
	at org.apache.maven.archetype.creator.DefaultArchetypeCreatorIT.createFilesetArchetype(DefaultArchetypeCreatorIT.java:136)
	at org.apache.maven.archetype.creator.DefaultArchetypeCreatorIT.testSystemPropertiesAreIncluded(DefaultArchetypeCreatorIT.java:200)


FAILED:  org.apache.maven.archetype.creator.DefaultArchetypeCreatorIT.testChangeJavaFilenameWhenCustomPropertyEqualsClassName

Error Message:
Error while executing process.

Stack Trace:
org.codehaus.plexus.util.cli.CommandLineException: Error while executing process.
	at org.apache.maven.archetype.creator.DefaultArchetypeCreatorIT.createFilesetArchetype(DefaultArchetypeCreatorIT.java:136)
	at org.apache.maven.archetype.creator.DefaultArchetypeCreatorIT.testChangeJavaFilenameWhenCustomPropertyEqualsClassName(DefaultArchetypeCreatorIT.java:151)
Caused by: java.io.IOException: Cannot run program "F:\jenkins\tools\maven\apache-maven-3.3.9\bin\mvn.cmd" (in directory "F:\jenkins\jenkins-slave\workspace\ven-archetype_ARCHETYPE-553-J4FOCNZGBVSFDFI4P3DBC7GXGJK62NFN5QH7Q5I46GZ5AP3FIVLQ\windows-jdk7-m3.3.x_build\archetype-testing\archetype-final\target\test-classes\projects\change-file-with-property\target\generated-sources\archetype"): CreateProcess error=267, The directory name is invalid
	at org.apache.maven.archetype.creator.DefaultArchetypeCreatorIT.createFilesetArchetype(DefaultArchetypeCreatorIT.java:136)
	at org.apache.maven.archetype.creator.DefaultArchetypeCreatorIT.testChangeJavaFilenameWhenCustomPropertyEqualsClassName(DefaultArchetypeCreatorIT.java:151)
Caused by: java.io.IOException: CreateProcess error=267, The directory name is invalid
	at org.apache.maven.archetype.creator.DefaultArchetypeCreatorIT.createFilesetArchetype(DefaultArchetypeCreatorIT.java:136)
	at org.apache.maven.archetype.creator.DefaultArchetypeCreatorIT.testChangeJavaFilenameWhenCustomPropertyEqualsClassName(DefaultArchetypeCreatorIT.java:151)


FAILED:  org.apache.maven.archetype.creator.DefaultArchetypeCreatorIT.testIncludeFileWithNoExtension

Error Message:
Error while executing process.

Stack Trace:
org.codehaus.plexus.util.cli.CommandLineException: Error while executing process.
	at org.apache.maven.archetype.creator.DefaultArchetypeCreatorIT.createFilesetArchetype(DefaultArchetypeCreatorIT.java:136)
	at org.apache.maven.archetype.creator.DefaultArchetypeCreatorIT.testIncludeFileWithNoExtension(DefaultArchetypeCreatorIT.java:189)
Caused by: java.io.IOException: Cannot run program "F:\jenkins\tools\maven\apache-maven-3.5.2\bin\mvn.cmd" (in directory "F:\jenkins\jenkins-slave\workspace\ven-archetype_ARCHETYPE-553-J4FOCNZGBVSFDFI4P3DBC7GXGJK62NFN5QH7Q5I46GZ5AP3FIVLQ\windows-jdk8-m3.5.x_build\archetype-testing\archetype-final\target\test-classes\projects\include-file-with-no-extension\target\generated-sources\archetype"): CreateProcess error=267, The directory name is invalid
	at org.apache.maven.archetype.creator.DefaultArchetypeCreatorIT.createFilesetArchetype(DefaultArchetypeCreatorIT.java:136)
	at org.apache.maven.archetype.creator.DefaultArchetypeCreatorIT.testIncludeFileWithNoExtension(DefaultArchetypeCreatorIT.java:189)
Caused by: java.io.IOException: CreateProcess error=267, The directory name is invalid
	at org.apache.maven.archetype.creator.DefaultArchetypeCreatorIT.createFilesetArchetype(DefaultArchetypeCreatorIT.java:136)
	at org.apache.maven.archetype.creator.DefaultArchetypeCreatorIT.testIncludeFileWithNoExtension(DefaultArchetypeCreatorIT.java:189)


FAILED:  org.apache.maven.archetype.creator.DefaultArchetypeCreatorIT.testSystemPropertiesAreIncluded

Error Message:
Error while executing process.

Stack Trace:
org.codehaus.plexus.util.cli.CommandLineException: Error while executing process.
	at org.apache.maven.archetype.creator.DefaultArchetypeCreatorIT.createFilesetArchetype(DefaultArchetypeCreatorIT.java:136)
	at org.apache.maven.archetype.creator.DefaultArchetypeCreatorIT.testSystemPropertiesAreIncluded(DefaultArchetypeCreatorIT.java:200)
Caused by: java.io.IOException: Cannot run program "F:\jenkins\tools\maven\apache-maven-3.5.2\bin\mvn.cmd" (in directory "F:\jenkins\jenkins-slave\workspace\ven-archetype_ARCHETYPE-553-J4FOCNZGBVSFDFI4P3DBC7GXGJK62NFN5QH7Q5I46GZ5AP3FIVLQ\windows-jdk8-m3.5.x_build\archetype-testing\archetype-final\target\test-classes\projects\included-system-properties\target\generated-sources\archetype"): CreateProcess error=267, The directory name is invalid
	at org.apache.maven.archetype.creator.DefaultArchetypeCreatorIT.createFilesetArchetype(DefaultArchetypeCreatorIT.java:136)
	at org.apache.maven.archetype.creator.DefaultArchetypeCreatorIT.testSystemPropertiesAreIncluded(DefaultArchetypeCreatorIT.java:200)
Caused by: java.io.IOException: CreateProcess error=267, The directory name is invalid
	at org.apache.maven.archetype.creator.DefaultArchetypeCreatorIT.createFilesetArchetype(DefaultArchetypeCreatorIT.java:136)
	at org.apache.maven.archetype.creator.DefaultArchetypeCreatorIT.testSystemPropertiesAreIncluded(DefaultArchetypeCreatorIT.java:200)


FAILED:  org.apache.maven.archetype.creator.DefaultArchetypeCreatorIT.testChangeJavaFilenameWhenCustomPropertyEqualsClassName

Error Message:
Error while executing process.

Stack Trace:
org.codehaus.plexus.util.cli.CommandLineException: Error while executing process.
	at org.apache.maven.archetype.creator.DefaultArchetypeCreatorIT.createFilesetArchetype(DefaultArchetypeCreatorIT.java:136)
	at org.apache.maven.archetype.creator.DefaultArchetypeCreatorIT.testChangeJavaFilenameWhenCustomPropertyEqualsClassName(DefaultArchetypeCreatorIT.java:151)
Caused by: java.io.IOException: Cannot run program "F:\jenkins\tools\maven\apache-maven-3.5.2\bin\mvn.cmd" (in directory "F:\jenkins\jenkins-slave\workspace\ven-archetype_ARCHETYPE-553-J4FOCNZGBVSFDFI4P3DBC7GXGJK62NFN5QH7Q5I46GZ5AP3FIVLQ\windows-jdk8-m3.5.x_build\archetype-testing\archetype-final\target\test-classes\projects\change-file-with-property\target\generated-sources\archetype"): CreateProcess error=267, The directory name is invalid
	at org.apache.maven.archetype.creator.DefaultArchetypeCreatorIT.createFilesetArchetype(DefaultArchetypeCreatorIT.java:136)
	at org.apache.maven.archetype.creator.DefaultArchetypeCreatorIT.testChangeJavaFilenameWhenCustomPropertyEqualsClassName(DefaultArchetypeCreatorIT.java:151)
Caused by: java.io.IOException: CreateProcess error=267, The directory name is invalid
	at org.apache.maven.archetype.creator.DefaultArchetypeCreatorIT.createFilesetArchetype(DefaultArchetypeCreatorIT.java:136)
	at org.apache.maven.archetype.creator.DefaultArchetypeCreatorIT.testChangeJavaFilenameWhenCustomPropertyEqualsClassName(DefaultArchetypeCreatorIT.java:151)


FAILED:  org.apache.maven.archetype.creator.DefaultArchetypeCreatorIT.testIncludeFileWithNoExtension

Error Message:
Error while executing process.

Stack Trace:
org.codehaus.plexus.util.cli.CommandLineException: Error while executing process.
	at org.apache.maven.archetype.creator.DefaultArchetypeCreatorIT.createFilesetArchetype(DefaultArchetypeCreatorIT.java:136)
	at org.apache.maven.archetype.creator.DefaultArchetypeCreatorIT.testIncludeFileWithNoExtension(DefaultArchetypeCreatorIT.java:189)
Caused by: java.io.IOException: Cannot run program "F:\jenkins\tools\maven\apache-maven-3.5.2\bin\mvn.cmd" (in directory "F:\jenkins\jenkins-slave\workspace\ven-archetype_ARCHETYPE-553-J4FOCNZGBVSFDFI4P3DBC7GXGJK62NFN5QH7Q5I46GZ5AP3FIVLQ@2\windows-jdk11-m3.5.x_build\archetype-testing\archetype-final\target\test-classes\projects\include-file-with-no-extension\target\generated-sources\archetype"): CreateProcess error=267, The directory name is invalid
	at org.apache.maven.archetype.creator.DefaultArchetypeCreatorIT.createFilesetArchetype(DefaultArchetypeCreatorIT.java:136)
	at org.apache.maven.archetype.creator.DefaultArchetypeCreatorIT.testIncludeFileWithNoExtension(DefaultArchetypeCreatorIT.java:189)
Caused by: java.io.IOException: CreateProcess error=267, The directory name is invalid
	at org.apache.maven.archetype.creator.DefaultArchetypeCreatorIT.createFilesetArchetype(DefaultArchetypeCreatorIT.java:136)
	at org.apache.maven.archetype.creator.DefaultArchetypeCreatorIT.testIncludeFileWithNoExtension(DefaultArchetypeCreatorIT.java:189)


FAILED:  org.apache.maven.archetype.creator.DefaultArchetypeCreatorIT.testSystemPropertiesAreIncluded

Error Message:
Error while executing process.

Stack Trace:
org.codehaus.plexus.util.cli.CommandLineException: Error while executing process.
	at org.apache.maven.archetype.creator.DefaultArchetypeCreatorIT.createFilesetArchetype(DefaultArchetypeCreatorIT.java:136)
	at org.apache.maven.archetype.creator.DefaultArchetypeCreatorIT.testSystemPropertiesAreIncluded(DefaultArchetypeCreatorIT.java:200)
Caused by: java.io.IOException: Cannot run program "F:\jenkins\tools\maven\apache-maven-3.5.2\bin\mvn.cmd" (in directory "F:\jenkins\jenkins-slave\workspace\ven-archetype_ARCHETYPE-553-J4FOCNZGBVSFDFI4P3DBC7GXGJK62NFN5QH7Q5I46GZ5AP3FIVLQ@2\windows-jdk11-m3.5.x_build\archetype-testing\archetype-final\target\test-classes\projects\included-system-properties\target\generated-sources\archetype"): CreateProcess error=267, The directory name is invalid
	at org.apache.maven.archetype.creator.DefaultArchetypeCreatorIT.createFilesetArchetype(DefaultArchetypeCreatorIT.java:136)
	at org.apache.maven.archetype.creator.DefaultArchetypeCreatorIT.testSystemPropertiesAreIncluded(DefaultArchetypeCreatorIT.java:200)
Caused by: java.io.IOException: CreateProcess error=267, The directory name is invalid
	at org.apache.maven.archetype.creator.DefaultArchetypeCreatorIT.createFilesetArchetype(DefaultArchetypeCreatorIT.java:136)
	at org.apache.maven.archetype.creator.DefaultArchetypeCreatorIT.testSystemPropertiesAreIncluded(DefaultArchetypeCreatorIT.java:200)


FAILED:  org.apache.maven.archetype.creator.DefaultArchetypeCreatorIT.testExcludePatternsMustExcludeDirectory

Error Message:
Error while executing process.

Stack Trace:
org.codehaus.plexus.util.cli.CommandLineException: Error while executing process.
	at org.apache.maven.archetype.creator.DefaultArchetypeCreatorIT.createFilesetArchetype(DefaultArchetypeCreatorIT.java:136)
	at org.apache.maven.archetype.creator.DefaultArchetypeCreatorIT.testExcludePatternsMustExcludeDirectory(DefaultArchetypeCreatorIT.java:163)
Caused by: java.io.IOException: Cannot run program "F:\jenkins\tools\maven\apache-maven-3.5.2\bin\mvn.cmd" (in directory "F:\jenkins\jenkins-slave\workspace\ven-archetype_ARCHETYPE-553-J4FOCNZGBVSFDFI4P3DBC7GXGJK62NFN5QH7Q5I46GZ5AP3FIVLQ@2\windows-jdk11-m3.5.x_build\archetype-testing\archetype-final\target\test-classes\projects\exclude-patterns\target\generated-sources\archetype"): CreateProcess error=267, The directory name is invalid
	at org.apache.maven.archetype.creator.DefaultArchetypeCreatorIT.createFilesetArchetype(DefaultArchetypeCreatorIT.java:136)
	at org.apache.maven.archetype.creator.DefaultArchetypeCreatorIT.testExcludePatternsMustExcludeDirectory(DefaultArchetypeCreatorIT.java:163)
Caused by: java.io.IOException: CreateProcess error=267, The directory name is invalid
	at org.apache.maven.archetype.creator.DefaultArchetypeCreatorIT.createFilesetArchetype(DefaultArchetypeCreatorIT.java:136)
	at org.apache.maven.archetype.creator.DefaultArchetypeCreatorIT.testExcludePatternsMustExcludeDirectory(DefaultArchetypeCreatorIT.java:163)


FAILED:  org.apache.maven.archetype.creator.DefaultArchetypeCreatorIT.testExcludePatternsContainingFilesSameExtension

Error Message:
Error while executing process.

Stack Trace:
org.codehaus.plexus.util.cli.CommandLineException: Error while executing process.
	at org.apache.maven.archetype.creator.DefaultArchetypeCreatorIT.createFilesetArchetype(DefaultArchetypeCreatorIT.java:136)
	at org.apache.maven.archetype.creator.DefaultArchetypeCreatorIT.testExcludePatternsContainingFilesSameExtension(DefaultArchetypeCreatorIT.java:177)
Caused by: java.io.IOException: Cannot run program "F:\jenkins\tools\maven\apache-maven-3.5.2\bin\mvn.cmd" (in directory "F:\jenkins\jenkins-slave\workspace\ven-archetype_ARCHETYPE-553-J4FOCNZGBVSFDFI4P3DBC7GXGJK62NFN5QH7Q5I46GZ5AP3FIVLQ@2\windows-jdk11-m3.5.x_build\archetype-testing\archetype-final\target\test-classes\projects\exclude-patterns-2\target\generated-sources\archetype"): CreateProcess error=267, The directory name is invalid
	at org.apache.maven.archetype.creator.DefaultArchetypeCreatorIT.createFilesetArchetype(DefaultArchetypeCreatorIT.java:136)
	at org.apache.maven.archetype.creator.DefaultArchetypeCreatorIT.testExcludePatternsContainingFilesSameExtension(DefaultArchetypeCreatorIT.java:177)
Caused by: java.io.IOException: CreateProcess error=267, The directory name is invalid
	at org.apache.maven.archetype.creator.DefaultArchetypeCreatorIT.createFilesetArchetype(DefaultArchetypeCreatorIT.java:136)
	at org.apache.maven.archetype.creator.DefaultArchetypeCreatorIT.testExcludePatternsContainingFilesSameExtension(DefaultArchetypeCreatorIT.java:177)


FAILED:  org.apache.maven.archetype.creator.DefaultArchetypeCreatorIT.testChangeJavaFilenameWhenCustomPropertyEqualsClassName

Error Message:
Error while executing process.

Stack Trace:
org.codehaus.plexus.util.cli.CommandLineException: Error while executing process.
	at org.apache.maven.archetype.creator.DefaultArchetypeCreatorIT.createFilesetArchetype(DefaultArchetypeCreatorIT.java:136)
	at org.apache.maven.archetype.creator.DefaultArchetypeCreatorIT.testChangeJavaFilenameWhenCustomPropertyEqualsClassName(DefaultArchetypeCreatorIT.java:151)
Caused by: java.io.IOException: Cannot run program "F:\jenkins\tools\maven\apache-maven-3.5.2\bin\mvn.cmd" (in directory "F:\jenkins\jenkins-slave\workspace\ven-archetype_ARCHETYPE-553-J4FOCNZGBVSFDFI4P3DBC7GXGJK62NFN5QH7Q5I46GZ5AP3FIVLQ@2\windows-jdk11-m3.5.x_build\archetype-testing\archetype-final\target\test-classes\projects\change-file-with-property\target\generated-sources\archetype"): CreateProcess error=267, The directory name is invalid
	at org.apache.maven.archetype.creator.DefaultArchetypeCreatorIT.createFilesetArchetype(DefaultArchetypeCreatorIT.java:136)
	at org.apache.maven.archetype.creator.DefaultArchetypeCreatorIT.testChangeJavaFilenameWhenCustomPropertyEqualsClassName(DefaultArchetypeCreatorIT.java:151)
Caused by: java.io.IOException: CreateProcess error=267, The directory name is invalid
	at org.apache.maven.archetype.creator.DefaultArchetypeCreatorIT.createFilesetArchetype(DefaultArchetypeCreatorIT.java:136)
	at org.apache.maven.archetype.creator.DefaultArchetypeCreatorIT.testChangeJavaFilenameWhenCustomPropertyEqualsClassName(DefaultArchetypeCreatorIT.java:151)


FAILED:  org.apache.maven.archetype.creator.DefaultArchetypeCreatorIT.testIncludeFileWithNoExtension

Error Message:
Error while executing process.

Stack Trace:
org.codehaus.plexus.util.cli.CommandLineException: Error while executing process.
	at org.apache.maven.archetype.creator.DefaultArchetypeCreatorIT.createFilesetArchetype(DefaultArchetypeCreatorIT.java:136)
	at org.apache.maven.archetype.creator.DefaultArchetypeCreatorIT.testIncludeFileWithNoExtension(DefaultArchetypeCreatorIT.java:189)
Caused by: java.io.IOException: Cannot run program "F:\jenkins\tools\maven\apache-maven-3.5.2\bin\mvn.cmd" (in directory "F:\jenkins\jenkins-slave\workspace\ven-archetype_ARCHETYPE-553-J4FOCNZGBVSFDFI4P3DBC7GXGJK62NFN5QH7Q5I46GZ5AP3FIVLQ\windows-jdk7-m3.5.x_build\archetype-testing\archetype-final\target\test-classes\projects\include-file-with-no-extension\target\generated-sources\archetype"): CreateProcess error=267, The directory name is invalid
	at org.apache.maven.archetype.creator.DefaultArchetypeCreatorIT.createFilesetArchetype(DefaultArchetypeCreatorIT.java:136)
	at org.apache.maven.archetype.creator.DefaultArchetypeCreatorIT.testIncludeFileWithNoExtension(DefaultArchetypeCreatorIT.java:189)
Caused by: java.io.IOException: CreateProcess error=267, The directory name is invalid
	at org.apache.maven.archetype.creator.DefaultArchetypeCreatorIT.createFilesetArchetype(DefaultArchetypeCreatorIT.java:136)
	at org.apache.maven.archetype.creator.DefaultArchetypeCreatorIT.testIncludeFileWithNoExtension(DefaultArchetypeCreatorIT.java:189)


FAILED:  org.apache.maven.archetype.creator.DefaultArchetypeCreatorIT.testSystemPropertiesAreIncluded

Error Message:
Error while executing process.

Stack Trace:
org.codehaus.plexus.util.cli.CommandLineException: Error while executing process.
	at org.apache.maven.archetype.creator.DefaultArchetypeCreatorIT.createFilesetArchetype(DefaultArchetypeCreatorIT.java:136)
	at org.apache.maven.archetype.creator.DefaultArchetypeCreatorIT.testSystemPropertiesAreIncluded(DefaultArchetypeCreatorIT.java:200)
Caused by: java.io.IOException: Cannot run program "F:\jenkins\tools\maven\apache-maven-3.5.2\bin\mvn.cmd" (in directory "F:\jenkins\jenkins-slave\workspace\ven-archetype_ARCHETYPE-553-J4FOCNZGBVSFDFI4P3DBC7GXGJK62NFN5QH7Q5I46GZ5AP3FIVLQ\windows-jdk7-m3.5.x_build\archetype-testing\archetype-final\target\test-classes\projects\included-system-properties\target\generated-sources\archetype"): CreateProcess error=267, The directory name is invalid
	at org.apache.maven.archetype.creator.DefaultArchetypeCreatorIT.createFilesetArchetype(DefaultArchetypeCreatorIT.java:136)
	at org.apache.maven.archetype.creator.DefaultArchetypeCreatorIT.testSystemPropertiesAreIncluded(DefaultArchetypeCreatorIT.java:200)
Caused by: java.io.IOException: CreateProcess error=267, The directory name is invalid
	at org.apache.maven.archetype.creator.DefaultArchetypeCreatorIT.createFilesetArchetype(DefaultArchetypeCreatorIT.java:136)
	at org.apache.maven.archetype.creator.DefaultArchetypeCreatorIT.testSystemPropertiesAreIncluded(DefaultArchetypeCreatorIT.java:200)


FAILED:  org.apache.maven.archetype.creator.DefaultArchetypeCreatorIT.testChangeJavaFilenameWhenCustomPropertyEqualsClassName

Error Message:
Error while executing process.

Stack Trace:
org.codehaus.plexus.util.cli.CommandLineException: Error while executing process.
	at org.apache.maven.archetype.creator.DefaultArchetypeCreatorIT.createFilesetArchetype(DefaultArchetypeCreatorIT.java:136)
	at org.apache.maven.archetype.creator.DefaultArchetypeCreatorIT.testChangeJavaFilenameWhenCustomPropertyEqualsClassName(DefaultArchetypeCreatorIT.java:151)
Caused by: java.io.IOException: Cannot run program "F:\jenkins\tools\maven\apache-maven-3.5.2\bin\mvn.cmd" (in directory "F:\jenkins\jenkins-slave\workspace\ven-archetype_ARCHETYPE-553-J4FOCNZGBVSFDFI4P3DBC7GXGJK62NFN5QH7Q5I46GZ5AP3FIVLQ\windows-jdk7-m3.5.x_build\archetype-testing\archetype-final\target\test-classes\projects\change-file-with-property\target\generated-sources\archetype"): CreateProcess error=267, The directory name is invalid
	at org.apache.maven.archetype.creator.DefaultArchetypeCreatorIT.createFilesetArchetype(DefaultArchetypeCreatorIT.java:136)
	at org.apache.maven.archetype.creator.DefaultArchetypeCreatorIT.testChangeJavaFilenameWhenCustomPropertyEqualsClassName(DefaultArchetypeCreatorIT.java:151)
Caused by: java.io.IOException: CreateProcess error=267, The directory name is invalid
	at org.apache.maven.archetype.creator.DefaultArchetypeCreatorIT.createFilesetArchetype(DefaultArchetypeCreatorIT.java:136)
	at org.apache.maven.archetype.creator.DefaultArchetypeCreatorIT.testChangeJavaFilenameWhenCustomPropertyEqualsClassName(DefaultArchetypeCreatorIT.java:151)


FAILED:  org.apache.maven.archetype.test.ArchetyperRoundtripIT.testArchetyper

Error Message:
Error while executing process.

Stack Trace:
org.codehaus.plexus.util.cli.CommandLineException: Error while executing process.
	at org.apache.maven.archetype.test.ArchetyperRoundtripIT.testArchetyper(ArchetyperRoundtripIT.java:121)
Caused by: java.io.IOException: Cannot run program "F:\jenkins\tools\maven\apache-maven-3.2.5\bin\mvn.bat" (in directory "F:\jenkins\jenkins-slave\workspace\ven-archetype_ARCHETYPE-553-J4FOCNZGBVSFDFI4P3DBC7GXGJK62NFN5QH7Q5I46GZ5AP3FIVLQ\windows-jdk7-m3.2.x_build\archetype-testing\archetype-final\target\test-classes\projects\roundtrip-1-project\target\generated-sources\archetype"): CreateProcess error=267, The directory name is invalid
	at org.apache.maven.archetype.test.ArchetyperRoundtripIT.testArchetyper(ArchetyperRoundtripIT.java:121)
Caused by: java.io.IOException: CreateProcess error=267, The directory name is invalid
	at org.apache.maven.archetype.test.ArchetyperRoundtripIT.testArchetyper(ArchetyperRoundtripIT.java:121)


FAILED:  org.apache.maven.archetype.test.ArchetyperRoundtripIT.testArchetyper

Error Message:
Error while executing process.

Stack Trace:
org.codehaus.plexus.util.cli.CommandLineException: Error while executing process.
	at org.apache.maven.archetype.test.ArchetyperRoundtripIT.testArchetyper(ArchetyperRoundtripIT.java:121)
Caused by: java.io.IOException: Cannot run program "F:\jenkins\tools\maven\apache-maven-3.5.2\bin\mvn.cmd" (in directory "F:\jenkins\jenkins-slave\workspace\ven-archetype_ARCHETYPE-553-J4FOCNZGBVSFDFI4P3DBC7GXGJK62NFN5QH7Q5I46GZ5AP3FIVLQ@2\windows-jdk10-m3.5.x_build\archetype-testing\archetype-final\target\test-classes\projects\roundtrip-1-project\target\generated-sources\archetype"): CreateProcess error=267, The directory name is invalid
	at org.apache.maven.archetype.test.ArchetyperRoundtripIT.testArchetyper(ArchetyperRoundtripIT.java:121)
Caused by: java.io.IOException: CreateProcess error=267, The directory name is invalid
	at org.apache.maven.archetype.test.ArchetyperRoundtripIT.testArchetyper(ArchetyperRoundtripIT.java:121)


FAILED:  org.apache.maven.archetype.test.ArchetyperRoundtripIT.testArchetyper

Error Message:
Error while executing process.

Stack Trace:
org.codehaus.plexus.util.cli.CommandLineException: Error while executing process.
	at org.apache.maven.archetype.test.ArchetyperRoundtripIT.testArchetyper(ArchetyperRoundtripIT.java:121)
Caused by: java.io.IOException: Cannot run program "F:\jenkins\tools\maven\apache-maven-3.5.2\bin\mvn.cmd" (in directory "F:\jenkins\jenkins-slave\workspace\ven-archetype_ARCHETYPE-553-J4FOCNZGBVSFDFI4P3DBC7GXGJK62NFN5QH7Q5I46GZ5AP3FIVLQ\windows-jdk9-m3.5.x_build\archetype-testing\archetype-final\target\test-classes\projects\roundtrip-1-project\target\generated-sources\archetype"): CreateProcess error=267, The directory name is invalid
	at org.apache.maven.archetype.test.ArchetyperRoundtripIT.testArchetyper(ArchetyperRoundtripIT.java:121)
Caused by: java.io.IOException: CreateProcess error=267, The directory name is invalid
	at org.apache.maven.archetype.test.ArchetyperRoundtripIT.testArchetyper(ArchetyperRoundtripIT.java:121)


FAILED:  org.apache.maven.archetype.test.ArchetyperRoundtripIT.testArchetyper

Error Message:
Error while executing process.

Stack Trace:
org.codehaus.plexus.util.cli.CommandLineException: Error while executing process.
	at org.apache.maven.archetype.test.ArchetyperRoundtripIT.testArchetyper(ArchetyperRoundtripIT.java:121)
Caused by: java.io.IOException: Cannot run program "F:\jenkins\tools\maven\apache-maven-3.3.9\bin\mvn.cmd" (in directory "F:\jenkins\jenkins-slave\workspace\ven-archetype_ARCHETYPE-553-J4FOCNZGBVSFDFI4P3DBC7GXGJK62NFN5QH7Q5I46GZ5AP3FIVLQ\windows-jdk7-m3.3.x_build\archetype-testing\archetype-final\target\test-classes\projects\roundtrip-1-project\target\generated-sources\archetype"): CreateProcess error=267, The directory name is invalid
	at org.apache.maven.archetype.test.ArchetyperRoundtripIT.testArchetyper(ArchetyperRoundtripIT.java:121)
Caused by: java.io.IOException: CreateProcess error=267, The directory name is invalid
	at org.apache.maven.archetype.test.ArchetyperRoundtripIT.testArchetyper(ArchetyperRoundtripIT.java:121)


FAILED:  org.apache.maven.archetype.test.ArchetyperRoundtripIT.testArchetyper

Error Message:
Error while executing process.

Stack Trace:
org.codehaus.plexus.util.cli.CommandLineException: Error while executing process.
	at org.apache.maven.archetype.test.ArchetyperRoundtripIT.testArchetyper(ArchetyperRoundtripIT.java:121)
Caused by: java.io.IOException: Cannot run program "F:\jenkins\tools\maven\apache-maven-3.5.2\bin\mvn.cmd" (in directory "F:\jenkins\jenkins-slave\workspace\ven-archetype_ARCHETYPE-553-J4FOCNZGBVSFDFI4P3DBC7GXGJK62NFN5QH7Q5I46GZ5AP3FIVLQ\windows-jdk8-m3.5.x_build\archetype-testing\archetype-final\target\test-classes\projects\roundtrip-1-project\target\generated-sources\archetype"): CreateProcess error=267, The directory name is invalid
	at org.apache.maven.archetype.test.ArchetyperRoundtripIT.testArchetyper(ArchetyperRoundtripIT.java:121)
Caused by: java.io.IOException: CreateProcess error=267, The directory name is invalid
	at org.apache.maven.archetype.test.ArchetyperRoundtripIT.testArchetyper(ArchetyperRoundtripIT.java:121)


FAILED:  org.apache.maven.archetype.test.ArchetyperRoundtripIT.testArchetyper

Error Message:
Error while executing process.

Stack Trace:
org.codehaus.plexus.util.cli.CommandLineException: Error while executing process.
	at org.apache.maven.archetype.test.ArchetyperRoundtripIT.testArchetyper(ArchetyperRoundtripIT.java:121)
Caused by: java.io.IOException: Cannot run program "F:\jenkins\tools\maven\apache-maven-3.5.2\bin\mvn.cmd" (in directory "F:\jenkins\jenkins-slave\workspace\ven-archetype_ARCHETYPE-553-J4FOCNZGBVSFDFI4P3DBC7GXGJK62NFN5QH7Q5I46GZ5AP3FIVLQ@2\windows-jdk11-m3.5.x_build\archetype-testing\archetype-final\target\test-classes\projects\roundtrip-1-project\target\generated-sources\archetype"): CreateProcess error=267, The directory name is invalid
	at org.apache.maven.archetype.test.ArchetyperRoundtripIT.testArchetyper(ArchetyperRoundtripIT.java:121)
Caused by: java.io.IOException: CreateProcess error=267, The directory name is invalid
	at org.apache.maven.archetype.test.ArchetyperRoundtripIT.testArchetyper(ArchetyperRoundtripIT.java:121)


FAILED:  org.apache.maven.archetype.test.ArchetyperRoundtripIT.testArchetyper

Error Message:
Error while executing process.

Stack Trace:
org.codehaus.plexus.util.cli.CommandLineException: Error while executing process.
	at org.apache.maven.archetype.test.ArchetyperRoundtripIT.testArchetyper(ArchetyperRoundtripIT.java:121)
Caused by: java.io.IOException: Cannot run program "F:\jenkins\tools\maven\apache-maven-3.5.2\bin\mvn.cmd" (in directory "F:\jenkins\jenkins-slave\workspace\ven-archetype_ARCHETYPE-553-J4FOCNZGBVSFDFI4P3DBC7GXGJK62NFN5QH7Q5I46GZ5AP3FIVLQ\windows-jdk7-m3.5.x_build\archetype-testing\archetype-final\target\test-classes\projects\roundtrip-1-project\target\generated-sources\archetype"): CreateProcess error=267, The directory name is invalid
	at org.apache.maven.archetype.test.ArchetyperRoundtripIT.testArchetyper(ArchetyperRoundtripIT.java:121)
Caused by: java.io.IOException: CreateProcess error=267, The directory name is invalid
	at org.apache.maven.archetype.test.ArchetyperRoundtripIT.testArchetyper(ArchetyperRoundtripIT.java:121)


FAILED:  org.apache.maven.archetype.test.ArchetyperRoundtripWithProxyIT.testArchetyper

Error Message:
Error while executing process.

Stack Trace:
org.codehaus.plexus.util.cli.CommandLineException: Error while executing process.
	at org.apache.maven.archetype.test.ArchetyperRoundtripWithProxyIT.testArchetyper(ArchetyperRoundtripWithProxyIT.java:126)
Caused by: java.io.IOException: Cannot run program "F:\jenkins\tools\maven\apache-maven-3.2.5\bin\mvn.bat" (in directory "F:\jenkins\jenkins-slave\workspace\ven-archetype_ARCHETYPE-553-J4FOCNZGBVSFDFI4P3DBC7GXGJK62NFN5QH7Q5I46GZ5AP3FIVLQ\windows-jdk7-m3.2.x_build\archetype-testing\archetype-final\target\test-classes\projects\roundtrip-2-project\target\generated-sources\archetype"): CreateProcess error=267, The directory name is invalid
	at org.apache.maven.archetype.test.ArchetyperRoundtripWithProxyIT.testArchetyper(ArchetyperRoundtripWithProxyIT.java:126)
Caused by: java.io.IOException: CreateProcess error=267, The directory name is invalid
	at org.apache.maven.archetype.test.ArchetyperRoundtripWithProxyIT.testArchetyper(ArchetyperRoundtripWithProxyIT.java:126)


FAILED:  org.apache.maven.archetype.test.ArchetyperRoundtripWithProxyIT.testArchetyper

Error Message:
Error while executing process.

Stack Trace:
org.codehaus.plexus.util.cli.CommandLineException: Error while executing process.
	at org.apache.maven.archetype.test.ArchetyperRoundtripWithProxyIT.testArchetyper(ArchetyperRoundtripWithProxyIT.java:126)
Caused by: java.io.IOException: Cannot run program "F:\jenkins\tools\maven\apache-maven-3.5.2\bin\mvn.cmd" (in directory "F:\jenkins\jenkins-slave\workspace\ven-archetype_ARCHETYPE-553-J4FOCNZGBVSFDFI4P3DBC7GXGJK62NFN5QH7Q5I46GZ5AP3FIVLQ@2\windows-jdk10-m3.5.x_build\archetype-testing\archetype-final\target\test-classes\projects\roundtrip-2-project\target\generated-sources\archetype"): CreateProcess error=267, The directory name is invalid
	at org.apache.maven.archetype.test.ArchetyperRoundtripWithProxyIT.testArchetyper(ArchetyperRoundtripWithProxyIT.java:126)
Caused by: java.io.IOException: CreateProcess error=267, The directory name is invalid
	at org.apache.maven.archetype.test.ArchetyperRoundtripWithProxyIT.testArchetyper(ArchetyperRoundtripWithProxyIT.java:126)


FAILED:  org.apache.maven.archetype.test.ArchetyperRoundtripWithProxyIT.testArchetyper

Error Message:
Error while executing process.

Stack Trace:
org.codehaus.plexus.util.cli.CommandLineException: Error while executing process.
	at org.apache.maven.archetype.test.ArchetyperRoundtripWithProxyIT.testArchetyper(ArchetyperRoundtripWithProxyIT.java:126)
Caused by: java.io.IOException: Cannot run program "F:\jenkins\tools\maven\apache-maven-3.5.2\bin\mvn.cmd" (in directory "F:\jenkins\jenkins-slave\workspace\ven-archetype_ARCHETYPE-553-J4FOCNZGBVSFDFI4P3DBC7GXGJK62NFN5QH7Q5I46GZ5AP3FIVLQ\windows-jdk9-m3.5.x_build\archetype-testing\archetype-final\target\test-classes\projects\roundtrip-2-project\target\generated-sources\archetype"): CreateProcess error=267, The directory name is invalid
	at org.apache.maven.archetype.test.ArchetyperRoundtripWithProxyIT.testArchetyper(ArchetyperRoundtripWithProxyIT.java:126)
Caused by: java.io.IOException: CreateProcess error=267, The directory name is invalid
	at org.apache.maven.archetype.test.ArchetyperRoundtripWithProxyIT.testArchetyper(ArchetyperRoundtripWithProxyIT.java:126)


FAILED:  org.apache.maven.archetype.test.ArchetyperRoundtripWithProxyIT.testArchetyper

Error Message:
Error while executing process.

Stack Trace:
org.codehaus.plexus.util.cli.CommandLineException: Error while executing process.
	at org.apache.maven.archetype.test.ArchetyperRoundtripWithProxyIT.testArchetyper(ArchetyperRoundtripWithProxyIT.java:126)
Caused by: java.io.IOException: Cannot run program "F:\jenkins\tools\maven\apache-maven-3.3.9\bin\mvn.cmd" (in directory "F:\jenkins\jenkins-slave\workspace\ven-archetype_ARCHETYPE-553-J4FOCNZGBVSFDFI4P3DBC7GXGJK62NFN5QH7Q5I46GZ5AP3FIVLQ\windows-jdk7-m3.3.x_build\archetype-testing\archetype-final\target\test-classes\projects\roundtrip-2-project\target\generated-sources\archetype"): CreateProcess error=267, The directory name is invalid
	at org.apache.maven.archetype.test.ArchetyperRoundtripWithProxyIT.testArchetyper(ArchetyperRoundtripWithProxyIT.java:126)
Caused by: java.io.IOException: CreateProcess error=267, The directory name is invalid
	at org.apache.maven.archetype.test.ArchetyperRoundtripWithProxyIT.testArchetyper(ArchetyperRoundtripWithProxyIT.java:126)


FAILED:  org.apache.maven.archetype.test.ArchetyperRoundtripWithProxyIT.testArchetyper

Error Message:
Error while executing process.

Stack Trace:
org.codehaus.plexus.util.cli.CommandLineException: Error while executing process.
	at org.apache.maven.archetype.test.ArchetyperRoundtripWithProxyIT.testArchetyper(ArchetyperRoundtripWithProxyIT.java:126)
Caused by: java.io.IOException: Cannot run program "F:\jenkins\tools\maven\apache-maven-3.5.2\bin\mvn.cmd" (in directory "F:\jenkins\jenkins-slave\workspace\ven-archetype_ARCHETYPE-553-J4FOCNZGBVSFDFI4P3DBC7GXGJK62NFN5QH7Q5I46GZ5AP3FIVLQ\windows-jdk8-m3.5.x_build\archetype-testing\archetype-final\target\test-classes\projects\roundtrip-2-project\target\generated-sources\archetype"): CreateProcess error=267, The directory name is invalid
	at org.apache.maven.archetype.test.ArchetyperRoundtripWithProxyIT.testArchetyper(ArchetyperRoundtripWithProxyIT.java:126)
Caused by: java.io.IOException: CreateProcess error=267, The directory name is invalid
	at org.apache.maven.archetype.test.ArchetyperRoundtripWithProxyIT.testArchetyper(ArchetyperRoundtripWithProxyIT.java:126)


FAILED:  org.apache.maven.archetype.test.ArchetyperRoundtripWithProxyIT.testArchetyper

Error Message:
Error while executing process.

Stack Trace:
org.codehaus.plexus.util.cli.CommandLineException: Error while executing process.
	at org.apache.maven.archetype.test.ArchetyperRoundtripWithProxyIT.testArchetyper(ArchetyperRoundtripWithProxyIT.java:126)
Caused by: java.io.IOException: Cannot run program "F:\jenkins\tools\maven\apache-maven-3.5.2\bin\mvn.cmd" (in directory "F:\jenkins\jenkins-slave\workspace\ven-archetype_ARCHETYPE-553-J4FOCNZGBVSFDFI4P3DBC7GXGJK62NFN5QH7Q5I46GZ5AP3FIVLQ@2\windows-jdk11-m3.5.x_build\archetype-testing\archetype-final\target\test-classes\projects\roundtrip-2-project\target\generated-sources\archetype"): CreateProcess error=267, The directory name is invalid
	at org.apache.maven.archetype.test.ArchetyperRoundtripWithProxyIT.testArchetyper(ArchetyperRoundtripWithProxyIT.java:126)
Caused by: java.io.IOException: CreateProcess error=267, The directory name is invalid
	at org.apache.maven.archetype.test.ArchetyperRoundtripWithProxyIT.testArchetyper(ArchetyperRoundtripWithProxyIT.java:126)


FAILED:  org.apache.maven.archetype.test.ArchetyperRoundtripWithProxyIT.testArchetyper

Error Message:
Error while executing process.

Stack Trace:
org.codehaus.plexus.util.cli.CommandLineException: Error while executing process.
	at org.apache.maven.archetype.test.ArchetyperRoundtripWithProxyIT.testArchetyper(ArchetyperRoundtripWithProxyIT.java:126)
Caused by: java.io.IOException: Cannot run program "F:\jenkins\tools\maven\apache-maven-3.5.2\bin\mvn.cmd" (in directory "F:\jenkins\jenkins-slave\workspace\ven-archetype_ARCHETYPE-553-J4FOCNZGBVSFDFI4P3DBC7GXGJK62NFN5QH7Q5I46GZ5AP3FIVLQ\windows-jdk7-m3.5.x_build\archetype-testing\archetype-final\target\test-classes\projects\roundtrip-2-project\target\generated-sources\archetype"): CreateProcess error=267, The directory name is invalid
	at org.apache.maven.archetype.test.ArchetyperRoundtripWithProxyIT.testArchetyper(ArchetyperRoundtripWithProxyIT.java:126)
Caused by: java.io.IOException: CreateProcess error=267, The directory name is invalid
	at org.apache.maven.archetype.test.ArchetyperRoundtripWithProxyIT.testArchetyper(ArchetyperRoundtripWithProxyIT.java:126)




Build log:
[...truncated 9.76 MB...]
[linux-jdk11-m3.5.x_build]     public static void main( String[] args )
[linux-jdk11-m3.5.x_build]     {
[linux-jdk11-m3.5.x_build]         System.out.println( "Hello World!" );
[linux-jdk11-m3.5.x_build]         //A   #\{some}
[linux-jdk11-m3.5.x_build]         //B   #{some}
[linux-jdk11-m3.5.x_build]         //C   #{some other}
[linux-jdk11-m3.5.x_build]         //D   \#{some other}
[linux-jdk11-m3.5.x_build]         //E   #{}
[linux-jdk11-m3.5.x_build]         //F   {some}
[linux-jdk11-m3.5.x_build]         //G   ${someOtherProperty}
[linux-jdk11-m3.5.x_build]         //H   ${someValue}
[linux-jdk11-m3.5.x_build]         /*
[linux-jdk11-m3.5.x_build]         A   #\{some}
[linux-jdk11-m3.5.x_build]         B   #{some}
[linux-jdk11-m3.5.x_build]         C   #{some other}
[linux-jdk11-m3.5.x_build]         D   \#{some other}
[linux-jdk11-m3.5.x_build]         E   #{}
[linux-jdk11-m3.5.x_build]         F   {some}
[linux-jdk11-m3.5.x_build]         G   ${someOtherProperty}
[linux-jdk11-m3.5.x_build]         H   ${someValue}
[linux-jdk11-m3.5.x_build]          */
[linux-jdk11-m3.5.x_build]     }
[linux-jdk11-m3.5.x_build] }
[linux-jdk11-m3.5.x_build] 
[linux-jdk11-m3.5.x_build] Tests run: 1, Failures: 0, Errors: 0, Skipped: 0, Time elapsed: 3.945 sec - in org.apache.maven.archetype.test.ArchetyperRoundtripIT
[linux-jdk11-m3.5.x_build] Running org.apache.maven.archetype.test.RoundtripMultiModuleIT
[linux-jdk11-m3.5.x_build] Picked up JAVA_TOOL_OPTIONS: -Dmaven.ext.class.path="/home/jenkins/jenkins-slave/workspace/ven-archetype_ARCHETYPE-553-J4FOCNZGBVSFDFI4P3DBC7GXGJK62NFN5QH7Q5I46GZ5AP3FIVLQ@tmp/withMaven625f9c1d/pipeline-maven-spy.jar" -Dorg.jenkinsci.plugins.pipeline.maven.reportsFolder="/home/jenkins/jenkins-slave/workspace/ven-archetype_ARCHETYPE-553-J4FOCNZGBVSFDFI4P3DBC7GXGJK62NFN5QH7Q5I46GZ5AP3FIVLQ@tmp/withMaven625f9c1d" 
[linux-jdk11-m3.5.x_build] [INFO] [jenkins-event-spy] Jenkins Maven Event Spy is disabled
[linux-jdk11-m3.5.x_build] [INFO] Scanning for projects...
[linux-jdk11-m3.5.x_build] [INFO] 
[linux-jdk11-m3.5.x_build] [INFO] -------------------< com.company.proficio:proficio >--------------------
[linux-jdk11-m3.5.x_build] [INFO] Building proficio 1.0-SNAPSHOT
[linux-jdk11-m3.5.x_build] [INFO] --------------------------[ maven-archetype ]---------------------------
[linux-jdk11-m3.5.x_build] [INFO] 
[linux-jdk11-m3.5.x_build] [INFO] --- maven-resources-plugin:3.1.0:resources (default-resources) @ proficio ---
[linux-jdk11-m3.5.x_build] [WARNING] Using platform encoding (ISO-8859-1 actually) to copy filtered resources, i.e. build is platform dependent!
[linux-jdk11-m3.5.x_build] [INFO] Copying 30 resources
[linux-jdk11-m3.5.x_build] [INFO] 
[linux-jdk11-m3.5.x_build] [INFO] --- maven-resources-plugin:3.1.0:testResources (default-testResources) @ proficio ---
[linux-jdk11-m3.5.x_build] [WARNING] Using platform encoding (ISO-8859-1 actually) to copy filtered resources, i.e. build is platform dependent!
[linux-jdk11-m3.5.x_build] [INFO] Copying 2 resources
[linux-jdk11-m3.5.x_build] [INFO] 
[linux-jdk11-m3.5.x_build] [INFO] --- maven-archetype-plugin:3.0.2-SNAPSHOT:jar (default-jar) @ proficio ---
[linux-jdk11-m3.5.x_build] [INFO] Building archetype jar: /home/jenkins/jenkins-slave/workspace/ven-archetype_ARCHETYPE-553-J4FOCNZGBVSFDFI4P3DBC7GXGJK62NFN5QH7Q5I46GZ5AP3FIVLQ/linux-jdk11-m3.5.x_build/archetype-testing/archetype-final/target/test-classes/projects/roundtrip-multi/target/generated-sources/archetype/target/proficio-1.0-SNAPSHOT
[linux-jdk11-m3.5.x_build] [INFO] ------------------------------------------------------------------------
[linux-jdk11-m3.5.x_build] [INFO] BUILD SUCCESS
[linux-jdk11-m3.5.x_build] [INFO] ------------------------------------------------------------------------
[linux-jdk11-m3.5.x_build] [INFO] Total time: 1.494 s
[linux-jdk11-m3.5.x_build] [INFO] Finished at: 2018-10-03T20:07:37Z
[linux-jdk11-m3.5.x_build] [INFO] ------------------------------------------------------------------------
[linux-jdk11-m3.5.x_build] /home/jenkins/jenkins-slave/workspace/ven-archetype_ARCHETYPE-553-J4FOCNZGBVSFDFI4P3DBC7GXGJK62NFN5QH7Q5I46GZ5AP3FIVLQ/linux-jdk11-m3.5.x_build/archetype-testing/archetype-final/target/test-classes/projects/roundtrip-multi/target/generated-sources/archetype/src/main/resources/archetype-resources/__rootArtifactId__-core/.classpath
[linux-jdk11-m3.5.x_build] /home/jenkins/jenkins-slave/workspace/ven-archetype_ARCHETYPE-553-J4FOCNZGBVSFDFI4P3DBC7GXGJK62NFN5QH7Q5I46GZ5AP3FIVLQ/linux-jdk11-m3.5.x_build/archetype-testing/archetype-final/target/test-classes/projects/roundtrip-multi/target/generated-sources/archetype/src/main/resources/archetype-resources/__rootArtifactId__-core/.checkstyle
[linux-jdk11-m3.5.x_build] /home/jenkins/jenkins-slave/workspace/ven-archetype_ARCHETYPE-553-J4FOCNZGBVSFDFI4P3DBC7GXGJK62NFN5QH7Q5I46GZ5AP3FIVLQ/linux-jdk11-m3.5.x_build/archetype-testing/archetype-final/target/test-classes/projects/roundtrip-multi/target/generated-sources/archetype/src/main/resources/archetype-resources/__rootArtifactId__-core/src/main/java/core/Core.java
[linux-jdk11-m3.5.x_build] /home/jenkins/jenkins-slave/workspace/ven-archetype_ARCHETYPE-553-J4FOCNZGBVSFDFI4P3DBC7GXGJK62NFN5QH7Q5I46GZ5AP3FIVLQ/linux-jdk11-m3.5.x_build/archetype-testing/archetype-final/target/test-classes/projects/roundtrip-multi/target/generated-sources/archetype/src/main/resources/archetype-resources/__rootArtifactId__-core/pom.xml
[linux-jdk11-m3.5.x_build] /home/jenkins/jenkins-slave/workspace/ven-archetype_ARCHETYPE-553-J4FOCNZGBVSFDFI4P3DBC7GXGJK62NFN5QH7Q5I46GZ5AP3FIVLQ/linux-jdk11-m3.5.x_build/archetype-testing/archetype-final/target/test-classes/projects/roundtrip-multi/target/generated-sources/archetype/src/main/resources/archetype-resources/__rootArtifactId__-model/.classpath
[linux-jdk11-m3.5.x_build] /home/jenkins/jenkins-slave/workspace/ven-archetype_ARCHETYPE-553-J4FOCNZGBVSFDFI4P3DBC7GXGJK62NFN5QH7Q5I46GZ5AP3FIVLQ/linux-jdk11-m3.5.x_build/archetype-testing/archetype-final/target/test-classes/projects/roundtrip-multi/target/generated-sources/archetype/src/main/resources/archetype-resources/__rootArtifactId__-model/.checkstyle
[linux-jdk11-m3.5.x_build] /home/jenkins/jenkins-slave/workspace/ven-archetype_ARCHETYPE-553-J4FOCNZGBVSFDFI4P3DBC7GXGJK62NFN5QH7Q5I46GZ5AP3FIVLQ/linux-jdk11-m3.5.x_build/archetype-testing/archetype-final/target/test-classes/projects/roundtrip-multi/target/generated-sources/archetype/src/main/resources/archetype-resources/__rootArtifactId__-model/src/main/java/org/company/__parentArtifactId__/model/Model.java
[linux-jdk11-m3.5.x_build] /home/jenkins/jenkins-slave/workspace/ven-archetype_ARCHETYPE-553-J4FOCNZGBVSFDFI4P3DBC7GXGJK62NFN5QH7Q5I46GZ5AP3FIVLQ/linux-jdk11-m3.5.x_build/archetype-testing/archetype-final/target/test-classes/projects/roundtrip-multi/target/generated-sources/archetype/src/main/resources/archetype-resources/__rootArtifactId__-model/pom.xml
[linux-jdk11-m3.5.x_build] /home/jenkins/jenkins-slave/workspace/ven-archetype_ARCHETYPE-553-J4FOCNZGBVSFDFI4P3DBC7GXGJK62NFN5QH7Q5I46GZ5AP3FIVLQ/linux-jdk11-m3.5.x_build/archetype-testing/archetype-final/target/test-classes/projects/roundtrip-multi/target/generated-sources/archetype/src/main/resources/archetype-resources/.classpath
[linux-jdk11-m3.5.x_build] /home/jenkins/jenkins-slave/workspace/ven-archetype_ARCHETYPE-553-J4FOCNZGBVSFDFI4P3DBC7GXGJK62NFN5QH7Q5I46GZ5AP3FIVLQ/linux-jdk11-m3.5.x_build/archetype-testing/archetype-final/target/test-classes/projects/roundtrip-multi/target/generated-sources/archetype/src/main/resources/archetype-resources/.checkstyle
[linux-jdk11-m3.5.x_build] /home/jenkins/jenkins-slave/workspace/ven-archetype_ARCHETYPE-553-J4FOCNZGBVSFDFI4P3DBC7GXGJK62NFN5QH7Q5I46GZ5AP3FIVLQ/linux-jdk11-m3.5.x_build/archetype-testing/archetype-final/target/test-classes/projects/roundtrip-multi/target/generated-sources/archetype/src/main/resources/archetype-resources/src/site/site.xml
[linux-jdk11-m3.5.x_build] /home/jenkins/jenkins-slave/workspace/ven-archetype_ARCHETYPE-553-J4FOCNZGBVSFDFI4P3DBC7GXGJK62NFN5QH7Q5I46GZ5AP3FIVLQ/linux-jdk11-m3.5.x_build/archetype-testing/archetype-final/target/test-classes/projects/roundtrip-multi/target/generated-sources/archetype/src/main/resources/archetype-resources/__rootArtifactId__-stores/__rootArtifactId__-store-memory/.classpath
[linux-jdk11-m3.5.x_build] /home/jenkins/jenkins-slave/workspace/ven-archetype_ARCHETYPE-553-J4FOCNZGBVSFDFI4P3DBC7GXGJK62NFN5QH7Q5I46GZ5AP3FIVLQ/linux-jdk11-m3.5.x_build/archetype-testing/archetype-final/target/test-classes/projects/roundtrip-multi/target/generated-sources/archetype/src/main/resources/archetype-resources/__rootArtifactId__-stores/__rootArtifactId__-store-memory/.checkstyle
[linux-jdk11-m3.5.x_build] /home/jenkins/jenkins-slave/workspace/ven-archetype_ARCHETYPE-553-J4FOCNZGBVSFDFI4P3DBC7GXGJK62NFN5QH7Q5I46GZ5AP3FIVLQ/linux-jdk11-m3.5.x_build/archetype-testing/archetype-final/target/test-classes/projects/roundtrip-multi/target/generated-sources/archetype/src/main/resources/archetype-resources/__rootArtifactId__-stores/__rootArtifactId__-store-memory/src/main/java/store/memory/Memory.java
[linux-jdk11-m3.5.x_build] /home/jenkins/jenkins-slave/workspace/ven-archetype_ARCHETYPE-553-J4FOCNZGBVSFDFI4P3DBC7GXGJK62NFN5QH7Q5I46GZ5AP3FIVLQ/linux-jdk11-m3.5.x_build/archetype-testing/archetype-final/target/test-classes/projects/roundtrip-multi/target/generated-sources/archetype/src/main/resources/archetype-resources/__rootArtifactId__-stores/__rootArtifactId__-store-memory/pom.xml
[linux-jdk11-m3.5.x_build] /home/jenkins/jenkins-slave/workspace/ven-archetype_ARCHETYPE-553-J4FOCNZGBVSFDFI4P3DBC7GXGJK62NFN5QH7Q5I46GZ5AP3FIVLQ/linux-jdk11-m3.5.x_build/archetype-testing/archetype-final/target/test-classes/projects/roundtrip-multi/target/generated-sources/archetype/src/main/resources/archetype-resources/__rootArtifactId__-stores/__rootArtifactId__-store-xstream/.classpath
[linux-jdk11-m3.5.x_build] /home/jenkins/jenkins-slave/workspace/ven-archetype_ARCHETYPE-553-J4FOCNZGBVSFDFI4P3DBC7GXGJK62NFN5QH7Q5I46GZ5AP3FIVLQ/linux-jdk11-m3.5.x_build/archetype-testing/archetype-final/target/test-classes/projects/roundtrip-multi/target/generated-sources/archetype/src/main/resources/archetype-resources/__rootArtifactId__-stores/__rootArtifactId__-store-xstream/.checkstyle
[linux-jdk11-m3.5.x_build] /home/jenkins/jenkins-slave/workspace/ven-archetype_ARCHETYPE-553-J4FOCNZGBVSFDFI4P3DBC7GXGJK62NFN5QH7Q5I46GZ5AP3FIVLQ/linux-jdk11-m3.5.x_build/archetype-testing/archetype-final/target/test-classes/projects/roundtrip-multi/target/generated-sources/archetype/src/main/resources/archetype-resources/__rootArtifactId__-stores/__rootArtifactId__-store-xstream/src/main/java/store/xstream/XStream.java
[linux-jdk11-m3.5.x_build] /home/jenkins/jenkins-slave/workspace/ven-archetype_ARCHETYPE-553-J4FOCNZGBVSFDFI4P3DBC7GXGJK62NFN5QH7Q5I46GZ5AP3FIVLQ/linux-jdk11-m3.5.x_build/archetype-testing/archetype-final/target/test-classes/projects/roundtrip-multi/target/generated-sources/archetype/src/main/resources/archetype-resources/__rootArtifactId__-stores/__rootArtifactId__-store-xstream/pom.xml
[linux-jdk11-m3.5.x_build] /home/jenkins/jenkins-slave/workspace/ven-archetype_ARCHETYPE-553-J4FOCNZGBVSFDFI4P3DBC7GXGJK62NFN5QH7Q5I46GZ5AP3FIVLQ/linux-jdk11-m3.5.x_build/archetype-testing/archetype-final/target/test-classes/projects/roundtrip-multi/target/generated-sources/archetype/src/main/resources/archetype-resources/__rootArtifactId__-stores/pom.xml
[linux-jdk11-m3.5.x_build] /home/jenkins/jenkins-slave/workspace/ven-archetype_ARCHETYPE-553-J4FOCNZGBVSFDFI4P3DBC7GXGJK62NFN5QH7Q5I46GZ5AP3FIVLQ/linux-jdk11-m3.5.x_build/archetype-testing/archetype-final/target/test-classes/projects/roundtrip-multi/target/generated-sources/archetype/src/main/resources/archetype-resources/__rootArtifactId__-api/.classpath
[linux-jdk11-m3.5.x_build] /home/jenkins/jenkins-slave/workspace/ven-archetype_ARCHETYPE-553-J4FOCNZGBVSFDFI4P3DBC7GXGJK62NFN5QH7Q5I46GZ5AP3FIVLQ/linux-jdk11-m3.5.x_build/archetype-testing/archetype-final/target/test-classes/projects/roundtrip-multi/target/generated-sources/archetype/src/main/resources/archetype-resources/__rootArtifactId__-api/.checkstyle
[linux-jdk11-m3.5.x_build] /home/jenkins/jenkins-slave/workspace/ven-archetype_ARCHETYPE-553-J4FOCNZGBVSFDFI4P3DBC7GXGJK62NFN5QH7Q5I46GZ5AP3FIVLQ/linux-jdk11-m3.5.x_build/archetype-testing/archetype-final/target/test-classes/projects/roundtrip-multi/target/generated-sources/archetype/src/main/resources/archetype-resources/__rootArtifactId__-api/src/main/java/api/Api.java
[linux-jdk11-m3.5.x_build] /home/jenkins/jenkins-slave/workspace/ven-archetype_ARCHETYPE-553-J4FOCNZGBVSFDFI4P3DBC7GXGJK62NFN5QH7Q5I46GZ5AP3FIVLQ/linux-jdk11-m3.5.x_build/archetype-testing/archetype-final/target/test-classes/projects/roundtrip-multi/target/generated-sources/archetype/src/main/resources/archetype-resources/__rootArtifactId__-api/pom.xml
[linux-jdk11-m3.5.x_build] /home/jenkins/jenkins-slave/workspace/ven-archetype_ARCHETYPE-553-J4FOCNZGBVSFDFI4P3DBC7GXGJK62NFN5QH7Q5I46GZ5AP3FIVLQ/linux-jdk11-m3.5.x_build/archetype-testing/archetype-final/target/test-classes/projects/roundtrip-multi/target/generated-sources/archetype/src/main/resources/archetype-resources/__rootArtifactId__-cli/.classpath
[linux-jdk11-m3.5.x_build] /home/jenkins/jenkins-slave/workspace/ven-archetype_ARCHETYPE-553-J4FOCNZGBVSFDFI4P3DBC7GXGJK62NFN5QH7Q5I46GZ5AP3FIVLQ/linux-jdk11-m3.5.x_build/archetype-testing/archetype-final/target/test-classes/projects/roundtrip-multi/target/generated-sources/archetype/src/main/resources/archetype-resources/__rootArtifactId__-cli/.checkstyle
[linux-jdk11-m3.5.x_build] /home/jenkins/jenkins-slave/workspace/ven-archetype_ARCHETYPE-553-J4FOCNZGBVSFDFI4P3DBC7GXGJK62NFN5QH7Q5I46GZ5AP3FIVLQ/linux-jdk11-m3.5.x_build/archetype-testing/archetype-final/target/test-classes/projects/roundtrip-multi/target/generated-sources/archetype/src/main/resources/archetype-resources/__rootArtifactId__-cli/src/main/java/cli/Cli.java
[linux-jdk11-m3.5.x_build] /home/jenkins/jenkins-slave/workspace/ven-archetype_ARCHETYPE-553-J4FOCNZGBVSFDFI4P3DBC7GXGJK62NFN5QH7Q5I46GZ5AP3FIVLQ/linux-jdk11-m3.5.x_build/archetype-testing/archetype-final/target/test-classes/projects/roundtrip-multi/target/generated-sources/archetype/src/main/resources/archetype-resources/__rootArtifactId__-cli/pom.xml
[linux-jdk11-m3.5.x_build] /home/jenkins/jenkins-slave/workspace/ven-archetype_ARCHETYPE-553-J4FOCNZGBVSFDFI4P3DBC7GXGJK62NFN5QH7Q5I46GZ5AP3FIVLQ/linux-jdk11-m3.5.x_build/archetype-testing/archetype-final/target/test-classes/projects/roundtrip-multi/target/generated-sources/archetype/src/main/resources/archetype-resources/pom.xml
[linux-jdk11-m3.5.x_build] /home/jenkins/jenkins-slave/workspace/ven-archetype_ARCHETYPE-553-J4FOCNZGBVSFDFI4P3DBC7GXGJK62NFN5QH7Q5I46GZ5AP3FIVLQ/linux-jdk11-m3.5.x_build/archetype-testing/archetype-final/target/test-classes/projects/roundtrip-multi/target/generated-sources/archetype/src/main/resources/META-INF/maven/archetype-metadata.xml
[linux-jdk11-m3.5.x_build] /home/jenkins/jenkins-slave/workspace/ven-archetype_ARCHETYPE-553-J4FOCNZGBVSFDFI4P3DBC7GXGJK62NFN5QH7Q5I46GZ5AP3FIVLQ/linux-jdk11-m3.5.x_build/archetype-testing/archetype-final/target/test-classes/projects/roundtrip-multi/target/generated-sources/archetype/src/test/resources/projects/basic/goal.txt
[linux-jdk11-m3.5.x_build] /home/jenkins/jenkins-slave/workspace/ven-archetype_ARCHETYPE-553-J4FOCNZGBVSFDFI4P3DBC7GXGJK62NFN5QH7Q5I46GZ5AP3FIVLQ/linux-jdk11-m3.5.x_build/archetype-testing/archetype-final/target/test-classes/projects/roundtrip-multi/target/generated-sources/archetype/src/test/resources/projects/basic/archetype.properties
[linux-jdk11-m3.5.x_build] /home/jenkins/jenkins-slave/workspace/ven-archetype_ARCHETYPE-553-J4FOCNZGBVSFDFI4P3DBC7GXGJK62NFN5QH7Q5I46GZ5AP3FIVLQ/linux-jdk11-m3.5.x_build/archetype-testing/archetype-final/target/test-classes/projects/roundtrip-multi/target/generated-sources/archetype/pom.xml
[linux-jdk11-m3.5.x_build] /home/jenkins/jenkins-slave/workspace/ven-archetype_ARCHETYPE-553-J4FOCNZGBVSFDFI4P3DBC7GXGJK62NFN5QH7Q5I46GZ5AP3FIVLQ/linux-jdk11-m3.5.x_build/archetype-testing/archetype-final/target/test-classes/projects/roundtrip-multi/target/generated-sources/archetype/target/classes/archetype-resources/__rootArtifactId__-core/.classpath
[linux-jdk11-m3.5.x_build] /home/jenkins/jenkins-slave/workspace/ven-archetype_ARCHETYPE-553-J4FOCNZGBVSFDFI4P3DBC7GXGJK62NFN5QH7Q5I46GZ5AP3FIVLQ/linux-jdk11-m3.5.x_build/archetype-testing/archetype-final/target/test-classes/projects/roundtrip-multi/target/generated-sources/archetype/target/classes/archetype-resources/__rootArtifactId__-core/.checkstyle
[linux-jdk11-m3.5.x_build] /home/jenkins/jenkins-slave/workspace/ven-archetype_ARCHETYPE-553-J4FOCNZGBVSFDFI4P3DBC7GXGJK62NFN5QH7Q5I46GZ5AP3FIVLQ/linux-jdk11-m3.5.x_build/archetype-testing/archetype-final/target/test-classes/projects/roundtrip-multi/target/generated-sources/archetype/target/classes/archetype-resources/__rootArtifactId__-core/src/main/java/core/Core.java
[linux-jdk11-m3.5.x_build] /home/jenkins/jenkins-slave/workspace/ven-archetype_ARCHETYPE-553-J4FOCNZGBVSFDFI4P3DBC7GXGJK62NFN5QH7Q5I46GZ5AP3FIVLQ/linux-jdk11-m3.5.x_build/archetype-testing/archetype-final/target/test-classes/projects/roundtrip-multi/target/generated-sources/archetype/target/classes/archetype-resources/__rootArtifactId__-core/pom.xml
[linux-jdk11-m3.5.x_build] /home/jenkins/jenkins-slave/workspace/ven-archetype_ARCHETYPE-553-J4FOCNZGBVSFDFI4P3DBC7GXGJK62NFN5QH7Q5I46GZ5AP3FIVLQ/linux-jdk11-m3.5.x_build/archetype-testing/archetype-final/target/test-classes/projects/roundtrip-multi/target/generated-sources/archetype/target/classes/archetype-resources/__rootArtifactId__-model/.classpath
[linux-jdk11-m3.5.x_build] /home/jenkins/jenkins-slave/workspace/ven-archetype_ARCHETYPE-553-J4FOCNZGBVSFDFI4P3DBC7GXGJK62NFN5QH7Q5I46GZ5AP3FIVLQ/linux-jdk11-m3.5.x_build/archetype-testing/archetype-final/target/test-classes/projects/roundtrip-multi/target/generated-sources/archetype/target/classes/archetype-resources/__rootArtifactId__-model/.checkstyle
[linux-jdk11-m3.5.x_build] /home/jenkins/jenkins-slave/workspace/ven-archetype_ARCHETYPE-553-J4FOCNZGBVSFDFI4P3DBC7GXGJK62NFN5QH7Q5I46GZ5AP3FIVLQ/linux-jdk11-m3.5.x_build/archetype-testing/archetype-final/target/test-classes/projects/roundtrip-multi/target/generated-sources/archetype/target/classes/archetype-resources/__rootArtifactId__-model/src/main/java/org/company/__parentArtifactId__/model/Model.java
[linux-jdk11-m3.5.x_build] /home/jenkins/jenkins-slave/workspace/ven-archetype_ARCHETYPE-553-J4FOCNZGBVSFDFI4P3DBC7GXGJK62NFN5QH7Q5I46GZ5AP3FIVLQ/linux-jdk11-m3.5.x_build/archetype-testing/archetype-final/target/test-classes/projects/roundtrip-multi/target/generated-sources/archetype/target/classes/archetype-resources/__rootArtifactId__-model/pom.xml
[linux-jdk11-m3.5.x_build] /home/jenkins/jenkins-slave/workspace/ven-archetype_ARCHETYPE-553-J4FOCNZGBVSFDFI4P3DBC7GXGJK62NFN5QH7Q5I46GZ5AP3FIVLQ/linux-jdk11-m3.5.x_build/archetype-testing/archetype-final/target/test-classes/projects/roundtrip-multi/target/generated-sources/archetype/target/classes/archetype-resources/.classpath
[linux-jdk11-m3.5.x_build] /home/jenkins/jenkins-slave/workspace/ven-archetype_ARCHETYPE-553-J4FOCNZGBVSFDFI4P3DBC7GXGJK62NFN5QH7Q5I46GZ5AP3FIVLQ/linux-jdk11-m3.5.x_build/archetype-testing/archetype-final/target/test-classes/projects/roundtrip-multi/target/generated-sources/archetype/target/classes/archetype-resources/.checkstyle
[linux-jdk11-m3.5.x_build] /home/jenkins/jenkins-slave/workspace/ven-archetype_ARCHETYPE-553-J4FOCNZGBVSFDFI4P3DBC7GXGJK62NFN5QH7Q5I46GZ5AP3FIVLQ/linux-jdk11-m3.5.x_build/archetype-testing/archetype-final/target/test-classes/projects/roundtrip-multi/target/generated-sources/archetype/target/classes/archetype-resources/src/site/site.xml
[linux-jdk11-m3.5.x_build] /home/jenkins/jenkins-slave/workspace/ven-archetype_ARCHETYPE-553-J4FOCNZGBVSFDFI4P3DBC7GXGJK62NFN5QH7Q5I46GZ5AP3FIVLQ/linux-jdk11-m3.5.x_build/archetype-testing/archetype-final/target/test-classes/projects/roundtrip-multi/target/generated-sources/archetype/target/classes/archetype-resources/__rootArtifactId__-stores/__rootArtifactId__-store-memory/.classpath
[linux-jdk11-m3.5.x_build] /home/jenkins/jenkins-slave/workspace/ven-archetype_ARCHETYPE-553-J4FOCNZGBVSFDFI4P3DBC7GXGJK62NFN5QH7Q5I46GZ5AP3FIVLQ/linux-jdk11-m3.5.x_build/archetype-testing/archetype-final/target/test-classes/projects/roundtrip-multi/target/generated-sources/archetype/target/classes/archetype-resources/__rootArtifactId__-stores/__rootArtifactId__-store-memory/.checkstyle
[linux-jdk11-m3.5.x_build] /home/jenkins/jenkins-slave/workspace/ven-archetype_ARCHETYPE-553-J4FOCNZGBVSFDFI4P3DBC7GXGJK62NFN5QH7Q5I46GZ5AP3FIVLQ/linux-jdk11-m3.5.x_build/archetype-testing/archetype-final/target/test-classes/projects/roundtrip-multi/target/generated-sources/archetype/target/classes/archetype-resources/__rootArtifactId__-stores/__rootArtifactId__-store-memory/src/main/java/store/memory/Memory.java
[linux-jdk11-m3.5.x_build] /home/jenkins/jenkins-slave/workspace/ven-archetype_ARCHETYPE-553-J4FOCNZGBVSFDFI4P3DBC7GXGJK62NFN5QH7Q5I46GZ5AP3FIVLQ/linux-jdk11-m3.5.x_build/archetype-testing/archetype-final/target/test-classes/projects/roundtrip-multi/target/generated-sources/archetype/target/classes/archetype-resources/__rootArtifactId__-stores/__rootArtifactId__-store-memory/pom.xml
[linux-jdk11-m3.5.x_build] /home/jenkins/jenkins-slave/workspace/ven-archetype_ARCHETYPE-553-J4FOCNZGBVSFDFI4P3DBC7GXGJK62NFN5QH7Q5I46GZ5AP3FIVLQ/linux-jdk11-m3.5.x_build/archetype-testing/archetype-final/target/test-classes/projects/roundtrip-multi/target/generated-sources/archetype/target/classes/archetype-resources/__rootArtifactId__-stores/__rootArtifactId__-store-xstream/.classpath
[linux-jdk11-m3.5.x_build] /home/jenkins/jenkins-slave/workspace/ven-archetype_ARCHETYPE-553-J4FOCNZGBVSFDFI4P3DBC7GXGJK62NFN5QH7Q5I46GZ5AP3FIVLQ/linux-jdk11-m3.5.x_build/archetype-testing/archetype-final/target/test-classes/projects/roundtrip-multi/target/generated-sources/archetype/target/classes/archetype-resources/__rootArtifactId__-stores/__rootArtifactId__-store-xstream/.checkstyle
[linux-jdk11-m3.5.x_build] /home/jenkins/jenkins-slave/workspace/ven-archetype_ARCHETYPE-553-J4FOCNZGBVSFDFI4P3DBC7GXGJK62NFN5QH7Q5I46GZ5AP3FIVLQ/linux-jdk11-m3.5.x_build/archetype-testing/archetype-final/target/test-classes/projects/roundtrip-multi/target/generated-sources/archetype/target/classes/archetype-resources/__rootArtifactId__-stores/__rootArtifactId__-store-xstream/src/main/java/store/xstream/XStream.java
[linux-jdk11-m3.5.x_build] /home/jenkins/jenkins-slave/workspace/ven-archetype_ARCHETYPE-553-J4FOCNZGBVSFDFI4P3DBC7GXGJK62NFN5QH7Q5I46GZ5AP3FIVLQ/linux-jdk11-m3.5.x_build/archetype-testing/archetype-final/target/test-classes/projects/roundtrip-multi/target/generated-sources/archetype/target/classes/archetype-resources/__rootArtifactId__-stores/__rootArtifactId__-store-xstream/pom.xml
[linux-jdk11-m3.5.x_build] /home/jenkins/jenkins-slave/workspace/ven-archetype_ARCHETYPE-553-J4FOCNZGBVSFDFI4P3DBC7GXGJK62NFN5QH7Q5I46GZ5AP3FIVLQ/linux-jdk11-m3.5.x_build/archetype-testing/archetype-final/target/test-classes/projects/roundtrip-multi/target/generated-sources/archetype/target/classes/archetype-resources/__rootArtifactId__-stores/pom.xml
[linux-jdk11-m3.5.x_build] /home/jenkins/jenkins-slave/workspace/ven-archetype_ARCHETYPE-553-J4FOCNZGBVSFDFI4P3DBC7GXGJK62NFN5QH7Q5I46GZ5AP3FIVLQ/linux-jdk11-m3.5.x_build/archetype-testing/archetype-final/target/test-classes/projects/roundtrip-multi/target/generated-sources/archetype/target/classes/archetype-resources/__rootArtifactId__-api/.classpath
[linux-jdk11-m3.5.x_build] /home/jenkins/jenkins-slave/workspace/ven-archetype_ARCHETYPE-553-J4FOCNZGBVSFDFI4P3DBC7GXGJK62NFN5QH7Q5I46GZ5AP3FIVLQ/linux-jdk11-m3.5.x_build/archetype-testing/archetype-final/target/test-classes/projects/roundtrip-multi/target/generated-sources/archetype/target/classes/archetype-resources/__rootArtifactId__-api/.checkstyle
[linux-jdk11-m3.5.x_build] /home/jenkins/jenkins-slave/workspace/ven-archetype_ARCHETYPE-553-J4FOCNZGBVSFDFI4P3DBC7GXGJK62NFN5QH7Q5I46GZ5AP3FIVLQ/linux-jdk11-m3.5.x_build/archetype-testing/archetype-final/target/test-classes/projects/roundtrip-multi/target/generated-sources/archetype/target/classes/archetype-resources/__rootArtifactId__-api/src/main/java/api/Api.java
[linux-jdk11-m3.5.x_build] /home/jenkins/jenkins-slave/workspace/ven-archetype_ARCHETYPE-553-J4FOCNZGBVSFDFI4P3DBC7GXGJK62NFN5QH7Q5I46GZ5AP3FIVLQ/linux-jdk11-m3.5.x_build/archetype-testing/archetype-final/target/test-classes/projects/roundtrip-multi/target/generated-sources/archetype/target/classes/archetype-resources/__rootArtifactId__-api/pom.xml
[linux-jdk11-m3.5.x_build] /home/jenkins/jenkins-slave/workspace/ven-archetype_ARCHETYPE-553-J4FOCNZGBVSFDFI4P3DBC7GXGJK62NFN5QH7Q5I46GZ5AP3FIVLQ/linux-jdk11-m3.5.x_build/archetype-testing/archetype-final/target/test-classes/projects/roundtrip-multi/target/generated-sources/archetype/target/classes/archetype-resources/__rootArtifactId__-cli/.classpath
[linux-jdk11-m3.5.x_build] /home/jenkins/jenkins-slave/workspace/ven-archetype_ARCHETYPE-553-J4FOCNZGBVSFDFI4P3DBC7GXGJK62NFN5QH7Q5I46GZ5AP3FIVLQ/linux-jdk11-m3.5.x_build/archetype-testing/archetype-final/target/test-classes/projects/roundtrip-multi/target/generated-sources/archetype/target/classes/archetype-resources/__rootArtifactId__-cli/.checkstyle
[linux-jdk11-m3.5.x_build] /home/jenkins/jenkins-slave/workspace/ven-archetype_ARCHETYPE-553-J4FOCNZGBVSFDFI4P3DBC7GXGJK62NFN5QH7Q5I46GZ5AP3FIVLQ/linux-jdk11-m3.5.x_build/archetype-testing/archetype-final/target/test-classes/projects/roundtrip-multi/target/generated-sources/archetype/target/classes/archetype-resources/__rootArtifactId__-cli/src/main/java/cli/Cli.java
[linux-jdk11-m3.5.x_build] /home/jenkins/jenkins-slave/workspace/ven-archetype_ARCHETYPE-553-J4FOCNZGBVSFDFI4P3DBC7GXGJK62NFN5QH7Q5I46GZ5AP3FIVLQ/linux-jdk11-m3.5.x_build/archetype-testing/archetype-final/target/test-classes/projects/roundtrip-multi/target/generated-sources/archetype/target/classes/archetype-resources/__rootArtifactId__-cli/pom.xml
[linux-jdk11-m3.5.x_build] /home/jenkins/jenkins-slave/workspace/ven-archetype_ARCHETYPE-553-J4FOCNZGBVSFDFI4P3DBC7GXGJK62NFN5QH7Q5I46GZ5AP3FIVLQ/linux-jdk11-m3.5.x_build/archetype-testing/archetype-final/target/test-classes/projects/roundtrip-multi/target/generated-sources/archetype/target/classes/archetype-resources/pom.xml
[linux-jdk11-m3.5.x_build] /home/jenkins/jenkins-slave/workspace/ven-archetype_ARCHETYPE-553-J4FOCNZGBVSFDFI4P3DBC7GXGJK62NFN5QH7Q5I46GZ5AP3FIVLQ/linux-jdk11-m3.5.x_build/archetype-testing/archetype-final/target/test-classes/projects/roundtrip-multi/target/generated-sources/archetype/target/classes/META-INF/maven/archetype-metadata.xml
[linux-jdk11-m3.5.x_build] /home/jenkins/jenkins-slave/workspace/ven-archetype_ARCHETYPE-553-J4FOCNZGBVSFDFI4P3DBC7GXGJK62NFN5QH7Q5I46GZ5AP3FIVLQ/linux-jdk11-m3.5.x_build/archetype-testing/archetype-final/target/test-classes/projects/roundtrip-multi/target/generated-sources/archetype/target/proficio-1.0-SNAPSHOT.jar
[linux-jdk11-m3.5.x_build] /home/jenkins/jenkins-slave/workspace/ven-archetype_ARCHETYPE-553-J4FOCNZGBVSFDFI4P3DBC7GXGJK62NFN5QH7Q5I46GZ5AP3FIVLQ/linux-jdk11-m3.5.x_build/archetype-testing/archetype-final/target/test-classes/projects/roundtrip-multi/target/generated-sources/archetype/target/test-classes/projects/basic/goal.txt
[linux-jdk11-m3.5.x_build] /home/jenkins/jenkins-slave/workspace/ven-archetype_ARCHETYPE-553-J4FOCNZGBVSFDFI4P3DBC7GXGJK62NFN5QH7Q5I46GZ5AP3FIVLQ/linux-jdk11-m3.5.x_build/archetype-testing/archetype-final/target/test-classes/projects/roundtrip-multi/target/generated-sources/archetype/target/test-classes/projects/basic/archetype.properties
[linux-jdk11-m3.5.x_build] [INFO] ----------------------------------------------------------------------------
[linux-jdk11-m3.5.x_build] [INFO] Using following parameters for creating project from Archetype: proficio:1.0-SNAPSHOT
[linux-jdk11-m3.5.x_build] [INFO] ----------------------------------------------------------------------------
[linux-jdk11-m3.5.x_build] [INFO] Parameter: groupId, Value: com.mycompany
[linux-jdk11-m3.5.x_build] [INFO] Parameter: artifactId, Value: myapp
[linux-jdk11-m3.5.x_build] [INFO] Parameter: version, Value: 1.0-SNAPSHOT
[linux-jdk11-m3.5.x_build] [INFO] Parameter: package, Value: com.mycompany.myapp
[linux-jdk11-m3.5.x_build] [INFO] Parameter: packageInPathFormat, Value: com/mycompany/myapp
[linux-jdk11-m3.5.x_build] WARNING: An illegal reflective access operation has occurred
[linux-jdk11-m3.5.x_build] WARNING: Illegal reflective access by org.dom4j.io.SAXContentHandler (file:/home/jenkins/jenkins-slave/workspace/ven-archetype_ARCHETYPE-553-J4FOCNZGBVSFDFI4P3DBC7GXGJK62NFN5QH7Q5I46GZ5AP3FIVLQ/.repository/dom4j/dom4j/1.6.1/dom4j-1.6.1.jar) to method com.sun.org.apache.xerces.internal.parsers.AbstractSAXParser$LocatorProxy.getEncoding()
[linux-jdk11-m3.5.x_build] WARNING: Please consider reporting this to the maintainers of org.dom4j.io.SAXContentHandler
[linux-jdk11-m3.5.x_build] WARNING: Use --illegal-access=warn to enable warnings of further illegal reflective access operations
[linux-jdk11-m3.5.x_build] WARNING: All illegal access operations will be denied in a future release
[linux-jdk11-m3.5.x_build] [INFO] Parent element not overwritten in /home/jenkins/jenkins-slave/workspace/ven-archetype_ARCHETYPE-553-J4FOCNZGBVSFDFI4P3DBC7GXGJK62NFN5QH7Q5I46GZ5AP3FIVLQ/linux-jdk11-m3.5.x_build/archetype-testing/archetype-final/target/test-classes/projects/roundtrip-multi-recreated/myapp/myapp-api/pom.xml
[linux-jdk11-m3.5.x_build] [INFO] Parent element not overwritten in /home/jenkins/jenkins-slave/workspace/ven-archetype_ARCHETYPE-553-J4FOCNZGBVSFDFI4P3DBC7GXGJK62NFN5QH7Q5I46GZ5AP3FIVLQ/linux-jdk11-m3.5.x_build/archetype-testing/archetype-final/target/test-classes/projects/roundtrip-multi-recreated/myapp/myapp-cli/pom.xml
[linux-jdk11-m3.5.x_build] [INFO] Parent element not overwritten in /home/jenkins/jenkins-slave/workspace/ven-archetype_ARCHETYPE-553-J4FOCNZGBVSFDFI4P3DBC7GXGJK62NFN5QH7Q5I46GZ5AP3FIVLQ/linux-jdk11-m3.5.x_build/archetype-testing/archetype-final/target/test-classes/projects/roundtrip-multi-recreated/myapp/myapp-core/pom.xml
[linux-jdk11-m3.5.x_build] [INFO] Parent element not overwritten in /home/jenkins/jenkins-slave/workspace/ven-archetype_ARCHETYPE-553-J4FOCNZGBVSFDFI4P3DBC7GXGJK62NFN5QH7Q5I46GZ5AP3FIVLQ/linux-jdk11-m3.5.x_build/archetype-testing/archetype-final/target/test-classes/projects/roundtrip-multi-recreated/myapp/myapp-model/pom.xml
[linux-jdk11-m3.5.x_build] [INFO] Parent element not overwritten in /home/jenkins/jenkins-slave/workspace/ven-archetype_ARCHETYPE-553-J4FOCNZGBVSFDFI4P3DBC7GXGJK62NFN5QH7Q5I46GZ5AP3FIVLQ/linux-jdk11-m3.5.x_build/archetype-testing/archetype-final/target/test-classes/projects/roundtrip-multi-recreated/myapp/myapp-stores/pom.xml
[linux-jdk11-m3.5.x_build] [INFO] Parent element not overwritten in /home/jenkins/jenkins-slave/workspace/ven-archetype_ARCHETYPE-553-J4FOCNZGBVSFDFI4P3DBC7GXGJK62NFN5QH7Q5I46GZ5AP3FIVLQ/linux-jdk11-m3.5.x_build/archetype-testing/archetype-final/target/test-classes/projects/roundtrip-multi-recreated/myapp/myapp-stores/myapp-store-memory/pom.xml
[linux-jdk11-m3.5.x_build] [INFO] Parent element not overwritten in /home/jenkins/jenkins-slave/workspace/ven-archetype_ARCHETYPE-553-J4FOCNZGBVSFDFI4P3DBC7GXGJK62NFN5QH7Q5I46GZ5AP3FIVLQ/linux-jdk11-m3.5.x_build/archetype-testing/archetype-final/target/test-classes/projects/roundtrip-multi-recreated/myapp/myapp-stores/myapp-store-xstream/pom.xml
[linux-jdk11-m3.5.x_build] [INFO] Project created from Archetype in dir: /home/jenkins/jenkins-slave/workspace/ven-archetype_ARCHETYPE-553-J4FOCNZGBVSFDFI4P3DBC7GXGJK62NFN5QH7Q5I46GZ5AP3FIVLQ/linux-jdk11-m3.5.x_build/archetype-testing/archetype-final/target/test-classes/projects/roundtrip-multi-recreated/myapp
[linux-jdk11-m3.5.x_build] Tests run: 1, Failures: 0, Errors: 0, Skipped: 0, Time elapsed: 4.519 sec - in org.apache.maven.archetype.test.RoundtripMultiModuleIT
[linux-jdk11-m3.5.x_build] 
[linux-jdk11-m3.5.x_build] Results :
[linux-jdk11-m3.5.x_build] 
[linux-jdk11-m3.5.x_build] Tests run: 14, Failures: 0, Errors: 0, Skipped: 0
[linux-jdk11-m3.5.x_build] 
[linux-jdk11-m3.5.x_build] [INFO] 
[linux-jdk11-m3.5.x_build] [INFO] --- maven-checkstyle-plugin:3.0.0:check (checkstyle-check) @ archetype-final ---
[linux-jdk11-m3.5.x_build] [INFO] 
[linux-jdk11-m3.5.x_build] [INFO] --- maven-failsafe-plugin:2.19.1:verify (default) @ archetype-final ---
[linux-jdk11-m3.5.x_build] [INFO] ------------------------------------------------------------------------
[linux-jdk11-m3.5.x_build] [INFO] Reactor Summary:
[linux-jdk11-m3.5.x_build] [INFO] 
[linux-jdk11-m3.5.x_build] [INFO] Maven Archetype 3.0.2-SNAPSHOT ..................... SUCCESS [ 16.255 s]
[linux-jdk11-m3.5.x_build] [INFO] Maven Archetype Models ............................. SUCCESS [  0.666 s]
[linux-jdk11-m3.5.x_build] [INFO] Maven Archetype Catalog Model ...................... SUCCESS [  8.217 s]
[linux-jdk11-m3.5.x_build] [INFO] Maven Archetype Descriptor Model ................... SUCCESS [  1.055 s]
[linux-jdk11-m3.5.x_build] [INFO] Maven Archetype Testing ............................ SUCCESS [  0.456 s]
[linux-jdk11-m3.5.x_build] [INFO] Maven Archetype Webapp Repository .................. SUCCESS [  1.666 s]
[linux-jdk11-m3.5.x_build] [INFO] Maven Archetype Webapp Proxy ....................... SUCCESS [  0.966 s]
[linux-jdk11-m3.5.x_build] [INFO] Maven Archetype Common ............................. SUCCESS [ 18.529 s]
[linux-jdk11-m3.5.x_build] [INFO] Maven Archetype Packaging .......................... SUCCESS [  0.526 s]
[linux-jdk11-m3.5.x_build] [INFO] Maven Archetype Plugin ............................. SUCCESS [02:24 min]
[linux-jdk11-m3.5.x_build] [INFO] Maven Archetype Testing Final 3.0.2-SNAPSHOT ....... SUCCESS [01:09 min]
[linux-jdk11-m3.5.x_build] [INFO] ------------------------------------------------------------------------
[linux-jdk11-m3.5.x_build] [INFO] BUILD SUCCESS
[linux-jdk11-m3.5.x_build] [INFO] ------------------------------------------------------------------------
[linux-jdk11-m3.5.x_build] [INFO] Total time: 04:24 min
[linux-jdk11-m3.5.x_build] [INFO] Finished at: 2018-10-03T20:07:38Z
[linux-jdk11-m3.5.x_build] [INFO] ------------------------------------------------------------------------
[linux-jdk11-m3.5.x_build] [INFO] [jenkins-event-spy] Generated /home/jenkins/jenkins-slave/workspace/ven-archetype_ARCHETYPE-553-J4FOCNZGBVSFDFI4P3DBC7GXGJK62NFN5QH7Q5I46GZ5AP3FIVLQ@tmp/withMaven625f9c1d/maven-spy-20181003-200313-4697258250418224997983.log
[Pipeline] [linux-jdk11-m3.5.x_build] }
[Pipeline] [linux-jdk11-m3.5.x_build] // dir
[Pipeline] [linux-jdk11-m3.5.x_build] }
[linux-jdk11-m3.5.x_build] [withMaven] artifactsPublisher - Archive artifact linux-jdk11-m3.5.x_build/pom.xml under org/apache/maven/archetype/maven-archetype/3.0.2-SNAPSHOT/maven-archetype-3.0.2-SNAPSHOT.pom
[linux-jdk11-m3.5.x_build] [withMaven] artifactsPublisher - Archive artifact linux-jdk11-m3.5.x_build/target/maven-archetype-3.0.2-SNAPSHOT-site.xml under org/apache/maven/archetype/maven-archetype/3.0.2-SNAPSHOT/maven-archetype-3.0.2-SNAPSHOT-site.xml
[linux-jdk11-m3.5.x_build] [withMaven] artifactsPublisher - Archive artifact linux-jdk11-m3.5.x_build/archetype-models/pom.xml under org/apache/maven/archetype/archetype-models/3.0.2-SNAPSHOT/archetype-models-3.0.2-SNAPSHOT.pom
[linux-jdk11-m3.5.x_build] [withMaven] artifactsPublisher - Archive artifact linux-jdk11-m3.5.x_build/archetype-models/target/archetype-models-3.0.2-SNAPSHOT-site.xml under org/apache/maven/archetype/archetype-models/3.0.2-SNAPSHOT/archetype-models-3.0.2-SNAPSHOT-site.xml
[linux-jdk11-m3.5.x_build] [withMaven] artifactsPublisher - Archive artifact linux-jdk11-m3.5.x_build/archetype-models/archetype-catalog/pom.xml under org/apache/maven/archetype/archetype-catalog/3.0.2-SNAPSHOT/archetype-catalog-3.0.2-SNAPSHOT.pom
[linux-jdk11-m3.5.x_build] [withMaven] artifactsPublisher - Archive artifact linux-jdk11-m3.5.x_build/archetype-models/archetype-catalog/target/archetype-catalog-3.0.2-SNAPSHOT.jar under org/apache/maven/archetype/archetype-catalog/3.0.2-SNAPSHOT/archetype-catalog-3.0.2-SNAPSHOT.jar
[linux-jdk11-m3.5.x_build] [withMaven] artifactsPublisher - Archive artifact linux-jdk11-m3.5.x_build/archetype-models/archetype-descriptor/pom.xml under org/apache/maven/archetype/archetype-descriptor/3.0.2-SNAPSHOT/archetype-descriptor-3.0.2-SNAPSHOT.pom
[linux-jdk11-m3.5.x_build] [withMaven] artifactsPublisher - Archive artifact linux-jdk11-m3.5.x_build/archetype-models/archetype-descriptor/target/archetype-descriptor-3.0.2-SNAPSHOT.jar under org/apache/maven/archetype/archetype-descriptor/3.0.2-SNAPSHOT/archetype-descriptor-3.0.2-SNAPSHOT.jar
[linux-jdk11-m3.5.x_build] [withMaven] artifactsPublisher - Archive artifact linux-jdk11-m3.5.x_build/archetype-testing/pom.xml under org/apache/maven/archetype/archetype-testing/3.0.2-SNAPSHOT/archetype-testing-3.0.2-SNAPSHOT.pom
[linux-jdk11-m3.5.x_build] [withMaven] artifactsPublisher - Archive artifact linux-jdk11-m3.5.x_build/archetype-testing/target/archetype-testing-3.0.2-SNAPSHOT-site.xml under org/apache/maven/archetype/archetype-testing/3.0.2-SNAPSHOT/archetype-testing-3.0.2-SNAPSHOT-site.xml
[linux-jdk11-m3.5.x_build] [withMaven] artifactsPublisher - Archive artifact linux-jdk11-m3.5.x_build/archetype-testing/archetype-repository/pom.xml under org/apache/maven/archetype/archetype-repository/3.0.2-SNAPSHOT/archetype-repository-3.0.2-SNAPSHOT.pom
[linux-jdk11-m3.5.x_build] [withMaven] artifactsPublisher - Archive artifact linux-jdk11-m3.5.x_build/archetype-testing/archetype-repository/target/archetype-repository-3.0.2-SNAPSHOT.war under org/apache/maven/archetype/archetype-repository/3.0.2-SNAPSHOT/archetype-repository-3.0.2-SNAPSHOT.war
[linux-jdk11-m3.5.x_build] [withMaven] artifactsPublisher - Archive artifact linux-jdk11-m3.5.x_build/archetype-testing/archetype-proxy/pom.xml under org/apache/maven/archetype/archetype-proxy/3.0.2-SNAPSHOT/archetype-proxy-3.0.2-SNAPSHOT.pom
[linux-jdk11-m3.5.x_build] [withMaven] artifactsPublisher - Archive artifact linux-jdk11-m3.5.x_build/archetype-testing/archetype-proxy/target/archetype-proxy-3.0.2-SNAPSHOT.war under org/apache/maven/archetype/archetype-proxy/3.0.2-SNAPSHOT/archetype-proxy-3.0.2-SNAPSHOT.war
[linux-jdk11-m3.5.x_build] [withMaven] artifactsPublisher - Archive artifact linux-jdk11-m3.5.x_build/archetype-common/pom.xml under org/apache/maven/archetype/archetype-common/3.0.2-SNAPSHOT/archetype-common-3.0.2-SNAPSHOT.pom
[linux-jdk11-m3.5.x_build] [withMaven] artifactsPublisher - Archive artifact linux-jdk11-m3.5.x_build/archetype-common/target/archetype-common-3.0.2-SNAPSHOT.jar under org/apache/maven/archetype/archetype-common/3.0.2-SNAPSHOT/archetype-common-3.0.2-SNAPSHOT.jar
[linux-jdk11-m3.5.x_build] [withMaven] artifactsPublisher - Archive artifact linux-jdk11-m3.5.x_build/archetype-packaging/pom.xml under org/apache/maven/archetype/archetype-packaging/3.0.2-SNAPSHOT/archetype-packaging-3.0.2-SNAPSHOT.pom
[linux-jdk11-m3.5.x_build] [withMaven] artifactsPublisher - Archive artifact linux-jdk11-m3.5.x_build/archetype-packaging/target/archetype-packaging-3.0.2-SNAPSHOT.jar under org/apache/maven/archetype/archetype-packaging/3.0.2-SNAPSHOT/archetype-packaging-3.0.2-SNAPSHOT.jar
[linux-jdk11-m3.5.x_build] [withMaven] artifactsPublisher - Archive artifact linux-jdk11-m3.5.x_build/maven-archetype-plugin/pom.xml under org/apache/maven/plugins/maven-archetype-plugin/3.0.2-SNAPSHOT/maven-archetype-plugin-3.0.2-SNAPSHOT.pom
[linux-jdk11-m3.5.x_build] [withMaven] artifactsPublisher - Archive artifact linux-jdk11-m3.5.x_build/maven-archetype-plugin/target/maven-archetype-plugin-3.0.2-SNAPSHOT.jar under org/apache/maven/plugins/maven-archetype-plugin/3.0.2-SNAPSHOT/maven-archetype-plugin-3.0.2-SNAPSHOT.jar
[linux-jdk11-m3.5.x_build] [withMaven] artifactsPublisher - Archive artifact linux-jdk11-m3.5.x_build/archetype-testing/archetype-final/pom.xml under org/apache/maven/archetype/archetype-final/3.0.2-SNAPSHOT/archetype-final-3.0.2-SNAPSHOT.pom
[linux-jdk11-m3.5.x_build] [withMaven] artifactsPublisher - Archive artifact linux-jdk11-m3.5.x_build/archetype-testing/archetype-final/target/archetype-final-3.0.2-SNAPSHOT.jar under org/apache/maven/archetype/archetype-final/3.0.2-SNAPSHOT/archetype-final-3.0.2-SNAPSHOT.jar
[linux-jdk11-m3.5.x_build] [Fast Archiver] Compressed 723.91 KB of artifacts by 35.4% relative to #18
[linux-jdk11-m3.5.x_build] [withMaven] invokerPublisher - Archive invoker results for Maven artifact MavenArtifact{org.apache.maven.plugins:maven-archetype-plugin::3.0.2-SNAPSHOT(version: 3.0.2-SNAPSHOT, snapshot:false) } generated by PluginInvocation{org.apache.maven.plugins:maven-invoker-plugin:3.1.0@run  integration-test}: linux-jdk11-m3.5.x_build/maven-archetype-plugin/target/invoker-reports/*.xml
[linux-jdk11-m3.5.x_build] performing MavenInvokerRecorder, reportsFilenamePattern:'**/linux-jdk11-m3.5.x_build/maven-archetype-plugin/target/invoker-reports/BUILD*.xml', invokerBuildDir:'**/linux-jdk11-m3.5.x_build/maven-archetype-plugin/target/it/projects'
[linux-jdk11-m3.5.x_build] Found reports:[/home/jenkins/jenkins-slave/workspace/ven-archetype_ARCHETYPE-553-J4FOCNZGBVSFDFI4P3DBC7GXGJK62NFN5QH7Q5I46GZ5AP3FIVLQ/linux-jdk11-m3.5.x_build/maven-archetype-plugin/target/invoker-reports/BUILD-ARCHETYPE-241_filter-directory.xml, /home/jenkins/jenkins-slave/workspace/ven-archetype_ARCHETYPE-553-J4FOCNZGBVSFDFI4P3DBC7GXGJK62NFN5QH7Q5I46GZ5AP3FIVLQ/linux-jdk11-m3.5.x_build/maven-archetype-plugin/target/invoker-reports/BUILD-ARCHETYPE-517_failing-goals.xml, /home/jenkins/jenkins-slave/workspace/ven-archetype_ARCHETYPE-553-J4FOCNZGBVSFDFI4P3DBC7GXGJK62NFN5QH7Q5I46GZ5AP3FIVLQ/linux-jdk11-m3.5.x_build/maven-archetype-plugin/target/invoker-reports/BUILD-ARCHETYPE-520_mirror.xml, /home/jenkins/jenkins-slave/workspace/ven-archetype_ARCHETYPE-553-J4FOCNZGBVSFDFI4P3DBC7GXGJK62NFN5QH7Q5I46GZ5AP3FIVLQ/linux-jdk11-m3.5.x_build/maven-archetype-plugin/target/invoker-reports/BUILD-ARCHETYPE-521_archetype-repo.xml, /home/jenkins/jenkins-slave/workspace/ven-archetype_ARCHETYPE-553-J4FOCNZGBVSFDFI4P3DBC7GXGJK62NFN5QH7Q5I46GZ5AP3FIVLQ/linux-jdk11-m3.5.x_build/maven-archetype-plugin/target/invoker-reports/BUILD-build-archetype-and-run-its-with-existing-parent.xml, /home/jenkins/jenkins-slave/workspace/ven-archetype_ARCHETYPE-553-J4FOCNZGBVSFDFI4P3DBC7GXGJK62NFN5QH7Q5I46GZ5AP3FIVLQ/linux-jdk11-m3.5.x_build/maven-archetype-plugin/target/invoker-reports/BUILD-build-archetype-ignore-eol-encoding.xml, /home/jenkins/jenkins-slave/workspace/ven-archetype_ARCHETYPE-553-J4FOCNZGBVSFDFI4P3DBC7GXGJK62NFN5QH7Q5I46GZ5AP3FIVLQ/linux-jdk11-m3.5.x_build/maven-archetype-plugin/target/invoker-reports/BUILD-build-archetype.xml, /home/jenkins/jenkins-slave/workspace/ven-archetype_ARCHETYPE-553-J4FOCNZGBVSFDFI4P3DBC7GXGJK62NFN5QH7Q5I46GZ5AP3FIVLQ/linux-jdk11-m3.5.x_build/maven-archetype-plugin/target/invoker-reports/BUILD-create-from-project-exclude-patterns.xml, /home/jenkins/jenkins-slave/workspace/ven-archetype_ARCHETYPE-553-J4FOCNZGBVSFDFI4P3DBC7GXGJK62NFN5QH7Q5I46GZ5AP3FIVLQ/linux-jdk11-m3.5.x_build/maven-archetype-plugin/target/invoker-reports/BUILD-create-from-project.xml, /home/jenkins/jenkins-slave/workspace/ven-archetype_ARCHETYPE-553-J4FOCNZGBVSFDFI4P3DBC7GXGJK62NFN5QH7Q5I46GZ5AP3FIVLQ/linux-jdk11-m3.5.x_build/maven-archetype-plugin/target/invoker-reports/BUILD-generate-basic.xml, /home/jenkins/jenkins-slave/workspace/ven-archetype_ARCHETYPE-553-J4FOCNZGBVSFDFI4P3DBC7GXGJK62NFN5QH7Q5I46GZ5AP3FIVLQ/linux-jdk11-m3.5.x_build/maven-archetype-plugin/target/invoker-reports/BUILD-property-setting-cli.xml]
[linux-jdk11-m3.5.x_build] Found logs:[/home/jenkins/jenkins-slave/workspace/ven-archetype_ARCHETYPE-553-J4FOCNZGBVSFDFI4P3DBC7GXGJK62NFN5QH7Q5I46GZ5AP3FIVLQ/linux-jdk11-m3.5.x_build/maven-archetype-plugin/target/it/projects/ARCHETYPE-241_filter-directory/build.log, /home/jenkins/jenkins-slave/workspace/ven-archetype_ARCHETYPE-553-J4FOCNZGBVSFDFI4P3DBC7GXGJK62NFN5QH7Q5I46GZ5AP3FIVLQ/linux-jdk11-m3.5.x_build/maven-archetype-plugin/target/it/projects/ARCHETYPE-517_failing-goals/build.log, /home/jenkins/jenkins-slave/workspace/ven-archetype_ARCHETYPE-553-J4FOCNZGBVSFDFI4P3DBC7GXGJK62NFN5QH7Q5I46GZ5AP3FIVLQ/linux-jdk11-m3.5.x_build/maven-archetype-plugin/target/it/projects/ARCHETYPE-520_mirror/build.log, /home/jenkins/jenkins-slave/workspace/ven-archetype_ARCHETYPE-553-J4FOCNZGBVSFDFI4P3DBC7GXGJK62NFN5QH7Q5I46GZ5AP3FIVLQ/linux-jdk11-m3.5.x_build/maven-archetype-plugin/target/it/projects/ARCHETYPE-521_archetype-repo/build.log, /home/jenkins/jenkins-slave/workspace/ven-archetype_ARCHETYPE-553-J4FOCNZGBVSFDFI4P3DBC7GXGJK62NFN5QH7Q5I46GZ5AP3FIVLQ/linux-jdk11-m3.5.x_build/maven-archetype-plugin/target/it/projects/build-archetype-and-run-its-with-existing-parent/build.log, /home/jenkins/jenkins-slave/workspace/ven-archetype_ARCHETYPE-553-J4FOCNZGBVSFDFI4P3DBC7GXGJK62NFN5QH7Q5I46GZ5AP3FIVLQ/linux-jdk11-m3.5.x_build/maven-archetype-plugin/target/it/projects/build-archetype-and-run-its-with-existing-parent/target/test-classes/projects/basic/project/project/basic/build.log, /home/jenkins/jenkins-slave/workspace/ven-archetype_ARCHETYPE-553-J4FOCNZGBVSFDFI4P3DBC7GXGJK62NFN5QH7Q5I46GZ5AP3FIVLQ/linux-jdk11-m3.5.x_build/maven-archetype-plugin/target/it/projects/build-archetype-ignore-eol-encoding/build.log, /home/jenkins/jenkins-slave/workspace/ven-archetype_ARCHETYPE-553-J4FOCNZGBVSFDFI4P3DBC7GXGJK62NFN5QH7Q5I46GZ5AP3FIVLQ/linux-jdk11-m3.5.x_build/maven-archetype-plugin/target/it/projects/build-archetype-ignore-eol-encoding/target/test-classes/projects/basic/project/basic/build.log, /home/jenkins/jenkins-slave/workspace/ven-archetype_ARCHETYPE-553-J4FOCNZGBVSFDFI4P3DBC7GXGJK62NFN5QH7Q5I46GZ5AP3FIVLQ/linux-jdk11-m3.5.x_build/maven-archetype-plugin/target/it/projects/build-archetype/build.log, /home/jenkins/jenkins-slave/workspace/ven-archetype_ARCHETYPE-553-J4FOCNZGBVSFDFI4P3DBC7GXGJK62NFN5QH7Q5I46GZ5AP3FIVLQ/linux-jdk11-m3.5.x_build/maven-archetype-plugin/target/it/projects/build-archetype/target/test-classes/projects/basic/project/basic/build.log, /home/jenkins/jenkins-slave/workspace/ven-archetype_ARCHETYPE-553-J4FOCNZGBVSFDFI4P3DBC7GXGJK62NFN5QH7Q5I46GZ5AP3FIVLQ/linux-jdk11-m3.5.x_build/maven-archetype-plugin/target/it/projects/create-from-project-exclude-patterns/build.log, /home/jenkins/jenkins-slave/workspace/ven-archetype_ARCHETYPE-553-J4FOCNZGBVSFDFI4P3DBC7GXGJK62NFN5QH7Q5I46GZ5AP3FIVLQ/linux-jdk11-m3.5.x_build/maven-archetype-plugin/target/it/projects/create-from-project-exclude-patterns/target/generated-sources/archetype/src/main/resources/archetype-resources/build.log, /home/jenkins/jenkins-slave/workspace/ven-archetype_ARCHETYPE-553-J4FOCNZGBVSFDFI4P3DBC7GXGJK62NFN5QH7Q5I46GZ5AP3FIVLQ/linux-jdk11-m3.5.x_build/maven-archetype-plugin/target/it/projects/create-from-project-exclude-patterns/target/generated-sources/archetype/target/classes/archetype-resources/build.log, /home/jenkins/jenkins-slave/workspace/ven-archetype_ARCHETYPE-553-J4FOCNZGBVSFDFI4P3DBC7GXGJK62NFN5QH7Q5I46GZ5AP3FIVLQ/linux-jdk11-m3.5.x_build/maven-archetype-plugin/target/it/projects/create-from-project/build.log, /home/jenkins/jenkins-slave/workspace/ven-archetype_ARCHETYPE-553-J4FOCNZGBVSFDFI4P3DBC7GXGJK62NFN5QH7Q5I46GZ5AP3FIVLQ/linux-jdk11-m3.5.x_build/maven-archetype-plugin/target/it/projects/create-from-project/target/generated-sources/archetype/src/main/resources/archetype-resources/build.log, /home/jenkins/jenkins-slave/workspace/ven-archetype_ARCHETYPE-553-J4FOCNZGBVSFDFI4P3DBC7GXGJK62NFN5QH7Q5I46GZ5AP3FIVLQ/linux-jdk11-m3.5.x_build/maven-archetype-plugin/target/it/projects/create-from-project/target/generated-sources/archetype/target/classes/archetype-resources/build.log, /home/jenkins/jenkins-slave/workspace/ven-archetype_ARCHETYPE-553-J4FOCNZGBVSFDFI4P3DBC7GXGJK62NFN5QH7Q5I46GZ5AP3FIVLQ/linux-jdk11-m3.5.x_build/maven-archetype-plugin/target/it/projects/generate-basic/build.log, /home/jenkins/jenkins-slave/workspace/ven-archetype_ARCHETYPE-553-J4FOCNZGBVSFDFI4P3DBC7GXGJK62NFN5QH7Q5I46GZ5AP3FIVLQ/linux-jdk11-m3.5.x_build/maven-archetype-plugin/target/it/projects/property-setting-cli/build.log]
[linux-jdk11-m3.5.x_build] Finished parsing Maven Invoker results (found 11)
[linux-jdk11-m3.5.x_build] [withMaven] junitPublisher - Archive test results for Maven artifact org.apache.maven.archetype:archetype-catalog:3.0.2-SNAPSHOT generated by maven-surefire-plugin:test (default-test): linux-jdk11-m3.5.x_build/archetype-models/archetype-catalog/target/surefire-reports/*.xml
[linux-jdk11-m3.5.x_build] Recording test results
[linux-jdk11-m3.5.x_build] None of the test reports contained any result
[linux-jdk11-m3.5.x_build] [withMaven] junitPublisher - Archive test results for Maven artifact org.apache.maven.archetype:archetype-descriptor:3.0.2-SNAPSHOT generated by maven-surefire-plugin:test (default-test): linux-jdk11-m3.5.x_build/archetype-models/archetype-descriptor/target/surefire-reports/*.xml
[linux-jdk11-m3.5.x_build] Recording test results
[linux-jdk11-m3.5.x_build] None of the test reports contained any result
[linux-jdk11-m3.5.x_build] [withMaven] junitPublisher - Archive test results for Maven artifact org.apache.maven.archetype:archetype-repository:3.0.2-SNAPSHOT generated by maven-surefire-plugin:test (default-test): linux-jdk11-m3.5.x_build/archetype-testing/archetype-repository/target/surefire-reports/*.xml
[linux-jdk11-m3.5.x_build] Recording test results
[linux-jdk11-m3.5.x_build] None of the test reports contained any result
[linux-jdk11-m3.5.x_build] [withMaven] junitPublisher - Archive test results for Maven artifact org.apache.maven.archetype:archetype-proxy:3.0.2-SNAPSHOT generated by maven-surefire-plugin:test (default-test): linux-jdk11-m3.5.x_build/archetype-testing/archetype-proxy/target/surefire-reports/*.xml
[linux-jdk11-m3.5.x_build] Recording test results
[linux-jdk11-m3.5.x_build] None of the test reports contained any result
[linux-jdk11-m3.5.x_build] [withMaven] junitPublisher - Archive test results for Maven artifact org.apache.maven.archetype:archetype-common:3.0.2-SNAPSHOT generated by maven-surefire-plugin:test (default-test): linux-jdk11-m3.5.x_build/archetype-common/target/surefire-reports/*.xml
[linux-jdk11-m3.5.x_build] Recording test results
[linux-jdk11-m3.5.x_build] [withMaven] junitPublisher - Archive test results for Maven artifact org.apache.maven.archetype:archetype-packaging:3.0.2-SNAPSHOT generated by maven-surefire-plugin:test (default-test): linux-jdk11-m3.5.x_build/archetype-packaging/target/surefire-reports/*.xml
[linux-jdk11-m3.5.x_build] Recording test results
[linux-jdk11-m3.5.x_build] None of the test reports contained any result
[linux-jdk11-m3.5.x_build] [withMaven] junitPublisher - Archive test results for Maven artifact org.apache.maven.plugins:maven-archetype-plugin:3.0.2-SNAPSHOT generated by maven-surefire-plugin:test (default-test): linux-jdk11-m3.5.x_build/maven-archetype-plugin/target/surefire-reports/*.xml
[linux-jdk11-m3.5.x_build] Recording test results
[linux-jdk11-m3.5.x_build] [withMaven] junitPublisher - Archive test results for Maven artifact org.apache.maven.archetype:archetype-final:3.0.2-SNAPSHOT generated by maven-surefire-plugin:test (default-test): linux-jdk11-m3.5.x_build/archetype-testing/archetype-final/target/surefire-reports/*.xml
[linux-jdk11-m3.5.x_build] Recording test results
[linux-jdk11-m3.5.x_build] None of the test reports contained any result
[linux-jdk11-m3.5.x_build] [withMaven] junitPublisher - Archive test results for Maven artifact org.apache.maven.archetype:archetype-final:3.0.2-SNAPSHOT generated by maven-failsafe-plugin:integration-test (default): linux-jdk11-m3.5.x_build/archetype-testing/archetype-final/target/failsafe-reports/*.xml
[linux-jdk11-m3.5.x_build] Recording test results
[linux-jdk11-m3.5.x_build] [withMaven] openTasksPublisher - Scan Tasks for Maven artifact org.apache.maven.archetype:archetype-repository:3.0.2-SNAPSHOT in source directory linux-jdk11-m3.5.x_build/archetype-testing/archetype-repository/src/main/java
[linux-jdk11-m3.5.x_build] [withMaven] openTasksPublisher - Scan Tasks for Maven artifact org.apache.maven.archetype:archetype-proxy:3.0.2-SNAPSHOT in source directory linux-jdk11-m3.5.x_build/archetype-testing/archetype-proxy/src/main/java
[linux-jdk11-m3.5.x_build] [withMaven] openTasksPublisher - Scan Tasks for Maven artifact org.apache.maven.archetype:archetype-common:3.0.2-SNAPSHOT in source directory linux-jdk11-m3.5.x_build/archetype-common/src/main/java
[linux-jdk11-m3.5.x_build] [withMaven] openTasksPublisher - Scan Tasks for Maven artifact org.apache.maven.plugins:maven-archetype-plugin:3.0.2-SNAPSHOT in source directory linux-jdk11-m3.5.x_build/maven-archetype-plugin/src/main/java
[linux-jdk11-m3.5.x_build] [TASKS] Scanning folder '/home/jenkins/jenkins-slave/workspace/ven-archetype_ARCHETYPE-553-J4FOCNZGBVSFDFI4P3DBC7GXGJK62NFN5QH7Q5I46GZ5AP3FIVLQ' for files matching the pattern 'linux-jdk11-m3.5.x_build/archetype-testing/archetype-repository/src/main/java/**/*,linux-jdk11-m3.5.x_build/archetype-testing/archetype-proxy/src/main/java/**/*,linux-jdk11-m3.5.x_build/archetype-common/src/main/java/**/*,linux-jdk11-m3.5.x_build/maven-archetype-plugin/src/main/java/**/*' - excludes: null
[linux-jdk11-m3.5.x_build] [TASKS] Found 91 files to scan for tasks
[linux-jdk11-m3.5.x_build] [TASKS] Found 27 open tasks.
[linux-jdk11-m3.5.x_build] Skipping warnings blame since pipelines do not have an SCM link.%n
[linux-jdk11-m3.5.x_build] [TASKS] Computing warning deltas based on reference build #18
[Pipeline] [linux-jdk11-m3.5.x_build] // withMaven
[Pipeline] [linux-jdk11-m3.5.x_build] cleanWs
[linux-jdk11-m3.5.x_build] [WS-CLEANUP] Deleting project workspace...[WS-CLEANUP] done
[Pipeline] [linux-jdk11-m3.5.x_build] }
[Pipeline] [linux-jdk11-m3.5.x_build] // stage
[Pipeline] [linux-jdk11-m3.5.x_build] }
[Pipeline] [linux-jdk11-m3.5.x_build] // node
[Pipeline] [linux-jdk11-m3.5.x_build] }
[Pipeline] // parallel
[Pipeline] stage
[Pipeline] { (Notifications)
[Pipeline] echo
Build result: UNSTABLE
[Pipeline] jiraIssueSelector
[Pipeline] jiraComment
[Pipeline] jiraComment
[Pipeline] emailext
Mime
  • Unnamed multipart/mixed (inline, None, 0 bytes)
View raw message