maven-notifications mailing list archives

Site index · List index
Message view « Date » · « Thread »
Top « Date » · « Thread »
From Apache Jenkins Server <jenk...@builds.apache.org>
Subject Build failed in Jenkins: Maven TLP » maven-enforcer » MENFORCER-276 #16
Date Tue, 09 Oct 2018 05:25:27 GMT
See https://builds.apache.org/job/maven-box/job/maven-enforcer/job/MENFORCER-276/16/

Changes:

* Exclude H31 cause master is failing constantly.

No tests ran.

Build log:
[...truncated 4.23 MB...]
[windows-jdk11-m3.5.x_build] [INFO] Downloaded from central: https://repo.maven.apache.org/maven2/org/apache/maven/maven-toolchain/2.2.1/maven-toolchain-2.2.1.jar
(38 kB at 800 kB/s)
[windows-jdk11-m3.5.x_build] [INFO] Downloading from central: https://repo.maven.apache.org/maven2/org/codehaus/plexus/plexus-java/0.9.8/plexus-java-0.9.8.jar
[windows-jdk11-m3.5.x_build] [INFO] Downloaded from central: https://repo.maven.apache.org/maven2/org/apache/maven/surefire/surefire-api/2.22.0/surefire-api-2.22.0.jar
(186 kB at 3.2 MB/s)
[windows-jdk11-m3.5.x_build] [INFO] Downloading from central: https://repo.maven.apache.org/maven2/org/ow2/asm/asm/6.1.1/asm-6.1.1.jar
[windows-jdk11-m3.5.x_build] [INFO] Downloaded from central: https://repo.maven.apache.org/maven2/org/apache/maven/surefire/surefire-booter/2.22.0/surefire-booter-2.22.0.jar
(273 kB at 4.5 MB/s)
[windows-jdk11-m3.5.x_build] [INFO] Downloaded from central: https://repo.maven.apache.org/maven2/org/codehaus/plexus/plexus-java/0.9.8/plexus-java-0.9.8.jar
(35 kB at 467 kB/s)
[windows-jdk11-m3.5.x_build] [INFO] Downloaded from central: https://repo.maven.apache.org/maven2/junit/junit/4.12/junit-4.12.jar
(315 kB at 4.1 MB/s)
[windows-jdk11-m3.5.x_build] [INFO] Downloaded from central: https://repo.maven.apache.org/maven2/org/apache/maven/surefire/maven-surefire-common/2.22.0/maven-surefire-common-2.22.0.jar
(524 kB at 6.6 MB/s)
[windows-jdk11-m3.5.x_build] [INFO] Downloaded from central: https://repo.maven.apache.org/maven2/org/ow2/asm/asm/6.1.1/asm-6.1.1.jar
(108 kB at 1.3 MB/s)
[windows-jdk11-m3.5.x_build] [INFO] 
[windows-jdk11-m3.5.x_build] [INFO] --- maven-jar-plugin:3.1.0:jar (default-jar) @ enforcer-api
---
[windows-jdk11-m3.5.x_build] [INFO] Downloading from central: https://repo.maven.apache.org/maven2/org/apache/maven/maven-archiver/3.2.0/maven-archiver-3.2.0.pom
[windows-jdk11-m3.5.x_build] [INFO] Downloaded from central: https://repo.maven.apache.org/maven2/org/apache/maven/maven-archiver/3.2.0/maven-archiver-3.2.0.pom
(4.3 kB at 392 kB/s)
[windows-jdk11-m3.5.x_build] [INFO] Downloading from central: https://repo.maven.apache.org/maven2/org/apache/maven/shared/maven-shared-utils/3.2.0/maven-shared-utils-3.2.0.pom
[windows-jdk11-m3.5.x_build] [INFO] Downloaded from central: https://repo.maven.apache.org/maven2/org/apache/maven/shared/maven-shared-utils/3.2.0/maven-shared-utils-3.2.0.pom
(4.9 kB at 613 kB/s)
[windows-jdk11-m3.5.x_build] [INFO] Downloading from central: https://repo.maven.apache.org/maven2/org/codehaus/plexus/plexus-archiver/3.5/plexus-archiver-3.5.pom
[windows-jdk11-m3.5.x_build] [INFO] Downloaded from central: https://repo.maven.apache.org/maven2/org/codehaus/plexus/plexus-archiver/3.5/plexus-archiver-3.5.pom
(4.8 kB at 687 kB/s)
[windows-jdk11-m3.5.x_build] [INFO] Downloading from central: https://repo.maven.apache.org/maven2/org/codehaus/plexus/plexus/5.0/plexus-5.0.pom
[windows-jdk11-m3.5.x_build] [INFO] Downloaded from central: https://repo.maven.apache.org/maven2/org/codehaus/plexus/plexus/5.0/plexus-5.0.pom
(21 kB at 2.4 MB/s)
[windows-jdk11-m3.5.x_build] [INFO] Downloading from central: https://repo.maven.apache.org/maven2/org/codehaus/plexus/plexus-io/3.0.0/plexus-io-3.0.0.pom
[windows-jdk11-m3.5.x_build] [INFO] Downloaded from central: https://repo.maven.apache.org/maven2/org/codehaus/plexus/plexus-io/3.0.0/plexus-io-3.0.0.pom
(4.5 kB at 650 kB/s)
[windows-jdk11-m3.5.x_build] [INFO] Downloading from central: https://repo.maven.apache.org/maven2/org/apache/commons/commons-compress/1.14/commons-compress-1.14.pom
[windows-jdk11-m3.5.x_build] [INFO] Downloaded from central: https://repo.maven.apache.org/maven2/org/apache/commons/commons-compress/1.14/commons-compress-1.14.pom
(13 kB at 1.9 MB/s)
[windows-jdk11-m3.5.x_build] [INFO] Downloading from central: https://repo.maven.apache.org/maven2/org/apache/commons/commons-parent/42/commons-parent-42.pom
[windows-jdk11-m3.5.x_build] [INFO] Downloaded from central: https://repo.maven.apache.org/maven2/org/apache/commons/commons-parent/42/commons-parent-42.pom
(68 kB at 5.7 MB/s)
[windows-jdk11-m3.5.x_build] [INFO] Downloading from central: https://repo.maven.apache.org/maven2/org/tukaani/xz/1.6/xz-1.6.pom
[windows-jdk11-m3.5.x_build] [INFO] Downloaded from central: https://repo.maven.apache.org/maven2/org/tukaani/xz/1.6/xz-1.6.pom
(1.9 kB at 212 kB/s)
[windows-jdk11-m3.5.x_build] [INFO] Downloading from central: https://repo.maven.apache.org/maven2/org/apache/maven/maven-archiver/3.2.0/maven-archiver-3.2.0.jar
[windows-jdk11-m3.5.x_build] [INFO] Downloading from central: https://repo.maven.apache.org/maven2/org/apache/commons/commons-compress/1.14/commons-compress-1.14.jar
[windows-jdk11-m3.5.x_build] [INFO] Downloading from central: https://repo.maven.apache.org/maven2/org/apache/maven/shared/maven-shared-utils/3.2.0/maven-shared-utils-3.2.0.jar
[windows-jdk11-m3.5.x_build] [INFO] Downloading from central: https://repo.maven.apache.org/maven2/org/codehaus/plexus/plexus-archiver/3.5/plexus-archiver-3.5.jar
[windows-jdk11-m3.5.x_build] [INFO] Downloading from central: https://repo.maven.apache.org/maven2/org/codehaus/plexus/plexus-io/3.0.0/plexus-io-3.0.0.jar
[windows-jdk11-m3.5.x_build] [INFO] Downloaded from central: https://repo.maven.apache.org/maven2/org/apache/maven/maven-archiver/3.2.0/maven-archiver-3.2.0.jar
(24 kB at 1.6 MB/s)
[windows-jdk11-m3.5.x_build] [INFO] Downloading from central: https://repo.maven.apache.org/maven2/org/tukaani/xz/1.6/xz-1.6.jar
[windows-jdk11-m3.5.x_build] [INFO] Downloaded from central: https://repo.maven.apache.org/maven2/org/codehaus/plexus/plexus-io/3.0.0/plexus-io-3.0.0.jar
(74 kB at 2.5 MB/s)
[windows-jdk11-m3.5.x_build] [INFO] Downloaded from central: https://repo.maven.apache.org/maven2/org/apache/maven/shared/maven-shared-utils/3.2.0/maven-shared-utils-3.2.0.jar
(165 kB at 5.5 MB/s)
[windows-jdk11-m3.5.x_build] [INFO] Downloaded from central: https://repo.maven.apache.org/maven2/org/tukaani/xz/1.6/xz-1.6.jar
(103 kB at 3.3 MB/s)
[windows-jdk11-m3.5.x_build] [INFO] Downloaded from central: https://repo.maven.apache.org/maven2/org/codehaus/plexus/plexus-archiver/3.5/plexus-archiver-3.5.jar
(187 kB at 4.3 MB/s)
[windows-jdk11-m3.5.x_build] [INFO] Downloaded from central: https://repo.maven.apache.org/maven2/org/apache/commons/commons-compress/1.14/commons-compress-1.14.jar
(530 kB at 9.8 MB/s)
[windows-jdk11-m3.5.x_build] [INFO] Building jar: F:\jenkins\jenkins-slave\workspace\aven-enforcer_MENFORCER-276-ARAEEUQ3DZKGP7LK65FX6C75KHKIJYNAPASQYCZKRS4IVUWL44FA@2\windows-jdk11-m3.5.x_build\enforcer-api\target\enforcer-api-3.0.0-SNAPSHOT.jar
[windows-jdk11-m3.5.x_build] [INFO] 
[windows-jdk11-m3.5.x_build] [INFO] --- maven-site-plugin:3.7.1:attach-descriptor (attach-descriptor)
@ enforcer-api ---
[windows-jdk11-m3.5.x_build] [INFO] Skipping because packaging 'jar' is not pom.
[windows-jdk11-m3.5.x_build] [INFO] 
[windows-jdk11-m3.5.x_build] [INFO] --- maven-checkstyle-plugin:3.0.0:check (checkstyle-check)
@ enforcer-api ---
[windows-jdk11-m3.5.x_build] [INFO] 
[windows-jdk11-m3.5.x_build] [INFO] ------------------------------------------------------------------------
[windows-jdk11-m3.5.x_build] [INFO] Building Apache Maven Enforcer Built-In Rules 3.0.0-SNAPSHOT
[windows-jdk11-m3.5.x_build] [INFO] ------------------------------------------------------------------------
[windows-jdk11-m3.5.x_build] [INFO] Downloading from central: https://repo.maven.apache.org/maven2/org/apache/maven/shared/maven-common-artifact-filters/3.0.1/maven-common-artifact-filters-3.0.1.pom
[windows-jdk11-m3.5.x_build] [INFO] Downloaded from central: https://repo.maven.apache.org/maven2/org/apache/maven/shared/maven-common-artifact-filters/3.0.1/maven-common-artifact-filters-3.0.1.pom
(4.8 kB at 64 kB/s)
[windows-jdk11-m3.5.x_build] [INFO] Downloading from central: https://repo.maven.apache.org/maven2/org/apache/maven/plugin-testing/maven-plugin-testing-harness/2.1/maven-plugin-testing-harness-2.1.pom
[windows-jdk11-m3.5.x_build] [INFO] Downloaded from central: https://repo.maven.apache.org/maven2/org/apache/maven/plugin-testing/maven-plugin-testing-harness/2.1/maven-plugin-testing-harness-2.1.pom
(3.2 kB at 461 kB/s)
[windows-jdk11-m3.5.x_build] [INFO] Downloading from central: https://repo.maven.apache.org/maven2/org/apache/maven/plugin-testing/maven-plugin-testing/2.1/maven-plugin-testing-2.1.pom
[windows-jdk11-m3.5.x_build] [INFO] Downloaded from central: https://repo.maven.apache.org/maven2/org/apache/maven/plugin-testing/maven-plugin-testing/2.1/maven-plugin-testing-2.1.pom
(10 kB at 502 kB/s)
[windows-jdk11-m3.5.x_build] [INFO] Downloading from central: https://repo.maven.apache.org/maven2/commons-codec/commons-codec/1.6/commons-codec-1.6.pom
[windows-jdk11-m3.5.x_build] [INFO] Downloaded from central: https://repo.maven.apache.org/maven2/commons-codec/commons-codec/1.6/commons-codec-1.6.pom
(11 kB at 1.1 MB/s)
[windows-jdk11-m3.5.x_build] [INFO] Downloading from central: https://repo.maven.apache.org/maven2/org/apache/commons/commons-parent/22/commons-parent-22.pom
[windows-jdk11-m3.5.x_build] [INFO] Downloaded from central: https://repo.maven.apache.org/maven2/org/apache/commons/commons-parent/22/commons-parent-22.pom
(42 kB at 2.8 MB/s)
[windows-jdk11-m3.5.x_build] [INFO] Downloading from central: https://repo.maven.apache.org/maven2/org/mockito/mockito-core/2.18.3/mockito-core-2.18.3.pom
[windows-jdk11-m3.5.x_build] [INFO] Downloaded from central: https://repo.maven.apache.org/maven2/org/mockito/mockito-core/2.18.3/mockito-core-2.18.3.pom
(16 kB at 1.5 MB/s)
[windows-jdk11-m3.5.x_build] [INFO] Downloading from central: https://repo.maven.apache.org/maven2/net/bytebuddy/byte-buddy/1.8.5/byte-buddy-1.8.5.pom
[windows-jdk11-m3.5.x_build] [INFO] Downloaded from central: https://repo.maven.apache.org/maven2/net/bytebuddy/byte-buddy/1.8.5/byte-buddy-1.8.5.pom
(12 kB at 1.5 MB/s)
[windows-jdk11-m3.5.x_build] [INFO] Downloading from central: https://repo.maven.apache.org/maven2/net/bytebuddy/byte-buddy-parent/1.8.5/byte-buddy-parent-1.8.5.pom
[windows-jdk11-m3.5.x_build] [INFO] Downloaded from central: https://repo.maven.apache.org/maven2/net/bytebuddy/byte-buddy-parent/1.8.5/byte-buddy-parent-1.8.5.pom
(27 kB at 3.0 MB/s)
[windows-jdk11-m3.5.x_build] [INFO] Downloading from central: https://repo.maven.apache.org/maven2/net/bytebuddy/byte-buddy-agent/1.8.5/byte-buddy-agent-1.8.5.pom
[windows-jdk11-m3.5.x_build] [INFO] Downloaded from central: https://repo.maven.apache.org/maven2/net/bytebuddy/byte-buddy-agent/1.8.5/byte-buddy-agent-1.8.5.pom
(4.9 kB at 547 kB/s)
[windows-jdk11-m3.5.x_build] [INFO] Downloading from central: https://repo.maven.apache.org/maven2/org/objenesis/objenesis/2.6/objenesis-2.6.pom
[windows-jdk11-m3.5.x_build] [INFO] Downloaded from central: https://repo.maven.apache.org/maven2/org/objenesis/objenesis/2.6/objenesis-2.6.pom
(2.8 kB at 464 kB/s)
[windows-jdk11-m3.5.x_build] [INFO] Downloading from central: https://repo.maven.apache.org/maven2/org/objenesis/objenesis-parent/2.6/objenesis-parent-2.6.pom
[windows-jdk11-m3.5.x_build] [INFO] Downloaded from central: https://repo.maven.apache.org/maven2/org/objenesis/objenesis-parent/2.6/objenesis-parent-2.6.pom
(17 kB at 2.4 MB/s)
[windows-jdk11-m3.5.x_build] [INFO] Downloading from central: https://repo.maven.apache.org/maven2/org/apache/maven/maven-compat/3.0/maven-compat-3.0.pom
[windows-jdk11-m3.5.x_build] [INFO] Downloaded from central: https://repo.maven.apache.org/maven2/org/apache/maven/maven-compat/3.0/maven-compat-3.0.pom
(4.0 kB at 670 kB/s)
[windows-jdk11-m3.5.x_build] [INFO] Downloading from central: https://repo.maven.apache.org/maven2/org/apache/maven/wagon/wagon-provider-api/1.0-beta-6/wagon-provider-api-1.0-beta-6.pom
[windows-jdk11-m3.5.x_build] [INFO] Downloaded from central: https://repo.maven.apache.org/maven2/org/apache/maven/wagon/wagon-provider-api/1.0-beta-6/wagon-provider-api-1.0-beta-6.pom
(1.8 kB at 293 kB/s)
[windows-jdk11-m3.5.x_build] [INFO] Downloading from central: https://repo.maven.apache.org/maven2/org/apache/maven/wagon/wagon/1.0-beta-6/wagon-1.0-beta-6.pom
[windows-jdk11-m3.5.x_build] [INFO] Downloaded from central: https://repo.maven.apache.org/maven2/org/apache/maven/wagon/wagon/1.0-beta-6/wagon-1.0-beta-6.pom
(12 kB at 1.2 MB/s)
[windows-jdk11-m3.5.x_build] [INFO] Downloading from central: https://repo.maven.apache.org/maven2/org/assertj/assertj-core/1.7.1/assertj-core-1.7.1.pom
[windows-jdk11-m3.5.x_build] [INFO] Downloaded from central: https://repo.maven.apache.org/maven2/org/assertj/assertj-core/1.7.1/assertj-core-1.7.1.pom
(4.7 kB at 668 kB/s)
[windows-jdk11-m3.5.x_build] [INFO] Downloading from central: https://repo.maven.apache.org/maven2/org/assertj/assertj-parent-pom/1.2.6/assertj-parent-pom-1.2.6.pom
[windows-jdk11-m3.5.x_build] [INFO] Downloaded from central: https://repo.maven.apache.org/maven2/org/assertj/assertj-parent-pom/1.2.6/assertj-parent-pom-1.2.6.pom
(13 kB at 2.2 MB/s)
[windows-jdk11-m3.5.x_build] [INFO] Downloading from central: https://repo.maven.apache.org/maven2/org/apache/maven/shared/maven-common-artifact-filters/3.0.1/maven-common-artifact-filters-3.0.1.jar
[windows-jdk11-m3.5.x_build] [INFO] Downloading from central: https://repo.maven.apache.org/maven2/org/apache/maven/plugin-testing/maven-plugin-testing-harness/2.1/maven-plugin-testing-harness-2.1.jar
[windows-jdk11-m3.5.x_build] [INFO] Downloading from central: https://repo.maven.apache.org/maven2/org/apache/commons/commons-lang3/3.5/commons-lang3-3.5.jar
[windows-jdk11-m3.5.x_build] [INFO] Downloading from central: https://repo.maven.apache.org/maven2/org/mockito/mockito-core/2.18.3/mockito-core-2.18.3.jar
[windows-jdk11-m3.5.x_build] [INFO] Downloading from central: https://repo.maven.apache.org/maven2/commons-codec/commons-codec/1.6/commons-codec-1.6.jar
[windows-jdk11-m3.5.x_build] [INFO] Downloaded from central: https://repo.maven.apache.org/maven2/org/apache/maven/shared/maven-common-artifact-filters/3.0.1/maven-common-artifact-filters-3.0.1.jar
(61 kB at 5.6 MB/s)
[windows-jdk11-m3.5.x_build] [INFO] Downloading from central: https://repo.maven.apache.org/maven2/net/bytebuddy/byte-buddy/1.8.5/byte-buddy-1.8.5.jar
[windows-jdk11-m3.5.x_build] [INFO] Downloaded from central: https://repo.maven.apache.org/maven2/org/apache/maven/plugin-testing/maven-plugin-testing-harness/2.1/maven-plugin-testing-harness-2.1.jar
(39 kB at 2.6 MB/s)
[windows-jdk11-m3.5.x_build] [INFO] Downloading from central: https://repo.maven.apache.org/maven2/net/bytebuddy/byte-buddy-agent/1.8.5/byte-buddy-agent-1.8.5.jar
[windows-jdk11-m3.5.x_build] [INFO] Downloaded from central: https://repo.maven.apache.org/maven2/commons-codec/commons-codec/1.6/commons-codec-1.6.jar
(233 kB at 10 MB/s)
[windows-jdk11-m3.5.x_build] [INFO] Downloading from central: https://repo.maven.apache.org/maven2/org/objenesis/objenesis/2.6/objenesis-2.6.jar
[windows-jdk11-m3.5.x_build] [INFO] Downloaded from central: https://repo.maven.apache.org/maven2/net/bytebuddy/byte-buddy-agent/1.8.5/byte-buddy-agent-1.8.5.jar
(40 kB at 1.4 MB/s)
[windows-jdk11-m3.5.x_build] [INFO] Downloading from central: https://repo.maven.apache.org/maven2/org/apache/maven/maven-compat/3.0/maven-compat-3.0.jar
[windows-jdk11-m3.5.x_build] [INFO] Downloaded from central: https://repo.maven.apache.org/maven2/org/objenesis/objenesis/2.6/objenesis-2.6.jar
(56 kB at 1.6 MB/s)
[windows-jdk11-m3.5.x_build] [INFO] Downloading from central: https://repo.maven.apache.org/maven2/org/apache/maven/wagon/wagon-provider-api/1.0-beta-6/wagon-provider-api-1.0-beta-6.jar
[windows-jdk11-m3.5.x_build] [INFO] Downloaded from central: https://repo.maven.apache.org/maven2/org/apache/maven/wagon/wagon-provider-api/1.0-beta-6/wagon-provider-api-1.0-beta-6.jar
(53 kB at 1.1 MB/s)
[windows-jdk11-m3.5.x_build] [INFO] Downloading from central: https://repo.maven.apache.org/maven2/org/assertj/assertj-core/1.7.1/assertj-core-1.7.1.jar
[windows-jdk11-m3.5.x_build] [INFO] Downloaded from central: https://repo.maven.apache.org/maven2/org/apache/commons/commons-lang3/3.5/commons-lang3-3.5.jar
(480 kB at 8.4 MB/s)
[windows-jdk11-m3.5.x_build] [INFO] Downloaded from central: https://repo.maven.apache.org/maven2/org/mockito/mockito-core/2.18.3/mockito-core-2.18.3.jar
(556 kB at 6.5 MB/s)
[windows-jdk11-m3.5.x_build] [INFO] Downloaded from central: https://repo.maven.apache.org/maven2/org/apache/maven/maven-compat/3.0/maven-compat-3.0.jar
(285 kB at 3.4 MB/s)
[windows-jdk11-m3.5.x_build] [INFO] Downloaded from central: https://repo.maven.apache.org/maven2/net/bytebuddy/byte-buddy/1.8.5/byte-buddy-1.8.5.jar
(3.0 MB at 29 MB/s)
[windows-jdk11-m3.5.x_build] [INFO] Downloaded from central: https://repo.maven.apache.org/maven2/org/assertj/assertj-core/1.7.1/assertj-core-1.7.1.jar
(619 kB at 6.0 MB/s)
[windows-jdk11-m3.5.x_build] [INFO] 
[windows-jdk11-m3.5.x_build] [INFO] --- maven-clean-plugin:3.1.0:clean (default-clean) @ enforcer-rules
---
[windows-jdk11-m3.5.x_build] [INFO] 
[windows-jdk11-m3.5.x_build] [INFO] --- maven-enforcer-plugin:1.4.1:enforce (enforce-maven-version)
@ enforcer-rules ---
[windows-jdk11-m3.5.x_build] [INFO] 
[windows-jdk11-m3.5.x_build] [INFO] --- maven-enforcer-plugin:1.4.1:enforce (enforce-bytecode-version)
@ enforcer-rules ---
[windows-jdk11-m3.5.x_build] [INFO] 
[windows-jdk11-m3.5.x_build] [INFO] --- maven-enforcer-plugin:1.4.1:enforce (ban-known-bad-maven-versions)
@ enforcer-rules ---
[windows-jdk11-m3.5.x_build] [INFO] 
[windows-jdk11-m3.5.x_build] [INFO] --- apache-rat-plugin:0.12:check (rat-check) @ enforcer-rules
---
[windows-jdk11-m3.5.x_build] [INFO] Enabled default license matchers.
[windows-jdk11-m3.5.x_build] [INFO] Will parse SCM ignores for exclusions...
[windows-jdk11-m3.5.x_build] [INFO] Finished adding exclusions from SCM ignore files.
[windows-jdk11-m3.5.x_build] [INFO] 61 implicit excludes (use -debug for more details).
[windows-jdk11-m3.5.x_build] [INFO] Exclude: .repository/**
[windows-jdk11-m3.5.x_build] [INFO] Exclude: .maven/spy.log
[windows-jdk11-m3.5.x_build] [INFO] Exclude: dependency-reduced-pom.xml
[windows-jdk11-m3.5.x_build] [INFO] Exclude: .java-version
[windows-jdk11-m3.5.x_build] [INFO] 129 resources included (use -debug for more details)
[windows-jdk11-m3.5.x_build] [INFO] Rat check: Summary over all files. Unapproved: 0, unknown:
0, generated: 0, approved: 123 licenses.
[windows-jdk11-m3.5.x_build] [INFO] 
[windows-jdk11-m3.5.x_build] [INFO] --- maven-remote-resources-plugin:1.5:process (process-resource-bundles)
@ enforcer-rules ---
[windows-jdk11-m3.5.x_build] [INFO] 
[windows-jdk11-m3.5.x_build] [INFO] --- maven-resources-plugin:3.1.0:resources (default-resources)
@ enforcer-rules ---
[windows-jdk11-m3.5.x_build] [INFO] Using 'UTF-8' encoding to copy filtered resources.
[windows-jdk11-m3.5.x_build] [INFO] skip non existing resourceDirectory F:\jenkins\jenkins-slave\workspace\aven-enforcer_MENFORCER-276-ARAEEUQ3DZKGP7LK65FX6C75KHKIJYNAPASQYCZKRS4IVUWL44FA@2\windows-jdk11-m3.5.x_build\enforcer-rules\src\main\resources
[windows-jdk11-m3.5.x_build] [INFO] Copying 3 resources
[windows-jdk11-m3.5.x_build] [INFO] 
[windows-jdk11-m3.5.x_build] [INFO] --- maven-compiler-plugin:3.7.0:compile (default-compile)
@ enforcer-rules ---
[windows-jdk11-m3.5.x_build] [INFO] Changes detected - recompiling the module!
[windows-jdk11-m3.5.x_build] [INFO] Compiling 43 source files to F:\jenkins\jenkins-slave\workspace\aven-enforcer_MENFORCER-276-ARAEEUQ3DZKGP7LK65FX6C75KHKIJYNAPASQYCZKRS4IVUWL44FA@2\windows-jdk11-m3.5.x_build\enforcer-rules\target\classes
[windows-jdk11-m3.5.x_build] [INFO] /F:/jenkins/jenkins-slave/workspace/aven-enforcer_MENFORCER-276-ARAEEUQ3DZKGP7LK65FX6C75KHKIJYNAPASQYCZKRS4IVUWL44FA@2/windows-jdk11-m3.5.x_build/enforcer-rules/src/main/java/org/apache/maven/plugins/enforcer/RequireUpperBoundDeps.java:
Some input files use or override a deprecated API.
[windows-jdk11-m3.5.x_build] [INFO] /F:/jenkins/jenkins-slave/workspace/aven-enforcer_MENFORCER-276-ARAEEUQ3DZKGP7LK65FX6C75KHKIJYNAPASQYCZKRS4IVUWL44FA@2/windows-jdk11-m3.5.x_build/enforcer-rules/src/main/java/org/apache/maven/plugins/enforcer/RequireUpperBoundDeps.java:
Recompile with -Xlint:deprecation for details.
[windows-jdk11-m3.5.x_build] [INFO] /F:/jenkins/jenkins-slave/workspace/aven-enforcer_MENFORCER-276-ARAEEUQ3DZKGP7LK65FX6C75KHKIJYNAPASQYCZKRS4IVUWL44FA@2/windows-jdk11-m3.5.x_build/enforcer-rules/src/main/java/org/apache/maven/plugins/enforcer/RequirePluginVersions.java:
F:\jenkins\jenkins-slave\workspace\aven-enforcer_MENFORCER-276-ARAEEUQ3DZKGP7LK65FX6C75KHKIJYNAPASQYCZKRS4IVUWL44FA@2\windows-jdk11-m3.5.x_build\enforcer-rules\src\main\java\org\apache\maven\plugins\enforcer\RequirePluginVersions.java
uses unchecked or unsafe operations.
[windows-jdk11-m3.5.x_build] [INFO] /F:/jenkins/jenkins-slave/workspace/aven-enforcer_MENFORCER-276-ARAEEUQ3DZKGP7LK65FX6C75KHKIJYNAPASQYCZKRS4IVUWL44FA@2/windows-jdk11-m3.5.x_build/enforcer-rules/src/main/java/org/apache/maven/plugins/enforcer/RequirePluginVersions.java:
Recompile with -Xlint:unchecked for details.
[windows-jdk11-m3.5.x_build] [INFO] 
[windows-jdk11-m3.5.x_build] [INFO] --- maven-resources-plugin:3.1.0:testResources (default-testResources)
@ enforcer-rules ---
[windows-jdk11-m3.5.x_build] [INFO] Using 'UTF-8' encoding to copy filtered resources.
[windows-jdk11-m3.5.x_build] [INFO] Copying 11 resources
[windows-jdk11-m3.5.x_build] [INFO] Copying 3 resources
[windows-jdk11-m3.5.x_build] [INFO] 
[windows-jdk11-m3.5.x_build] [INFO] --- maven-compiler-plugin:3.7.0:testCompile (default-testCompile)
@ enforcer-rules ---
[windows-jdk11-m3.5.x_build] [INFO] Changes detected - recompiling the module!
[windows-jdk11-m3.5.x_build] [INFO] Compiling 34 source files to F:\jenkins\jenkins-slave\workspace\aven-enforcer_MENFORCER-276-ARAEEUQ3DZKGP7LK65FX6C75KHKIJYNAPASQYCZKRS4IVUWL44FA@2\windows-jdk11-m3.5.x_build\enforcer-rules\target\test-classes
[windows-jdk11-m3.5.x_build] [INFO] /F:/jenkins/jenkins-slave/workspace/aven-enforcer_MENFORCER-276-ARAEEUQ3DZKGP7LK65FX6C75KHKIJYNAPASQYCZKRS4IVUWL44FA@2/windows-jdk11-m3.5.x_build/enforcer-rules/src/test/java/org/apache/maven/plugins/enforcer/MockProject.java:
Some input files use or override a deprecated API.
[windows-jdk11-m3.5.x_build] [INFO] /F:/jenkins/jenkins-slave/workspace/aven-enforcer_MENFORCER-276-ARAEEUQ3DZKGP7LK65FX6C75KHKIJYNAPASQYCZKRS4IVUWL44FA@2/windows-jdk11-m3.5.x_build/enforcer-rules/src/test/java/org/apache/maven/plugins/enforcer/MockProject.java:
Recompile with -Xlint:deprecation for details.
[windows-jdk11-m3.5.x_build] [INFO] /F:/jenkins/jenkins-slave/workspace/aven-enforcer_MENFORCER-276-ARAEEUQ3DZKGP7LK65FX6C75KHKIJYNAPASQYCZKRS4IVUWL44FA@2/windows-jdk11-m3.5.x_build/enforcer-rules/src/test/java/org/apache/maven/plugins/enforcer/MockProject.java:
Some input files use unchecked or unsafe operations.
[windows-jdk11-m3.5.x_build] [INFO] /F:/jenkins/jenkins-slave/workspace/aven-enforcer_MENFORCER-276-ARAEEUQ3DZKGP7LK65FX6C75KHKIJYNAPASQYCZKRS4IVUWL44FA@2/windows-jdk11-m3.5.x_build/enforcer-rules/src/test/java/org/apache/maven/plugins/enforcer/MockProject.java:
Recompile with -Xlint:unchecked for details.
[windows-jdk11-m3.5.x_build] [INFO] -------------------------------------------------------------
[windows-jdk11-m3.5.x_build] [ERROR] COMPILATION ERROR : 
[windows-jdk11-m3.5.x_build] [INFO] -------------------------------------------------------------
[windows-jdk11-m3.5.x_build] [ERROR] /F:/jenkins/jenkins-slave/workspace/aven-enforcer_MENFORCER-276-ARAEEUQ3DZKGP7LK65FX6C75KHKIJYNAPASQYCZKRS4IVUWL44FA@2/windows-jdk11-m3.5.x_build/enforcer-rules/src/test/java/org/apache/maven/plugins/enforcer/TestRequireUpperBoundDeps.java:[14,47]
cannot find symbol
[windows-jdk11-m3.5.x_build]   symbol:   class TestEnforcerRuleUtils
[windows-jdk11-m3.5.x_build]   location: package org.apache.maven.plugins.enforcer.utils
[windows-jdk11-m3.5.x_build] [ERROR] /F:/jenkins/jenkins-slave/workspace/aven-enforcer_MENFORCER-276-ARAEEUQ3DZKGP7LK65FX6C75KHKIJYNAPASQYCZKRS4IVUWL44FA@2/windows-jdk11-m3.5.x_build/enforcer-rules/src/test/java/org/apache/maven/plugins/enforcer/TestRequireUpperBoundDeps.java:[87,9]
cannot find symbol
[windows-jdk11-m3.5.x_build]   symbol:   variable TestEnforcerRuleUtils
[windows-jdk11-m3.5.x_build]   location: class org.apache.maven.plugins.enforcer.TestRequireUpperBoundDeps
[windows-jdk11-m3.5.x_build] [ERROR] /F:/jenkins/jenkins-slave/workspace/aven-enforcer_MENFORCER-276-ARAEEUQ3DZKGP7LK65FX6C75KHKIJYNAPASQYCZKRS4IVUWL44FA@2/windows-jdk11-m3.5.x_build/enforcer-rules/src/test/java/org/apache/maven/plugins/enforcer/TestRequireUpperBoundDeps.java:[97,9]
cannot find symbol
[windows-jdk11-m3.5.x_build]   symbol:   variable TestEnforcerRuleUtils
[windows-jdk11-m3.5.x_build]   location: class org.apache.maven.plugins.enforcer.TestRequireUpperBoundDeps
[windows-jdk11-m3.5.x_build] [ERROR] /F:/jenkins/jenkins-slave/workspace/aven-enforcer_MENFORCER-276-ARAEEUQ3DZKGP7LK65FX6C75KHKIJYNAPASQYCZKRS4IVUWL44FA@2/windows-jdk11-m3.5.x_build/enforcer-rules/src/test/java/org/apache/maven/plugins/enforcer/TestRequireUpperBoundDeps.java:[107,9]
cannot find symbol
[windows-jdk11-m3.5.x_build]   symbol:   variable TestEnforcerRuleUtils
[windows-jdk11-m3.5.x_build]   location: class org.apache.maven.plugins.enforcer.TestRequireUpperBoundDeps
[windows-jdk11-m3.5.x_build] [ERROR] /F:/jenkins/jenkins-slave/workspace/aven-enforcer_MENFORCER-276-ARAEEUQ3DZKGP7LK65FX6C75KHKIJYNAPASQYCZKRS4IVUWL44FA@2/windows-jdk11-m3.5.x_build/enforcer-rules/src/test/java/org/apache/maven/plugins/enforcer/TestRequireUpperBoundDeps.java:[118,9]
cannot find symbol
[windows-jdk11-m3.5.x_build]   symbol:   variable TestEnforcerRuleUtils
[windows-jdk11-m3.5.x_build]   location: class org.apache.maven.plugins.enforcer.TestRequireUpperBoundDeps
[windows-jdk11-m3.5.x_build] [INFO] 5 errors 
[windows-jdk11-m3.5.x_build] [INFO] -------------------------------------------------------------
[windows-jdk11-m3.5.x_build] [INFO] ------------------------------------------------------------------------
[windows-jdk11-m3.5.x_build] [INFO] Reactor Summary:
[windows-jdk11-m3.5.x_build] [INFO] 
[windows-jdk11-m3.5.x_build] [INFO] Apache Maven Enforcer .............................. SUCCESS
[ 17.192 s]
[windows-jdk11-m3.5.x_build] [INFO] Apache Maven Enforcer API .......................... SUCCESS
[  5.413 s]
[windows-jdk11-m3.5.x_build] [INFO] Apache Maven Enforcer Built-In Rules ............... FAILURE
[  6.589 s]
[windows-jdk11-m3.5.x_build] [INFO] Apache Maven Enforcer Plugin ....................... SKIPPED
[windows-jdk11-m3.5.x_build] [INFO] ------------------------------------------------------------------------
[windows-jdk11-m3.5.x_build] [INFO] BUILD FAILURE
[windows-jdk11-m3.5.x_build] [INFO] ------------------------------------------------------------------------
[windows-jdk11-m3.5.x_build] [INFO] Total time: 30.782 s
[windows-jdk11-m3.5.x_build] [INFO] Finished at: 2018-10-09T05:25:25Z
[windows-jdk11-m3.5.x_build] [INFO] Final Memory: 39M/137M
[windows-jdk11-m3.5.x_build] [INFO] ------------------------------------------------------------------------
[windows-jdk11-m3.5.x_build] [INFO] [jenkins-event-spy] Generated F:\jenkins\jenkins-slave\workspace\aven-enforcer_MENFORCER-276-ARAEEUQ3DZKGP7LK65FX6C75KHKIJYNAPASQYCZKRS4IVUWL44FA@2@tmp\withMavenb0eb365d\maven-spy-20181009-052454-3942088235421001077076.log
[windows-jdk11-m3.5.x_build] [ERROR] Failed to execute goal org.apache.maven.plugins:maven-compiler-plugin:3.7.0:testCompile
(default-testCompile) on project enforcer-rules: Compilation failure: Compilation failure:

[windows-jdk11-m3.5.x_build] [ERROR] /F:/jenkins/jenkins-slave/workspace/aven-enforcer_MENFORCER-276-ARAEEUQ3DZKGP7LK65FX6C75KHKIJYNAPASQYCZKRS4IVUWL44FA@2/windows-jdk11-m3.5.x_build/enforcer-rules/src/test/java/org/apache/maven/plugins/enforcer/TestRequireUpperBoundDeps.java:[14,47]
cannot find symbol
[windows-jdk11-m3.5.x_build] [ERROR]   symbol:   class TestEnforcerRuleUtils
[windows-jdk11-m3.5.x_build] [ERROR]   location: package org.apache.maven.plugins.enforcer.utils
[windows-jdk11-m3.5.x_build] [ERROR] /F:/jenkins/jenkins-slave/workspace/aven-enforcer_MENFORCER-276-ARAEEUQ3DZKGP7LK65FX6C75KHKIJYNAPASQYCZKRS4IVUWL44FA@2/windows-jdk11-m3.5.x_build/enforcer-rules/src/test/java/org/apache/maven/plugins/enforcer/TestRequireUpperBoundDeps.java:[87,9]
cannot find symbol
[windows-jdk11-m3.5.x_build] [ERROR]   symbol:   variable TestEnforcerRuleUtils
[windows-jdk11-m3.5.x_build] [ERROR]   location: class org.apache.maven.plugins.enforcer.TestRequireUpperBoundDeps
[windows-jdk11-m3.5.x_build] [ERROR] /F:/jenkins/jenkins-slave/workspace/aven-enforcer_MENFORCER-276-ARAEEUQ3DZKGP7LK65FX6C75KHKIJYNAPASQYCZKRS4IVUWL44FA@2/windows-jdk11-m3.5.x_build/enforcer-rules/src/test/java/org/apache/maven/plugins/enforcer/TestRequireUpperBoundDeps.java:[97,9]
cannot find symbol
[windows-jdk11-m3.5.x_build] [ERROR]   symbol:   variable TestEnforcerRuleUtils
[windows-jdk11-m3.5.x_build] [ERROR]   location: class org.apache.maven.plugins.enforcer.TestRequireUpperBoundDeps
[windows-jdk11-m3.5.x_build] [ERROR] /F:/jenkins/jenkins-slave/workspace/aven-enforcer_MENFORCER-276-ARAEEUQ3DZKGP7LK65FX6C75KHKIJYNAPASQYCZKRS4IVUWL44FA@2/windows-jdk11-m3.5.x_build/enforcer-rules/src/test/java/org/apache/maven/plugins/enforcer/TestRequireUpperBoundDeps.java:[107,9]
cannot find symbol
[windows-jdk11-m3.5.x_build] [ERROR]   symbol:   variable TestEnforcerRuleUtils
[windows-jdk11-m3.5.x_build] [ERROR]   location: class org.apache.maven.plugins.enforcer.TestRequireUpperBoundDeps
[windows-jdk11-m3.5.x_build] [ERROR] /F:/jenkins/jenkins-slave/workspace/aven-enforcer_MENFORCER-276-ARAEEUQ3DZKGP7LK65FX6C75KHKIJYNAPASQYCZKRS4IVUWL44FA@2/windows-jdk11-m3.5.x_build/enforcer-rules/src/test/java/org/apache/maven/plugins/enforcer/TestRequireUpperBoundDeps.java:[118,9]
cannot find symbol
[windows-jdk11-m3.5.x_build] [ERROR]   symbol:   variable TestEnforcerRuleUtils
[windows-jdk11-m3.5.x_build] [ERROR]   location: class org.apache.maven.plugins.enforcer.TestRequireUpperBoundDeps
[windows-jdk11-m3.5.x_build] [ERROR] -> [Help 1]
[windows-jdk11-m3.5.x_build] [ERROR] 
[windows-jdk11-m3.5.x_build] [ERROR] To see the full stack trace of the errors, re-run Maven
with the -e switch.
[windows-jdk11-m3.5.x_build] [ERROR] Re-run Maven using the -X switch to enable full debug
logging.
[windows-jdk11-m3.5.x_build] [ERROR] 
[windows-jdk11-m3.5.x_build] [ERROR] For more information about the errors and possible solutions,
please read the following articles:
[windows-jdk11-m3.5.x_build] [ERROR] [Help 1] http://cwiki.apache.org/confluence/display/MAVEN/MojoFailureException
[windows-jdk11-m3.5.x_build] [ERROR] 
[windows-jdk11-m3.5.x_build] [ERROR] After correcting the problems, you can resume the build
with the command
[windows-jdk11-m3.5.x_build] [ERROR]   mvn <goals> -rf :enforcer-rules
[Pipeline] [windows-jdk11-m3.5.x_build] }
[Pipeline] [windows-jdk11-m3.5.x_build] // dir
[Pipeline] [windows-jdk11-m3.5.x_build] }
[windows-jdk11-m3.5.x_build] [withMaven] artifactsPublisher - Archive artifact windows-jdk11-m3.5.x_build\pom.xml
under org\apache\maven\enforcer\enforcer\3.0.0-SNAPSHOT\enforcer-3.0.0-SNAPSHOT.pom
[windows-jdk11-m3.5.x_build] [withMaven] artifactsPublisher - Archive artifact windows-jdk11-m3.5.x_build\target\enforcer-3.0.0-SNAPSHOT-site.xml
under org\apache\maven\enforcer\enforcer\3.0.0-SNAPSHOT\enforcer-3.0.0-SNAPSHOT-site.xml
[windows-jdk11-m3.5.x_build] [withMaven] artifactsPublisher - Archive artifact windows-jdk11-m3.5.x_build\enforcer-api\pom.xml
under org\apache\maven\enforcer\enforcer-api\3.0.0-SNAPSHOT\enforcer-api-3.0.0-SNAPSHOT.pom
[windows-jdk11-m3.5.x_build] [withMaven] artifactsPublisher - Archive artifact windows-jdk11-m3.5.x_build\enforcer-api\target\enforcer-api-3.0.0-SNAPSHOT.jar
under org\apache\maven\enforcer\enforcer-api\3.0.0-SNAPSHOT\enforcer-api-3.0.0-SNAPSHOT.jar
[windows-jdk11-m3.5.x_build] [Fast Archiver] No prior successful build to compare, so performing
full copy of artifacts
[windows-jdk11-m3.5.x_build] [withMaven] junitPublisher - Archive test results for Maven artifact
org.apache.maven.enforcer:enforcer-api:3.0.0-SNAPSHOT generated by maven-surefire-plugin:test
(default-test): windows-jdk11-m3.5.x_build\enforcer-api\target\surefire-reports\*.xml
[windows-jdk11-m3.5.x_build] Recording test results
[windows-jdk11-m3.5.x_build] None of the test reports contained any result
[windows-jdk11-m3.5.x_build] [withMaven] openTasksPublisher - Scan Tasks for Maven artifact
org.apache.maven.enforcer:enforcer-api:3.0.0-SNAPSHOT in source directory windows-jdk11-m3.5.x_build\enforcer-api\src\main\java
[windows-jdk11-m3.5.x_build] [withMaven] openTasksPublisher - Scan Tasks for Maven artifact
org.apache.maven.enforcer:enforcer-rules:3.0.0-SNAPSHOT in source directory windows-jdk11-m3.5.x_build\enforcer-rules\src\main\java
[windows-jdk11-m3.5.x_build] [TASKS] Scanning folder 'f:\jenkins\jenkins-slave\workspace\aven-enforcer_MENFORCER-276-ARAEEUQ3DZKGP7LK65FX6C75KHKIJYNAPASQYCZKRS4IVUWL44FA@2'
for files matching the pattern 'windows-jdk11-m3.5.x_build\enforcer-api\src\main\java\**\*,windows-jdk11-m3.5.x_build\enforcer-rules\src\main\java\**\*'
- excludes: null
[windows-jdk11-m3.5.x_build] [TASKS] Found 48 files to scan for tasks
[windows-jdk11-m3.5.x_build] [TASKS] Found 5 open tasks.
[windows-jdk11-m3.5.x_build] Skipping warnings blame since pipelines do not have an SCM link.%n
[Pipeline] [windows-jdk11-m3.5.x_build] // withMaven
[Pipeline] [windows-jdk11-m3.5.x_build] cleanWs
[windows-jdk11-m3.5.x_build] [WS-CLEANUP] Deleting project workspace...[WS-CLEANUP] done
[Pipeline] [windows-jdk11-m3.5.x_build] cleanWs
[windows-jdk11-m3.5.x_build] [WS-CLEANUP] Deleting project workspace...[WS-CLEANUP] done
[Pipeline] [windows-jdk11-m3.5.x_build] }
[Pipeline] [windows-jdk11-m3.5.x_build] // stage
[Pipeline] [windows-jdk11-m3.5.x_build] }
[Pipeline] [windows-jdk11-m3.5.x_build] // ws
[Pipeline] [windows-jdk11-m3.5.x_build] }
[Pipeline] [windows-jdk11-m3.5.x_build] // node
[Pipeline] [windows-jdk11-m3.5.x_build] }
[windows-jdk11-m3.5.x_build] Failed in branch windows-jdk11-m3.5.x_build
[Pipeline] // parallel
[Pipeline] stage
[Pipeline] { (Notifications)
[Pipeline] echo
Build result: FAILURE
[Pipeline] jiraIssueSelector
[Pipeline] emailext
Mime
  • Unnamed multipart/mixed (inline, None, 0 bytes)
View raw message