maven-notifications mailing list archives

Site index · List index
Message view « Date » · « Thread »
Top « Date » · « Thread »
From Apache Jenkins Server <jenk...@builds.apache.org>
Subject Build failed in Jenkins: Maven TLP » maven-surefire » 3.0.0-M1 #18
Date Wed, 31 Oct 2018 10:07:57 GMT
See https://builds.apache.org/job/maven-box/job/maven-surefire/job/3.0.0-M1/18/

No changes.

No tests ran.

Build log:
[...truncated 14.28 KB...]
[Pipeline] [windows-jdk8-maven3.5.x] isUnix
[Pipeline] [windows-jdk8-maven3.5.x] bat
[windows-jdk11-maven3.5.x] 
[windows-jdk11-maven3.5.x] f:\jenkins\jenkins-slave\workspace\box_maven-surefire_3.0.0-M1-VOMECAKSVISJOPKETIPDSWOOERZ2GRJICZTDYCTKUOMZVRQP4WVQ>mkdir
.m2 
[windows-jdk8-maven3.5.x] [box_maven-surefire_3.0.0-M1-VOMECAKSVISJOPKETIPDSWOOERZ2GRJICZTDYCTKUOMZVRQP4WVQ]
Running batch script
[Pipeline] [windows-jdk7-maven3.5.x] isUnix
[Pipeline] [windows-jdk7-maven3.5.x] bat
[windows-jdk7-maven3.5.x] [box_maven-surefire_3.0.0-M1-VOMECAKSVISJOPKETIPDSWOOERZ2GRJICZTDYCTKUOMZVRQP4WVQ@2]
Running batch script
[Pipeline] [windows-jdk11-maven3.5.x] pwd
[Pipeline] [windows-jdk11-maven3.5.x] echo
[windows-jdk11-maven3.5.x] Maven Local Repository = f:\jenkins\jenkins-slave\workspace\box_maven-surefire_3.0.0-M1-VOMECAKSVISJOPKETIPDSWOOERZ2GRJICZTDYCTKUOMZVRQP4WVQ\.m2.
[Pipeline] [windows-jdk11-maven3.5.x] stage
[Pipeline] [windows-jdk11-maven3.5.x] { (checkout windows-jdk11-maven3.5.x)
[Pipeline] [windows-jdk11-maven3.5.x] checkout
[windows-jdk8-maven3.5.x] 
[windows-jdk8-maven3.5.x] f:\jenkins\jenkins-slave\workspace\box_maven-surefire_3.0.0-M1-VOMECAKSVISJOPKETIPDSWOOERZ2GRJICZTDYCTKUOMZVRQP4WVQ>mkdir
.m2 
[Pipeline] [windows-jdk8-maven3.5.x] pwd
[Pipeline] [windows-jdk8-maven3.5.x] echo
[windows-jdk8-maven3.5.x] Maven Local Repository = f:\jenkins\jenkins-slave\workspace\box_maven-surefire_3.0.0-M1-VOMECAKSVISJOPKETIPDSWOOERZ2GRJICZTDYCTKUOMZVRQP4WVQ\.m2.
[Pipeline] [windows-jdk8-maven3.5.x] stage
[Pipeline] [windows-jdk8-maven3.5.x] { (checkout windows-jdk8-maven3.5.x)
[Pipeline] [windows-jdk8-maven3.5.x] checkout
[windows-jdk7-maven3.5.x] 
[windows-jdk7-maven3.5.x] f:\jenkins\jenkins-slave\workspace\box_maven-surefire_3.0.0-M1-VOMECAKSVISJOPKETIPDSWOOERZ2GRJICZTDYCTKUOMZVRQP4WVQ@2>mkdir
.m2 
[windows-jdk8-maven3.5.x] Cloning the remote Git repository
[windows-jdk8-maven3.5.x] Cloning with configured refspecs honoured and without tags
[windows-jdk8-maven3.5.x] Cloning repository https://gitbox.apache.org/repos/asf/maven-surefire.git
[Pipeline] [windows-jdk7-maven3.5.x] pwd
[Pipeline] [windows-jdk7-maven3.5.x] echo
[windows-jdk7-maven3.5.x] Maven Local Repository = f:\jenkins\jenkins-slave\workspace\box_maven-surefire_3.0.0-M1-VOMECAKSVISJOPKETIPDSWOOERZ2GRJICZTDYCTKUOMZVRQP4WVQ@2\.m2.
[Pipeline] [windows-jdk7-maven3.5.x] stage
[Pipeline] [windows-jdk7-maven3.5.x] { (checkout windows-jdk7-maven3.5.x)
[Pipeline] [windows-jdk7-maven3.5.x] checkout
[windows-jdk8-maven3.5.x]  > git init f:\jenkins\jenkins-slave\workspace\box_maven-surefire_3.0.0-M1-VOMECAKSVISJOPKETIPDSWOOERZ2GRJICZTDYCTKUOMZVRQP4WVQ
# timeout=10
[windows-jdk7-maven3.5.x] Cloning the remote Git repository
[windows-jdk7-maven3.5.x] Cloning with configured refspecs honoured and without tags
[windows-jdk7-maven3.5.x] Cloning repository https://gitbox.apache.org/repos/asf/maven-surefire.git
[windows-jdk7-maven3.5.x]  > git init f:\jenkins\jenkins-slave\workspace\box_maven-surefire_3.0.0-M1-VOMECAKSVISJOPKETIPDSWOOERZ2GRJICZTDYCTKUOMZVRQP4WVQ@2
# timeout=10
[windows-jdk8-maven3.5.x] Fetching upstream changes from https://gitbox.apache.org/repos/asf/maven-surefire.git
[windows-jdk8-maven3.5.x]  > git --version # timeout=10
[windows-jdk8-maven3.5.x]  > git fetch --no-tags --progress https://gitbox.apache.org/repos/asf/maven-surefire.git
+refs/heads/*:refs/remotes/origin/*
[windows-jdk7-maven3.5.x] Fetching upstream changes from https://gitbox.apache.org/repos/asf/maven-surefire.git
[windows-jdk7-maven3.5.x]  > git --version # timeout=10
[windows-jdk7-maven3.5.x]  > git fetch --no-tags --progress https://gitbox.apache.org/repos/asf/maven-surefire.git
+refs/heads/*:refs/remotes/origin/*
[windows-jdk11-maven3.5.x] Cloning the remote Git repository
[windows-jdk11-maven3.5.x] Cloning with configured refspecs honoured and without tags
[windows-jdk11-maven3.5.x] Cloning repository https://gitbox.apache.org/repos/asf/maven-surefire.git
[windows-jdk11-maven3.5.x]  > git init f:\jenkins\jenkins-slave\workspace\box_maven-surefire_3.0.0-M1-VOMECAKSVISJOPKETIPDSWOOERZ2GRJICZTDYCTKUOMZVRQP4WVQ
# timeout=10
[windows-jdk11-maven3.5.x] Fetching upstream changes from https://gitbox.apache.org/repos/asf/maven-surefire.git
[windows-jdk11-maven3.5.x]  > git --version # timeout=10
[windows-jdk11-maven3.5.x]  > git fetch --no-tags --progress https://gitbox.apache.org/repos/asf/maven-surefire.git
+refs/heads/*:refs/remotes/origin/*
[windows-jdk8-maven3.5.x]  > git config remote.origin.url https://gitbox.apache.org/repos/asf/maven-surefire.git
# timeout=10
[windows-jdk11-maven3.5.x]  > git config remote.origin.url https://gitbox.apache.org/repos/asf/maven-surefire.git
# timeout=10
[windows-jdk11-maven3.5.x]  > git config --add remote.origin.fetch +refs/heads/*:refs/remotes/origin/*
# timeout=10
[windows-jdk11-maven3.5.x]  > git config remote.origin.url https://gitbox.apache.org/repos/asf/maven-surefire.git
# timeout=10
[windows-jdk11-maven3.5.x] Fetching without tags
[windows-jdk11-maven3.5.x] Fetching upstream changes from https://gitbox.apache.org/repos/asf/maven-surefire.git
[windows-jdk11-maven3.5.x]  > git fetch --no-tags --progress https://gitbox.apache.org/repos/asf/maven-surefire.git
+refs/heads/*:refs/remotes/origin/*
[windows-jdk8-maven3.5.x]  > git config --add remote.origin.fetch +refs/heads/*:refs/remotes/origin/*
# timeout=10
[windows-jdk8-maven3.5.x]  > git config remote.origin.url https://gitbox.apache.org/repos/asf/maven-surefire.git
# timeout=10
[windows-jdk8-maven3.5.x] Fetching without tags
[windows-jdk8-maven3.5.x] Fetching upstream changes from https://gitbox.apache.org/repos/asf/maven-surefire.git
[windows-jdk8-maven3.5.x]  > git fetch --no-tags --progress https://gitbox.apache.org/repos/asf/maven-surefire.git
+refs/heads/*:refs/remotes/origin/*
[windows-jdk7-maven3.5.x]  > git config remote.origin.url https://gitbox.apache.org/repos/asf/maven-surefire.git
# timeout=10
[windows-jdk7-maven3.5.x]  > git config --add remote.origin.fetch +refs/heads/*:refs/remotes/origin/*
# timeout=10
[windows-jdk7-maven3.5.x]  > git config remote.origin.url https://gitbox.apache.org/repos/asf/maven-surefire.git
# timeout=10
[windows-jdk7-maven3.5.x] Fetching without tags
[windows-jdk7-maven3.5.x] Fetching upstream changes from https://gitbox.apache.org/repos/asf/maven-surefire.git
[windows-jdk7-maven3.5.x]  > git fetch --no-tags --progress https://gitbox.apache.org/repos/asf/maven-surefire.git
+refs/heads/*:refs/remotes/origin/*
[windows-jdk11-maven3.5.x] Checking out Revision 7ae4ecab25f77c0a85b6dc164bd4f71ea7e8a6ff
(3.0.0-M1)
[windows-jdk11-maven3.5.x]  > git config core.sparsecheckout # timeout=10
[windows-jdk11-maven3.5.x]  > git checkout -f 7ae4ecab25f77c0a85b6dc164bd4f71ea7e8a6ff
[windows-jdk8-maven3.5.x] Checking out Revision 7ae4ecab25f77c0a85b6dc164bd4f71ea7e8a6ff (3.0.0-M1)
[windows-jdk8-maven3.5.x]  > git config core.sparsecheckout # timeout=10
[windows-jdk8-maven3.5.x]  > git checkout -f 7ae4ecab25f77c0a85b6dc164bd4f71ea7e8a6ff
[windows-jdk7-maven3.5.x] Checking out Revision 7ae4ecab25f77c0a85b6dc164bd4f71ea7e8a6ff (3.0.0-M1)
[windows-jdk7-maven3.5.x]  > git config core.sparsecheckout # timeout=10
[windows-jdk7-maven3.5.x]  > git checkout -f 7ae4ecab25f77c0a85b6dc164bd4f71ea7e8a6ff
[linux-jdk11-maven3.5.x] Still waiting to schedule task
[linux-jdk11-maven3.5.x] Waiting for next available executor on ubuntu&&!H24
[linux-jdk8-maven3.5.x] Still waiting to schedule task
[linux-jdk8-maven3.5.x] Waiting for next available executor on ubuntu&&!H24
[windows-jdk8-maven3.5.x] Commit message: "[SUREFIRE-1493] Maven Plugin API 3.0"
[windows-jdk8-maven3.5.x] Cleaning workspace
[windows-jdk8-maven3.5.x]  > git rev-parse --verify HEAD # timeout=10
[windows-jdk8-maven3.5.x] Resetting working tree
[windows-jdk8-maven3.5.x]  > git reset --hard # timeout=10
[windows-jdk7-maven3.5.x] Commit message: "[SUREFIRE-1493] Maven Plugin API 3.0"
[windows-jdk7-maven3.5.x] Cleaning workspace
[windows-jdk7-maven3.5.x]  > git rev-parse --verify HEAD # timeout=10
[windows-jdk7-maven3.5.x] Resetting working tree
[windows-jdk7-maven3.5.x]  > git reset --hard # timeout=10
[linux-jdk7-maven3.5.x] Still waiting to schedule task
[linux-jdk7-maven3.5.x] Waiting for next available executor on ubuntu&&!H24
[windows-jdk8-maven3.5.x]  > git clean -fdx # timeout=10
[windows-jdk7-maven3.5.x]  > git clean -fdx # timeout=10
[Pipeline] [windows-jdk7-maven3.5.x] }
[Pipeline] [windows-jdk7-maven3.5.x] // stage
[Pipeline] [windows-jdk7-maven3.5.x] echo
[windows-jdk7-maven3.5.x] Setting JDK for testing JDK 1.8 (latest)
[Pipeline] [windows-jdk7-maven3.5.x] stage
[Pipeline] [windows-jdk7-maven3.5.x] { (build windows-jdk7-maven3.5.x)
[Pipeline] [windows-jdk8-maven3.5.x] }
[Pipeline] [windows-jdk7-maven3.5.x] isUnix
[Pipeline] [windows-jdk7-maven3.5.x] tool
[Pipeline] [windows-jdk8-maven3.5.x] // stage
[Pipeline] [windows-jdk8-maven3.5.x] echo
[windows-jdk8-maven3.5.x] Setting JDK for testing JDK 1.8 (latest)
[Pipeline] [windows-jdk8-maven3.5.x] stage
[Pipeline] [windows-jdk8-maven3.5.x] { (build windows-jdk8-maven3.5.x)
[Pipeline] [windows-jdk7-maven3.5.x] tool
[Pipeline] [windows-jdk8-maven3.5.x] isUnix
[Pipeline] [windows-jdk8-maven3.5.x] tool
[Pipeline] [windows-jdk7-maven3.5.x] tool
[Pipeline] [windows-jdk8-maven3.5.x] tool
[Pipeline] [windows-jdk7-maven3.5.x] withEnv
[Pipeline] [windows-jdk7-maven3.5.x] {
[Pipeline] [windows-jdk8-maven3.5.x] tool
[Pipeline] [windows-jdk7-maven3.5.x] bat
[windows-jdk7-maven3.5.x] [box_maven-surefire_3.0.0-M1-VOMECAKSVISJOPKETIPDSWOOERZ2GRJICZTDYCTKUOMZVRQP4WVQ@2]
Running batch script
[Pipeline] [windows-jdk8-maven3.5.x] withEnv
[Pipeline] [windows-jdk8-maven3.5.x] {
[Pipeline] [windows-jdk8-maven3.5.x] bat
[windows-jdk7-maven3.5.x] 
[windows-jdk7-maven3.5.x] f:\jenkins\jenkins-slave\workspace\box_maven-surefire_3.0.0-M1-VOMECAKSVISJOPKETIPDSWOOERZ2GRJICZTDYCTKUOMZVRQP4WVQ@2>echo
JAVA_HOME=f:\\jenkins\\tools\\java\\latest1.8, JAVA_HOME_IT=f:\\jenkins\\tools\\java\\latest1.7,
PATH=F:\\jenkins\\tools\\maven\\apache-maven-3.5.2\bin;null\bin;C:\Program Files (x86)\Common
Files\Oracle\Java\javapath;C:\ProgramData\Oracle\Java\javapath;C:\Windows\system32;C:\Windows;C:\Windows\System32\Wbem;

[windows-jdk7-maven3.5.x] JAVA_HOME=f:\\jenkins\\tools\\java\\latest1.8, JAVA_HOME_IT=f:\\jenkins\\tools\\java\\latest1.7,
PATH=F:\\jenkins\\tools\\maven\\apache-maven-3.5.2\bin;null\bin;C:\Program Files (x86)\Common
Files\Oracle\Java\javapath;C:\ProgramData\Oracle\Java\javapath;C:\Windows\system32;C:\Windows;C:\Windows\System32\Wbem;
[windows-jdk8-maven3.5.x] [box_maven-surefire_3.0.0-M1-VOMECAKSVISJOPKETIPDSWOOERZ2GRJICZTDYCTKUOMZVRQP4WVQ]
Running batch script
[Pipeline] [windows-jdk7-maven3.5.x] }
[Pipeline] [windows-jdk7-maven3.5.x] // withEnv
[Pipeline] [windows-jdk7-maven3.5.x] }
[Pipeline] [windows-jdk7-maven3.5.x] // stage
[Pipeline] [windows-jdk7-maven3.5.x] stage
[Pipeline] [windows-jdk7-maven3.5.x] { (reporting windows-jdk7-maven3.5.x)
[Pipeline] [windows-jdk7-maven3.5.x] fileExists
[Pipeline] [windows-jdk7-maven3.5.x] fileExists
[Pipeline] [windows-jdk7-maven3.5.x] archiveArtifacts
[windows-jdk8-maven3.5.x] 
[windows-jdk8-maven3.5.x] f:\jenkins\jenkins-slave\workspace\box_maven-surefire_3.0.0-M1-VOMECAKSVISJOPKETIPDSWOOERZ2GRJICZTDYCTKUOMZVRQP4WVQ>echo
JAVA_HOME=f:\\jenkins\\tools\\java\\latest1.8, JAVA_HOME_IT=f:\\jenkins\\tools\\java\\latest1.8,
PATH=F:\\jenkins\\tools\\maven\\apache-maven-3.5.2\bin;null\bin;C:\Program Files (x86)\Common
Files\Oracle\Java\javapath;C:\ProgramData\Oracle\Java\javapath;C:\Windows\system32;C:\Windows;C:\Windows\System32\Wbem;

[windows-jdk8-maven3.5.x] JAVA_HOME=f:\\jenkins\\tools\\java\\latest1.8, JAVA_HOME_IT=f:\\jenkins\\tools\\java\\latest1.8,
PATH=F:\\jenkins\\tools\\maven\\apache-maven-3.5.2\bin;null\bin;C:\Program Files (x86)\Common
Files\Oracle\Java\javapath;C:\ProgramData\Oracle\Java\javapath;C:\Windows\system32;C:\Windows;C:\Windows\System32\Wbem;
[windows-jdk7-maven3.5.x] Archiving artifacts
[Pipeline] [windows-jdk8-maven3.5.x] }
[Pipeline] [windows-jdk8-maven3.5.x] // withEnv
[Pipeline] [windows-jdk8-maven3.5.x] }
[Pipeline] [windows-jdk8-maven3.5.x] // stage
[Pipeline] [windows-jdk8-maven3.5.x] stage
[Pipeline] [windows-jdk8-maven3.5.x] { (reporting windows-jdk8-maven3.5.x)
[Pipeline] [windows-jdk8-maven3.5.x] fileExists
[Pipeline] [windows-jdk8-maven3.5.x] fileExists
[Pipeline] [windows-jdk8-maven3.5.x] archiveArtifacts
[windows-jdk8-maven3.5.x] Archiving artifacts
[windows-jdk7-maven3.5.x] ‘*--windows-jdk7-maven3.5.x.zip’ doesn’t match anything
[windows-jdk7-maven3.5.x] No artifacts found that match the file pattern "*--windows-jdk7-maven3.5.x.zip".
Configuration error?
[Pipeline] [windows-jdk7-maven3.5.x] }
[Pipeline] [windows-jdk7-maven3.5.x] // stage
[Pipeline] [windows-jdk7-maven3.5.x] stage
[Pipeline] [windows-jdk7-maven3.5.x] { (cleanup windows-jdk7-maven3.5.x)
[Pipeline] [windows-jdk7-maven3.5.x] cleanWs
[windows-jdk8-maven3.5.x] ‘*--windows-jdk8-maven3.5.x.zip’ doesn’t match anything
[windows-jdk8-maven3.5.x] No artifacts found that match the file pattern "*--windows-jdk8-maven3.5.x.zip".
Configuration error?
[windows-jdk7-maven3.5.x] [WS-CLEANUP] Deleting project workspace...[WS-CLEANUP] done
[Pipeline] [windows-jdk7-maven3.5.x] }
[Pipeline] [windows-jdk7-maven3.5.x] // stage
[Pipeline] [windows-jdk7-maven3.5.x] }
[Pipeline] [windows-jdk8-maven3.5.x] }
[Pipeline] [windows-jdk7-maven3.5.x] // timestamps
[Pipeline] [windows-jdk8-maven3.5.x] // stage
[Pipeline] [windows-jdk7-maven3.5.x] }
[Pipeline] [windows-jdk8-maven3.5.x] stage
[Pipeline] [windows-jdk8-maven3.5.x] { (cleanup windows-jdk8-maven3.5.x)
[Pipeline] [windows-jdk7-maven3.5.x] // node
[Pipeline] [windows-jdk7-maven3.5.x] }
[Pipeline] [windows-jdk8-maven3.5.x] cleanWs
[windows-jdk8-maven3.5.x] [WS-CLEANUP] Deleting project workspace...[WS-CLEANUP] done
[Pipeline] [windows-jdk8-maven3.5.x] }
[Pipeline] [windows-jdk8-maven3.5.x] // stage
[Pipeline] [windows-jdk8-maven3.5.x] }
[Pipeline] [windows-jdk8-maven3.5.x] // timestamps
[Pipeline] [windows-jdk8-maven3.5.x] }
[Pipeline] [windows-jdk8-maven3.5.x] // node
[Pipeline] [windows-jdk8-maven3.5.x] }
[windows-jdk11-maven3.5.x] Commit message: "[SUREFIRE-1493] Maven Plugin API 3.0"
[windows-jdk11-maven3.5.x]  > git rev-list --no-walk 6098169abe51f736a1e936b211479496dee7788d
# timeout=10
[windows-jdk11-maven3.5.x] First time build. Skipping changelog.
[windows-jdk11-maven3.5.x] Cleaning workspace
[windows-jdk11-maven3.5.x]  > git rev-parse --verify HEAD # timeout=10
[windows-jdk11-maven3.5.x] Resetting working tree
[windows-jdk11-maven3.5.x]  > git reset --hard # timeout=10
[windows-jdk11-maven3.5.x]  > git clean -fdx # timeout=10
[Pipeline] [windows-jdk11-maven3.5.x] }
[Pipeline] [windows-jdk11-maven3.5.x] // stage
[Pipeline] [windows-jdk11-maven3.5.x] echo
[windows-jdk11-maven3.5.x] Setting JDK for testing JDK 1.8 (latest)
[Pipeline] [windows-jdk11-maven3.5.x] stage
[Pipeline] [windows-jdk11-maven3.5.x] { (build windows-jdk11-maven3.5.x)
[Pipeline] [windows-jdk11-maven3.5.x] isUnix
[Pipeline] [windows-jdk11-maven3.5.x] tool
[Pipeline] [windows-jdk11-maven3.5.x] tool
[Pipeline] [windows-jdk11-maven3.5.x] tool
[Pipeline] [windows-jdk11-maven3.5.x] withEnv
[Pipeline] [windows-jdk11-maven3.5.x] {
[Pipeline] [windows-jdk11-maven3.5.x] bat
[windows-jdk11-maven3.5.x] [box_maven-surefire_3.0.0-M1-VOMECAKSVISJOPKETIPDSWOOERZ2GRJICZTDYCTKUOMZVRQP4WVQ]
Running batch script
[windows-jdk11-maven3.5.x] 
[windows-jdk11-maven3.5.x] f:\jenkins\jenkins-slave\workspace\box_maven-surefire_3.0.0-M1-VOMECAKSVISJOPKETIPDSWOOERZ2GRJICZTDYCTKUOMZVRQP4WVQ>echo
JAVA_HOME=f:\\jenkins\\tools\\java\\latest1.8, JAVA_HOME_IT=f:\\jenkins\\tools\\java\\latest11,
PATH=F:\\jenkins\\tools\\maven\\apache-maven-3.5.2\bin;F:\jenkins\tools\java\latest\bin;C:\Program
Files (x86)\Common Files\Oracle\Java\javapath;C:\ProgramData\Oracle\Java\javapath;C:\Windows\system32;C:\Windows;C:\Windows\System32\Wbem;

[windows-jdk11-maven3.5.x] JAVA_HOME=f:\\jenkins\\tools\\java\\latest1.8, JAVA_HOME_IT=f:\\jenkins\\tools\\java\\latest11,
PATH=F:\\jenkins\\tools\\maven\\apache-maven-3.5.2\bin;F:\jenkins\tools\java\latest\bin;C:\Program
Files (x86)\Common Files\Oracle\Java\javapath;C:\ProgramData\Oracle\Java\javapath;C:\Windows\system32;C:\Windows;C:\Windows\System32\Wbem;
[Pipeline] [windows-jdk11-maven3.5.x] }
[Pipeline] [windows-jdk11-maven3.5.x] // withEnv
[Pipeline] [windows-jdk11-maven3.5.x] }
[Pipeline] [windows-jdk11-maven3.5.x] // stage
[Pipeline] [windows-jdk11-maven3.5.x] stage
[Pipeline] [windows-jdk11-maven3.5.x] { (reporting windows-jdk11-maven3.5.x)
[Pipeline] [windows-jdk11-maven3.5.x] fileExists
[Pipeline] [windows-jdk11-maven3.5.x] fileExists
[Pipeline] [windows-jdk11-maven3.5.x] archiveArtifacts
[windows-jdk11-maven3.5.x] Archiving artifacts
[windows-jdk11-maven3.5.x] ‘*--windows-jdk11-maven3.5.x.zip’ doesn’t match anything
[windows-jdk11-maven3.5.x] No artifacts found that match the file pattern "*--windows-jdk11-maven3.5.x.zip".
Configuration error?
[Pipeline] [windows-jdk11-maven3.5.x] }
[Pipeline] [windows-jdk11-maven3.5.x] // stage
[Pipeline] [windows-jdk11-maven3.5.x] stage
[Pipeline] [windows-jdk11-maven3.5.x] { (cleanup windows-jdk11-maven3.5.x)
[Pipeline] [windows-jdk11-maven3.5.x] cleanWs
[windows-jdk11-maven3.5.x] [WS-CLEANUP] Deleting project workspace...[WS-CLEANUP] done
[Pipeline] [windows-jdk11-maven3.5.x] }
[Pipeline] [windows-jdk11-maven3.5.x] // stage
[Pipeline] [windows-jdk11-maven3.5.x] }
[Pipeline] [windows-jdk11-maven3.5.x] // timestamps
[Pipeline] [windows-jdk11-maven3.5.x] }
[Pipeline] [windows-jdk11-maven3.5.x] // node
[Pipeline] [windows-jdk11-maven3.5.x] }
Aborted by tibordigana
[Pipeline] [linux-jdk7-maven3.5.x] // node
[Pipeline] [linux-jdk8-maven3.5.x] // node
[Pipeline] [linux-jdk11-maven3.5.x] // node
[Pipeline] [linux-jdk11-maven3.5.x] }
[linux-jdk11-maven3.5.x] Failed in branch linux-jdk11-maven3.5.x
[Pipeline] [linux-jdk8-maven3.5.x] }
[linux-jdk8-maven3.5.x] Failed in branch linux-jdk8-maven3.5.x
[Pipeline] [linux-jdk7-maven3.5.x] }
[linux-jdk7-maven3.5.x] Failed in branch linux-jdk7-maven3.5.x
[Pipeline] // parallel
[Pipeline] echo
hudson.AbortException: hudson.AbortException: Queue task was cancelled
[Pipeline] stage
[Pipeline] { (notifications)
[Pipeline] echo
Build result: FAILURE
[Pipeline] jiraIssueSelector
[Pipeline] emailext
Mime
  • Unnamed multipart/mixed (inline, None, 0 bytes)
View raw message