maven-notifications mailing list archives

Site index · List index
Message view « Date » · « Thread »
Top « Date » · « Thread »
From Apache Jenkins Server <jenk...@builds.apache.org>
Subject Build failed in Jenkins: dist-tool-plugin #2328
Date Wed, 31 Oct 2018 11:44:56 GMT
See <https://builds.apache.org/job/dist-tool-plugin/2328/display/redirect>

------------------------------------------
[...truncated 163.02 KB...]
[INFO] Downloaded: https://repo.maven.apache.org/maven2/org/apache/maven/plugins/maven-patch-plugin/1.2/maven-patch-plugin-1.2.pom
(5 KB at 233.5 KB/sec)
[INFO]   maven-pdf-plugin
[INFO] Downloading: https://repo.maven.apache.org/maven2/org/apache/maven/plugins/maven-pdf-plugin/1.4/maven-pdf-plugin-1.4.pom
[INFO] Downloaded: https://repo.maven.apache.org/maven2/org/apache/maven/plugins/maven-pdf-plugin/1.4/maven-pdf-plugin-1.4.pom
(13 KB at 483.6 KB/sec)
[INFO]   * maven-plugin-plugin
[INFO]   maven-pmd-plugin
[INFO] Downloading: https://repo.maven.apache.org/maven2/org/apache/maven/plugins/maven-pmd-plugin/3.11.0/maven-pmd-plugin-3.11.0.pom
[INFO] Downloaded: https://repo.maven.apache.org/maven2/org/apache/maven/plugins/maven-pmd-plugin/3.11.0/maven-pmd-plugin-3.11.0.pom
(13 KB at 632.3 KB/sec)
[INFO]   maven-project-info-reports-plugin
[INFO]   maven-rar-plugin
[INFO] Downloading: https://repo.maven.apache.org/maven2/org/apache/maven/plugins/maven-rar-plugin/2.4/maven-rar-plugin-2.4.pom
[INFO] Downloaded: https://repo.maven.apache.org/maven2/org/apache/maven/plugins/maven-rar-plugin/2.4/maven-rar-plugin-2.4.pom
(7 KB at 324.6 KB/sec)
[INFO]   * maven-release-plugin  
[INFO]   maven-remote-resources-plugin
[INFO]   maven-repository-plugin
[INFO] Downloading: https://repo.maven.apache.org/maven2/org/apache/maven/plugins/maven-repository-plugin/2.4/maven-repository-plugin-2.4.pom
[INFO] Downloaded: https://repo.maven.apache.org/maven2/org/apache/maven/plugins/maven-repository-plugin/2.4/maven-repository-plugin-2.4.pom
(10 KB at 523.4 KB/sec)
[INFO]   maven-resources-plugin
[INFO]   * maven-scm-plugin
[INFO]   maven-scm-publish-plugin
[INFO]   maven-shade-plugin
[INFO] Downloading: https://repo.maven.apache.org/maven2/org/apache/maven/plugins/maven-shade-plugin/3.2.0/maven-shade-plugin-3.2.0.pom
[INFO] Downloaded: https://repo.maven.apache.org/maven2/org/apache/maven/plugins/maven-shade-plugin/3.2.0/maven-shade-plugin-3.2.0.pom
(10 KB at 569.3 KB/sec)
[INFO]   maven-site-plugin
[INFO]   maven-source-plugin
[INFO]   maven-stage-plugin
[INFO] Downloading: https://repo.maven.apache.org/maven2/org/apache/maven/plugins/maven-stage-plugin/1.0/maven-stage-plugin-1.0.pom
[INFO] Downloaded: https://repo.maven.apache.org/maven2/org/apache/maven/plugins/maven-stage-plugin/1.0/maven-stage-plugin-1.0.pom
(7 KB at 35.1 KB/sec)
[INFO]   * maven-surefire-plugin
[INFO]   * maven-surefire-report-plugin
[INFO]   maven-toolchains-plugin
[INFO]   maven-verifier-plugin
[INFO] Downloading: https://repo.maven.apache.org/maven2/org/apache/maven/plugins/maven-verifier-plugin/1.1/maven-verifier-plugin-1.1.pom
[INFO] Downloaded: https://repo.maven.apache.org/maven2/org/apache/maven/plugins/maven-verifier-plugin/1.1/maven-verifier-plugin-1.1.pom
(5 KB at 55.5 KB/sec)
[INFO]   maven-war-plugin
[INFO] /pom: org.apache http://maven.apache.org/pom/
[INFO] > apache index-path = /asf/
[INFO] > apache site = http://maven.apache.org/pom/asf/
[INFO]   apache
[INFO] /pom: org.apache.maven http://maven.apache.org/pom/
[INFO] > maven-parent index-path = /maven/
[INFO] > maven-parent site = http://maven.apache.org/pom/maven/
[INFO]   maven-parent
[INFO] /release: org.apache.maven.release
[INFO]   maven-release (,3) 
[INFO] /reporting: org.apache.maven.reporting http://maven.apache.org/shared/
[INFO]   maven-reporting-api
[INFO]   maven-reporting-exec
[INFO]   maven-reporting-impl
[INFO] /resolver: org.apache.maven.resolver
[INFO]   maven-resolver
[INFO] Downloading: https://repo.maven.apache.org/maven2/org/apache/maven/resolver/maven-resolver/1.3.1/maven-resolver-1.3.1.pom
[INFO] Downloaded: https://repo.maven.apache.org/maven2/org/apache/maven/resolver/maven-resolver/1.3.1/maven-resolver-1.3.1.pom
(17 KB at 742.9 KB/sec)
[INFO] /resources: org.apache.apache.resources
[INFO] > apache-source-release-assembly-descriptor site = http://maven.apache.org/apache-resource-bundles/
[INFO]   apache-source-release-assembly-descriptor
[INFO] /resources: org.apache
[INFO] > apache-incubator-disclaimer-resource-bundle site = http://maven.apache.org/apache-resource-bundles/
[INFO]   apache-incubator-disclaimer-resource-bundle (,1.1]
[INFO] Downloading: https://repo.maven.apache.org/maven2/org/apache/apache-incubator-disclaimer-resource-bundle/1.1/apache-incubator-disclaimer-resource-bundle-1.1.pom
[WARNING] Checksum validation failed, expected da39a3ee5e6b4b0d3255bfef95601890afd80709 but
is 6e0b74ff3d2da9bfe1126608f7e937537e628a5f for https://repo.maven.apache.org/maven2/org/apache/apache-incubator-disclaimer-resource-bundle/1.1/apache-incubator-disclaimer-resource-bundle-1.1.pom
[WARNING] Could not validate integrity of download from https://repo.maven.apache.org/maven2/org/apache/apache-incubator-disclaimer-resource-bundle/1.1/apache-incubator-disclaimer-resource-bundle-1.1.pom:
Checksum validation failed, expected da39a3ee5e6b4b0d3255bfef95601890afd80709 but is 6e0b74ff3d2da9bfe1126608f7e937537e628a5f
[WARNING] Checksum validation failed, expected da39a3ee5e6b4b0d3255bfef95601890afd80709 but
is 6e0b74ff3d2da9bfe1126608f7e937537e628a5f for https://repo.maven.apache.org/maven2/org/apache/apache-incubator-disclaimer-resource-bundle/1.1/apache-incubator-disclaimer-resource-bundle-1.1.pom
[INFO] Downloaded: https://repo.maven.apache.org/maven2/org/apache/apache-incubator-disclaimer-resource-bundle/1.1/apache-incubator-disclaimer-resource-bundle-1.1.pom
(722 B at 10.8 KB/sec)
[INFO] Downloading: https://repo.maven.apache.org/maven2/org/apache/apache-resource-bundles/2/apache-resource-bundles-2.pom
[WARNING] Checksum validation failed, expected da39a3ee5e6b4b0d3255bfef95601890afd80709 but
is bfadc7db5b215805d531144732c80692de9780e1 for https://repo.maven.apache.org/maven2/org/apache/apache-resource-bundles/2/apache-resource-bundles-2.pom
[WARNING] Could not validate integrity of download from https://repo.maven.apache.org/maven2/org/apache/apache-resource-bundles/2/apache-resource-bundles-2.pom:
Checksum validation failed, expected da39a3ee5e6b4b0d3255bfef95601890afd80709 but is bfadc7db5b215805d531144732c80692de9780e1
[WARNING] Checksum validation failed, expected da39a3ee5e6b4b0d3255bfef95601890afd80709 but
is bfadc7db5b215805d531144732c80692de9780e1 for https://repo.maven.apache.org/maven2/org/apache/apache-resource-bundles/2/apache-resource-bundles-2.pom
[INFO] Downloaded: https://repo.maven.apache.org/maven2/org/apache/apache-resource-bundles/2/apache-resource-bundles-2.pom
(2 KB at 64.0 KB/sec)
[INFO] > apache-jar-resource-bundle site = http://maven.apache.org/apache-resource-bundles/
[INFO]   apache-jar-resource-bundle (,1.4]
[INFO] Downloading: https://repo.maven.apache.org/maven2/org/apache/apache-jar-resource-bundle/1.4/apache-jar-resource-bundle-1.4.pom
[INFO] Downloaded: https://repo.maven.apache.org/maven2/org/apache/apache-jar-resource-bundle/1.4/apache-jar-resource-bundle-1.4.pom
(2 KB at 64.1 KB/sec)
[INFO] > apache-license-header-resource-bundle site = http://maven.apache.org/apache-resource-bundles/
[INFO]   apache-license-header-resource-bundle (,1.1]
[INFO] Downloading: https://repo.maven.apache.org/maven2/org/apache/apache-license-header-resource-bundle/1.1/apache-license-header-resource-bundle-1.1.pom
[WARNING] Checksum validation failed, expected da39a3ee5e6b4b0d3255bfef95601890afd80709 but
is 923c05b225d7a5a8a614b5fca846b1776e18b98a for https://repo.maven.apache.org/maven2/org/apache/apache-license-header-resource-bundle/1.1/apache-license-header-resource-bundle-1.1.pom
[WARNING] Could not validate integrity of download from https://repo.maven.apache.org/maven2/org/apache/apache-license-header-resource-bundle/1.1/apache-license-header-resource-bundle-1.1.pom:
Checksum validation failed, expected da39a3ee5e6b4b0d3255bfef95601890afd80709 but is 923c05b225d7a5a8a614b5fca846b1776e18b98a
[WARNING] Checksum validation failed, expected da39a3ee5e6b4b0d3255bfef95601890afd80709 but
is 923c05b225d7a5a8a614b5fca846b1776e18b98a for https://repo.maven.apache.org/maven2/org/apache/apache-license-header-resource-bundle/1.1/apache-license-header-resource-bundle-1.1.pom
[INFO] Downloaded: https://repo.maven.apache.org/maven2/org/apache/apache-license-header-resource-bundle/1.1/apache-license-header-resource-bundle-1.1.pom
(694 B at 22.6 KB/sec)
[INFO] /scm: org.apache.maven.scm
[INFO]   maven-scm 
[INFO] Downloading: https://repo.maven.apache.org/maven2/org/apache/maven/scm/maven-scm/1.11.1/maven-scm-1.11.1.pom
[INFO] Downloaded: https://repo.maven.apache.org/maven2/org/apache/maven/scm/maven-scm/1.11.1/maven-scm-1.11.1.pom
(26 KB at 991.7 KB/sec)
[INFO] /shared: org.apache.maven.shared http://maven.apache.org/shared/
[INFO]   file-management
[INFO]   maven-artifact-resolver
[INFO]   maven-common-artifact-filters
[INFO]   maven-dependency-analyzer
[INFO]   maven-dependency-tree
[INFO]   maven-filtering
[INFO]   maven-invoker
[INFO] Downloading: https://repo.maven.apache.org/maven2/org/apache/maven/shared/maven-invoker/3.0.1/maven-invoker-3.0.1.pom
[INFO] Downloaded: https://repo.maven.apache.org/maven2/org/apache/maven/shared/maven-invoker/3.0.1/maven-invoker-3.0.1.pom
(5 KB at 139.6 KB/sec)
[INFO]   maven-jarsigner
[INFO] Downloading: https://repo.maven.apache.org/maven2/org/apache/maven/shared/maven-jarsigner/1.4/maven-jarsigner-1.4.pom
[INFO] Downloaded: https://repo.maven.apache.org/maven2/org/apache/maven/shared/maven-jarsigner/1.4/maven-jarsigner-1.4.pom
(4 KB at 226.2 KB/sec)
[INFO]   maven-mapping
[INFO]   maven-repository-builder
[INFO]   maven-runtime
[INFO] Downloading: https://repo.maven.apache.org/maven2/org/apache/maven/shared/maven-runtime/1.0-alpha-3/maven-runtime-1.0-alpha-3.pom
[INFO] Downloaded: https://repo.maven.apache.org/maven2/org/apache/maven/shared/maven-runtime/1.0-alpha-3/maven-runtime-1.0-alpha-3.pom
(6 KB at 208.2 KB/sec)
[INFO]   maven-script-interpreter
[INFO]   maven-shared-incremental
[INFO]   maven-shared-jar
[INFO]   maven-shared-resources
[INFO]   maven-shared-utils
[INFO]   maven-shared-io
[INFO]   maven-verifier
[INFO] Downloading: https://repo.maven.apache.org/maven2/org/apache/maven/shared/maven-verifier/1.6/maven-verifier-1.6.pom
[INFO] Downloaded: https://repo.maven.apache.org/maven2/org/apache/maven/shared/maven-verifier/1.6/maven-verifier-1.6.pom
(4 KB at 194.4 KB/sec)
[INFO] /shared: org.apache.maven http://maven.apache.org/shared/
[INFO]   maven-archiver
[INFO] > maven-skins index-path = /skins/
[INFO] /skins: org.apache.maven.skins http://maven.apache.org/skins/
[INFO]   maven-default-skin
[INFO] Downloading: https://repo.maven.apache.org/maven2/org/apache/maven/skins/maven-default-skin/1.2/maven-default-skin-1.2.pom
[INFO] Downloaded: https://repo.maven.apache.org/maven2/org/apache/maven/skins/maven-default-skin/1.2/maven-default-skin-1.2.pom
(5 KB at 233.4 KB/sec)
[INFO]   maven-fluido-skin
[INFO] Downloading: https://repo.maven.apache.org/maven2/org/apache/maven/skins/maven-fluido-skin/1.7/maven-fluido-skin-1.7.pom
[INFO] Downloaded: https://repo.maven.apache.org/maven2/org/apache/maven/skins/maven-fluido-skin/1.7/maven-fluido-skin-1.7.pom
(28 KB at 1550.6 KB/sec)
[INFO] Downloading: https://repo.maven.apache.org/maven2/org/apache/maven/skins/maven-skins/30/maven-skins-30.pom
[INFO] Downloaded: https://repo.maven.apache.org/maven2/org/apache/maven/skins/maven-skins/30/maven-skins-30.pom
(3 KB at 118.1 KB/sec)
[INFO] /surefire: org.apache.maven.surefire
[INFO]   surefire
[INFO] /wagon: org.apache.maven.wagon
[INFO]   wagon
[INFO] Downloading: https://repo.maven.apache.org/maven2/org/apache/maven/wagon/wagon/3.2.0/wagon-3.2.0.pom
[INFO] Downloaded: https://repo.maven.apache.org/maven2/org/apache/maven/wagon/wagon/3.2.0/wagon-3.2.0.pom
(21 KB at 1032.7 KB/sec)
[INFO] 
[INFO] Generating "Dist Tool> Check Source Release" report --- dist-tool-plugin:1.0-SNAPSHOT:check-source-release
[INFO] > dist-area = http://www.apache.org/dist/maven/
[INFO] /archetype: org.apache.maven.archetype
[INFO]   maven-archetype
[INFO] /binaries: content.not.checked
[INFO] /doxia: org.apache.maven.doxia
[INFO]   doxia
[INFO]   doxia-converter
[INFO]   doxia-linkcheck
[WARNING] Missing file for doxia-linkcheck in https://repo.maven.apache.org/maven2/org/apache/maven/doxia/doxia-linkcheck/1.2/
[WARNING]  > doxia-linkcheck-1.2-source-release.zip <
[WARNING]  > doxia-linkcheck-1.2-source-release.zip.asc <
[WARNING]  > doxia-linkcheck-1.2-source-release.zip.sha1 or .sha512 <
[WARNING] Missing file for doxia-linkcheck in http://www.apache.org/dist/maven/doxia
[WARNING]  > doxia-linkcheck-1.2-source-release.zip <
[WARNING]  > doxia-linkcheck-1.2-source-release.zip.asc <
[WARNING]  > doxia-linkcheck-1.2-source-release.zip.sha1 or .sha512 <
[INFO]   doxia-sitetools
[INFO] /enforcer: org.apache.maven.enforcer
[INFO]   enforcer
[INFO] /indexer: org.apache.maven.indexer
[INFO]   maven-indexer
[INFO] /maven-3: org.apache.maven src+bin
[INFO]   apache-maven [3.0,3.1.0-alpha-1)
[INFO]   apache-maven [3.1.0,3.2.0-alpha-1)
[INFO]   apache-maven
IOException try 1 while reading http://www.apache.org/dist/maven/maven-3/3.6.0/source: class
org.jsoup.HttpStatusException HTTP error fetching URL
IOException try 2 while reading http://www.apache.org/dist/maven/maven-3/3.6.0/source: class
org.jsoup.HttpStatusException HTTP error fetching URL
IOException try 3 while reading http://www.apache.org/dist/maven/maven-3/3.6.0/source: class
org.jsoup.HttpStatusException HTTP error fetching URL
[WARNING] Attempt to (de-)serialize anonymous class hudson.maven.reporters.MavenSiteArchiver$1;
see: https://jenkins.io/redirect/serialization-of-anonymous-classes/
[JENKINS] Archiving site from <https://builds.apache.org/job/dist-tool-plugin/ws/target/site>
to /x1/jenkins/jenkins-home/jobs/dist-tool-plugin/site
[WARNING] Attempt to (de-)serialize anonymous class hudson.FilePath$32; see: https://jenkins.io/redirect/serialization-of-anonymous-classes/
[WARNING] Attempt to (de-)serialize anonymous class hudson.maven.reporters.MavenArtifactArchiver$2;
see: https://jenkins.io/redirect/serialization-of-anonymous-classes/
[WARNING] Attempt to (de-)serialize anonymous class hudson.maven.reporters.MavenFingerprinter$1;
see: https://jenkins.io/redirect/serialization-of-anonymous-classes/
[INFO] ------------------------------------------------------------------------
[INFO] BUILD FAILURE
[INFO] ------------------------------------------------------------------------
[INFO] Total time: 04:07 min
[INFO] Finished at: 2018-10-31T11:44:52+00:00
[INFO] Final Memory: 111M/3992M
[INFO] ------------------------------------------------------------------------
[WARNING] The requested profile "apache.snapshots" could not be activated because it does
not exist.
[ERROR] Failed to execute goal org.apache.maven.plugins:maven-site-plugin:3.7.1:site (default-site)
on project dist-tool-plugin: Error generating dist-tool-plugin:1.0-SNAPSHOT:check-source-release
report: IOException while reading http://www.apache.org/dist/maven/maven-3/3.6.0/source: HTTP
error fetching URL -> [Help 1]
org.apache.maven.lifecycle.LifecycleExecutionException: Failed to execute goal org.apache.maven.plugins:maven-site-plugin:3.7.1:site
(default-site) on project dist-tool-plugin: Error generating dist-tool-plugin:1.0-SNAPSHOT:check-source-release
report
	at org.apache.maven.lifecycle.internal.MojoExecutor.execute(MojoExecutor.java:212)
	at org.apache.maven.lifecycle.internal.MojoExecutor.execute(MojoExecutor.java:153)
	at org.apache.maven.lifecycle.internal.MojoExecutor.execute(MojoExecutor.java:145)
	at org.apache.maven.lifecycle.internal.LifecycleModuleBuilder.buildProject(LifecycleModuleBuilder.java:116)
	at org.apache.maven.lifecycle.internal.LifecycleModuleBuilder.buildProject(LifecycleModuleBuilder.java:80)
	at org.apache.maven.lifecycle.internal.builder.singlethreaded.SingleThreadedBuilder.build(SingleThreadedBuilder.java:51)
	at org.apache.maven.lifecycle.internal.LifecycleStarter.execute(LifecycleStarter.java:128)
	at org.apache.maven.DefaultMaven.doExecute(DefaultMaven.java:307)
	at org.apache.maven.DefaultMaven.doExecute(DefaultMaven.java:193)
	at org.apache.maven.DefaultMaven.execute(DefaultMaven.java:106)
	at org.jvnet.hudson.maven3.launcher.Maven33Launcher.main(Maven33Launcher.java:129)
	at sun.reflect.NativeMethodAccessorImpl.invoke0(Native Method)
	at sun.reflect.NativeMethodAccessorImpl.invoke(NativeMethodAccessorImpl.java:62)
	at sun.reflect.DelegatingMethodAccessorImpl.invoke(DelegatingMethodAccessorImpl.java:43)
	at java.lang.reflect.Method.invoke(Method.java:498)
	at org.codehaus.plexus.classworlds.launcher.Launcher.launchStandard(Launcher.java:330)
	at org.codehaus.plexus.classworlds.launcher.Launcher.launch(Launcher.java:238)
	at jenkins.maven3.agent.Maven33Main.launch(Maven33Main.java:176)
	at sun.reflect.NativeMethodAccessorImpl.invoke0(Native Method)
	at sun.reflect.NativeMethodAccessorImpl.invoke(NativeMethodAccessorImpl.java:62)
	at sun.reflect.DelegatingMethodAccessorImpl.invoke(DelegatingMethodAccessorImpl.java:43)
	at java.lang.reflect.Method.invoke(Method.java:498)
	at hudson.maven.Maven3Builder.call(Maven3Builder.java:139)
	at hudson.maven.Maven3Builder.call(Maven3Builder.java:70)
	at hudson.remoting.UserRequest.perform(UserRequest.java:212)
	at hudson.remoting.UserRequest.perform(UserRequest.java:54)
	at hudson.remoting.Request$2.run(Request.java:369)
	at hudson.remoting.InterceptingExecutorService$1.call(InterceptingExecutorService.java:72)
	at java.util.concurrent.FutureTask.run(FutureTask.java:266)
	at java.util.concurrent.ThreadPoolExecutor.runWorker(ThreadPoolExecutor.java:1149)
	at java.util.concurrent.ThreadPoolExecutor$Worker.run(ThreadPoolExecutor.java:624)
	at java.lang.Thread.run(Thread.java:748)
Caused by: org.apache.maven.plugin.MojoExecutionException: Error generating dist-tool-plugin:1.0-SNAPSHOT:check-source-release
report
	at org.apache.maven.plugins.site.render.SiteMojo.execute(SiteMojo.java:155)
	at org.apache.maven.plugin.DefaultBuildPluginManager.executeMojo(DefaultBuildPluginManager.java:134)
	at org.apache.maven.lifecycle.internal.MojoExecutor.execute(MojoExecutor.java:207)
	... 31 more
Caused by: org.apache.maven.reporting.MavenReportException: IOException while reading http://www.apache.org/dist/maven/maven-3/3.6.0/source
	at org.apache.maven.dist.tools.source.DistCheckSourceReleaseMojo.executeReport(DistCheckSourceReleaseMojo.java:267)
	at org.apache.maven.reporting.AbstractMavenReport.generate(AbstractMavenReport.java:251)
	at org.apache.maven.plugins.site.render.ReportDocumentRenderer.renderDocument(ReportDocumentRenderer.java:230)
	at org.apache.maven.doxia.siterenderer.DefaultSiteRenderer.render(DefaultSiteRenderer.java:349)
	at org.apache.maven.plugins.site.render.SiteMojo.renderLocale(SiteMojo.java:198)
	at org.apache.maven.plugins.site.render.SiteMojo.execute(SiteMojo.java:147)
	... 33 more
Caused by: org.apache.maven.plugin.MojoExecutionException: IOException while reading http://www.apache.org/dist/maven/maven-3/3.6.0/source
	at org.apache.maven.dist.tools.source.DistCheckSourceReleaseMojo.checkArtifact(DistCheckSourceReleaseMojo.java:562)
	at org.apache.maven.dist.tools.AbstractDistCheckMojo.execute(AbstractDistCheckMojo.java:268)
	at org.apache.maven.dist.tools.source.DistCheckSourceReleaseMojo.executeReport(DistCheckSourceReleaseMojo.java:263)
	... 38 more
Caused by: java.io.IOException: IOException while reading http://www.apache.org/dist/maven/maven-3/3.6.0/source
	at org.apache.maven.dist.tools.source.DistCheckSourceReleaseMojo.selectLinks(DistCheckSourceReleaseMojo.java:444)
	at org.apache.maven.dist.tools.source.DistCheckSourceReleaseMojo.checkDirectoryIndex(DistCheckSourceReleaseMojo.java:496)
	at org.apache.maven.dist.tools.source.DistCheckSourceReleaseMojo.checkArtifact(DistCheckSourceReleaseMojo.java:557)
	... 40 more
Caused by: java.io.IOException: IOException while reading http://www.apache.org/dist/maven/maven-3/3.6.0/source
	at org.apache.maven.dist.tools.JsoupRetry.get(JsoupRetry.java:52)
	at org.apache.maven.dist.tools.source.DistCheckSourceReleaseMojo.read(DistCheckSourceReleaseMojo.java:425)
	at org.apache.maven.dist.tools.source.DistCheckSourceReleaseMojo.selectLinks(DistCheckSourceReleaseMojo.java:440)
	... 42 more
Caused by: org.jsoup.HttpStatusException: HTTP error fetching URL. Status=404, URL=http://www.apache.org/dist/maven/maven-3/3.6.0/source
	at org.jsoup.helper.HttpConnection$Response.execute(HttpConnection.java:435)
	at org.jsoup.helper.HttpConnection$Response.execute(HttpConnection.java:410)
	at org.jsoup.helper.HttpConnection.execute(HttpConnection.java:164)
	at org.jsoup.helper.HttpConnection.get(HttpConnection.java:153)
	at org.apache.maven.dist.tools.JsoupRetry.get(JsoupRetry.java:43)
	... 44 more
[ERROR] 
[ERROR] Re-run Maven using the -X switch to enable full debug logging.
[ERROR] 
[ERROR] For more information about the errors and possible solutions, please read the following
articles:
[ERROR] [Help 1] http://cwiki.apache.org/confluence/display/MAVEN/MojoExecutionException
[JENKINS] Archiving <https://builds.apache.org/job/dist-tool-plugin/ws/pom.xml> to org.apache.maven.dist.tools/dist-tool-plugin/1.0-SNAPSHOT/dist-tool-plugin-1.0-SNAPSHOT.pom
[JENKINS] Archiving <https://builds.apache.org/job/dist-tool-plugin/ws/target/dist-tool-plugin-1.0-SNAPSHOT.jar>
to org.apache.maven.dist.tools/dist-tool-plugin/1.0-SNAPSHOT/dist-tool-plugin-1.0-SNAPSHOT.jar
channel stopped

Mime
View raw message