maven-notifications mailing list archives

Site index · List index
Message view « Date » · « Thread »
Top « Date » · « Thread »
From Apache Jenkins Server <jenk...@builds.apache.org>
Subject Build failed in Jenkins: Maven TLP » maven » MNG-6164 #14
Date Fri, 14 Sep 2018 03:38:13 GMT
See https://builds.apache.org/job/maven-box/job/maven/job/MNG-6164/14/

No changes.

No tests ran.

Build log:
Branch indexing
Obtained Jenkinsfile from 0db185b59952f12707eeab1ce2b8003b4546d18f
Running in Durability level: MAX_SURVIVABILITY
Loading library jenkins-env@master
Attempting to resolve master from remote references...
 > git --version # timeout=10
 > git ls-remote -h https://gitbox.apache.org/repos/asf/maven-jenkins-env.git # timeout=10
Found match: refs/heads/master revision 3d06b769e61a13a2a9719212c5c06012f2a55535
 > git rev-parse --is-inside-work-tree # timeout=10
Fetching changes from the remote Git repository
 > git config remote.origin.url https://gitbox.apache.org/repos/asf/maven-jenkins-env.git
# timeout=10
Fetching without tags
Fetching upstream changes from https://gitbox.apache.org/repos/asf/maven-jenkins-env.git
 > git --version # timeout=10
 > git fetch --no-tags --progress https://gitbox.apache.org/repos/asf/maven-jenkins-env.git
+refs/heads/*:refs/remotes/origin/*
Checking out Revision 3d06b769e61a13a2a9719212c5c06012f2a55535 (master)
 > git config core.sparsecheckout # timeout=10
 > git checkout -f 3d06b769e61a13a2a9719212c5c06012f2a55535
Commit message: "Back to all Windows nodes"
 > git rev-list --no-walk 3d06b769e61a13a2a9719212c5c06012f2a55535 # timeout=10
Loading library jenkins-lib@master
Attempting to resolve master from remote references...
 > git --version # timeout=10
 > git ls-remote -h https://gitbox.apache.org/repos/asf/maven-jenkins-lib.git # timeout=10
Found match: refs/heads/master revision c2152da6e3520c4631ffc32521dcab9ac0f1aea0
 > git rev-parse --is-inside-work-tree # timeout=10
Fetching changes from the remote Git repository
 > git config remote.origin.url https://gitbox.apache.org/repos/asf/maven-jenkins-lib.git
# timeout=10
Fetching without tags
Fetching upstream changes from https://gitbox.apache.org/repos/asf/maven-jenkins-lib.git
 > git --version # timeout=10
 > git fetch --no-tags --progress https://gitbox.apache.org/repos/asf/maven-jenkins-lib.git
+refs/heads/*:refs/remotes/origin/*
Checking out Revision c2152da6e3520c4631ffc32521dcab9ac0f1aea0 (master)
 > git config core.sparsecheckout # timeout=10
 > git checkout -f c2152da6e3520c4631ffc32521dcab9ac0f1aea0
Commit message: "Try to display PATH value"
 > git rev-list --no-walk c2152da6e3520c4631ffc32521dcab9ac0f1aea0 # timeout=10
[Pipeline] properties
[Pipeline] node
Running on H27 in /home/jenkins/jenkins-slave/workspace/maven-box_maven_MNG-6164-Y4N6HLOWJB2PZSML5WT27ZNIOJ4UNMGAVJIZUP34B475F6WRUI5Q
[Pipeline] {
[Pipeline] dir
Running in /home/jenkins/jenkins-slave/workspace/maven-box_maven_MNG-6164-Y4N6HLOWJB2PZSML5WT27ZNIOJ4UNMGAVJIZUP34B475F6WRUI5Q/build
[Pipeline] {
[Pipeline] stage
[Pipeline] { (Checkout)
[Pipeline] checkout
 > git rev-parse --is-inside-work-tree # timeout=10
Fetching changes from the remote Git repository
 > git config remote.origin.url https://gitbox.apache.org/repos/asf/maven.git # timeout=10
ERROR: Error fetching remote repo 'origin'
hudson.plugins.git.GitException: Failed to fetch from https://gitbox.apache.org/repos/asf/maven.git
	at hudson.plugins.git.GitSCM.fetchFrom(GitSCM.java:888)
	at hudson.plugins.git.GitSCM.retrieveChanges(GitSCM.java:1155)
	at hudson.plugins.git.GitSCM.checkout(GitSCM.java:1186)
	at org.jenkinsci.plugins.workflow.steps.scm.SCMStep.checkout(SCMStep.java:113)
	at org.jenkinsci.plugins.workflow.steps.scm.SCMStep$StepExecutionImpl.run(SCMStep.java:85)
	at org.jenkinsci.plugins.workflow.steps.scm.SCMStep$StepExecutionImpl.run(SCMStep.java:75)
	at org.jenkinsci.plugins.workflow.steps.AbstractSynchronousNonBlockingStepExecution$1$1.call(AbstractSynchronousNonBlockingStepExecution.java:47)
	at hudson.security.ACL.impersonate(ACL.java:290)
	at org.jenkinsci.plugins.workflow.steps.AbstractSynchronousNonBlockingStepExecution$1.run(AbstractSynchronousNonBlockingStepExecution.java:44)
	at java.util.concurrent.Executors$RunnableAdapter.call(Executors.java:511)
	at java.util.concurrent.FutureTask.run(FutureTask.java:266)
	at java.util.concurrent.ThreadPoolExecutor.runWorker(ThreadPoolExecutor.java:1149)
	at java.util.concurrent.ThreadPoolExecutor$Worker.run(ThreadPoolExecutor.java:624)
	at java.lang.Thread.run(Thread.java:748)
Caused by: hudson.plugins.git.GitException: Command "git config remote.origin.url https://gitbox.apache.org/repos/asf/maven.git"
returned status code 4:
stdout: 
stderr: error: failed to write new configuration file /home/jenkins/jenkins-slave/workspace/maven-box_maven_MNG-6164-Y4N6HLOWJB2PZSML5WT27ZNIOJ4UNMGAVJIZUP34B475F6WRUI5Q/build/.git/config.lock

	at org.jenkinsci.plugins.gitclient.CliGitAPIImpl.launchCommandIn(CliGitAPIImpl.java:2002)
	at org.jenkinsci.plugins.gitclient.CliGitAPIImpl.launchCommandIn(CliGitAPIImpl.java:1970)
	at org.jenkinsci.plugins.gitclient.CliGitAPIImpl.launchCommandIn(CliGitAPIImpl.java:1966)
	at org.jenkinsci.plugins.gitclient.CliGitAPIImpl.launchCommand(CliGitAPIImpl.java:1597)
	at org.jenkinsci.plugins.gitclient.CliGitAPIImpl.launchCommand(CliGitAPIImpl.java:1609)
	at org.jenkinsci.plugins.gitclient.CliGitAPIImpl.setRemoteUrl(CliGitAPIImpl.java:1243)
	at hudson.plugins.git.GitAPI.setRemoteUrl(GitAPI.java:160)
	at sun.reflect.GeneratedMethodAccessor61.invoke(Unknown Source)
	at sun.reflect.DelegatingMethodAccessorImpl.invoke(DelegatingMethodAccessorImpl.java:43)
	at java.lang.reflect.Method.invoke(Method.java:498)
	at hudson.remoting.RemoteInvocationHandler$RPCRequest.perform(RemoteInvocationHandler.java:929)
	at hudson.remoting.RemoteInvocationHandler$RPCRequest.call(RemoteInvocationHandler.java:903)
	at hudson.remoting.RemoteInvocationHandler$RPCRequest.call(RemoteInvocationHandler.java:855)
	at hudson.remoting.UserRequest.perform(UserRequest.java:212)
	at hudson.remoting.UserRequest.perform(UserRequest.java:54)
	at hudson.remoting.Request$2.run(Request.java:369)
	at hudson.remoting.InterceptingExecutorService$1.call(InterceptingExecutorService.java:72)
	at java.util.concurrent.FutureTask.run(FutureTask.java:266)
	at java.util.concurrent.ThreadPoolExecutor.runWorker(ThreadPoolExecutor.java:1142)
	at java.util.concurrent.ThreadPoolExecutor$Worker.run(ThreadPoolExecutor.java:617)
	... 1 more
	Suppressed: hudson.remoting.Channel$CallSiteStackTrace: Remote call to H27
		at hudson.remoting.Channel.attachCallSiteStackTrace(Channel.java:1741)
		at hudson.remoting.UserRequest$ExceptionResponse.retrieve(UserRequest.java:357)
		at hudson.remoting.Channel.call(Channel.java:955)
		at hudson.remoting.RemoteInvocationHandler.invoke(RemoteInvocationHandler.java:283)
		at com.sun.proxy.$Proxy118.setRemoteUrl(Unknown Source)
		at org.jenkinsci.plugins.gitclient.RemoteGitImpl.setRemoteUrl(RemoteGitImpl.java:295)
		at hudson.plugins.git.GitSCM.fetchFrom(GitSCM.java:876)
		at hudson.plugins.git.GitSCM.retrieveChanges(GitSCM.java:1155)
		at hudson.plugins.git.GitSCM.checkout(GitSCM.java:1186)
		at org.jenkinsci.plugins.workflow.steps.scm.SCMStep.checkout(SCMStep.java:113)
		at org.jenkinsci.plugins.workflow.steps.scm.SCMStep$StepExecutionImpl.run(SCMStep.java:85)
		at org.jenkinsci.plugins.workflow.steps.scm.SCMStep$StepExecutionImpl.run(SCMStep.java:75)
		at org.jenkinsci.plugins.workflow.steps.AbstractSynchronousNonBlockingStepExecution$1$1.call(AbstractSynchronousNonBlockingStepExecution.java:47)
		at hudson.security.ACL.impersonate(ACL.java:290)
		at org.jenkinsci.plugins.workflow.steps.AbstractSynchronousNonBlockingStepExecution$1.run(AbstractSynchronousNonBlockingStepExecution.java:44)
		at java.util.concurrent.Executors$RunnableAdapter.call(Executors.java:511)
		at java.util.concurrent.FutureTask.run(FutureTask.java:266)
		at java.util.concurrent.ThreadPoolExecutor.runWorker(ThreadPoolExecutor.java:1149)
		at java.util.concurrent.ThreadPoolExecutor$Worker.run(ThreadPoolExecutor.java:624)
		... 1 more
[Pipeline] }
[Pipeline] // stage
[Pipeline] }
[Pipeline] // dir
[Pipeline] }
[Pipeline] // node
[Pipeline] stage
[Pipeline] { (Notifications)
[Pipeline] echo
Build result: FAILURE
[Pipeline] jiraIssueSelector
Mime
  • Unnamed multipart/mixed (inline, None, 0 bytes)
View raw message