maven-notifications mailing list archives

Site index · List index
Message view « Date » · « Thread »
Top « Date » · « Thread »
From Apache Jenkins Server <jenk...@builds.apache.org>
Subject Build unstable in Jenkins: Maven TLP » maven » MNG-6391 #22
Date Sun, 30 Sep 2018 14:45:54 GMT
See https://builds.apache.org/job/maven-box/job/maven/job/MNG-6391/22/

No changes.

3 tests failed.
FAILED:  org.apache.maven.it.MavenITmng6352PrintVersionTest.testitShouldPrintVersionAtTopAndAtBottom

Error Message:
expected:<4> but was:<0>

Stack Trace:
junit.framework.AssertionFailedError: expected:<4> but was:<0>
	at org.apache.maven.it.MavenITmng6352PrintVersionTest.testitShouldPrintVersionAtTopAndAtBottom(MavenITmng6352PrintVersionTest.java:72)


FAILED:  org.apache.maven.it.MavenITmng6352PrintVersionTest.testitShouldPrintVersionAtTopAndAtBottom

Error Message:
expected:<4> but was:<0>

Stack Trace:
junit.framework.AssertionFailedError: expected:<4> but was:<0>
	at org.apache.maven.it.MavenITmng6352PrintVersionTest.testitShouldPrintVersionAtTopAndAtBottom(MavenITmng6352PrintVersionTest.java:72)


FAILED:  org.apache.maven.it.MavenITmng6352PrintVersionTest.testitShouldPrintVersionAtTopAndAtBottom

Error Message:
expected:<4> but was:<0>

Stack Trace:
junit.framework.AssertionFailedError: expected:<4> but was:<0>
	at org.apache.maven.it.MavenITmng6352PrintVersionTest.testitShouldPrintVersionAtTopAndAtBottom(MavenITmng6352PrintVersionTest.java:72)




Build log:
[...truncated 9.35 MB...]
[windows-jdk8] 	at org.jenkinsci.plugins.pipeline.maven.util.XmlUtils.getPathInWorkspace(XmlUtils.java:397)
[windows-jdk8] 	at org.jenkinsci.plugins.pipeline.maven.publishers.GeneratedArtifactsPublisher.process(GeneratedArtifactsPublisher.java:90)
[windows-jdk8] 	at org.jenkinsci.plugins.pipeline.maven.MavenSpyLogProcessor.processMavenSpyLogs(MavenSpyLogProcessor.java:118)
[windows-jdk8] 	at org.jenkinsci.plugins.pipeline.maven.WithMavenStepExecution$WithMavenStepExecutionCallBack.finished(WithMavenStepExecution.java:1050)
[windows-jdk8] 	at org.jenkinsci.plugins.workflow.steps.BodyExecutionCallback$TailCall.onSuccess(BodyExecutionCallback.java:114)
[windows-jdk8] 	at org.jenkinsci.plugins.workflow.cps.CpsBodyExecution$SuccessAdapter.receive(CpsBodyExecution.java:366)
[windows-jdk8] 	at com.cloudbees.groovy.cps.Outcome.resumeFrom(Outcome.java:73)
[windows-jdk8] 	at com.cloudbees.groovy.cps.Continuable$1.call(Continuable.java:166)
[windows-jdk8] 	at com.cloudbees.groovy.cps.Continuable$1.call(Continuable.java:163)
[windows-jdk8] 	at org.codehaus.groovy.runtime.GroovyCategorySupport$ThreadCategoryInfo.use(GroovyCategorySupport.java:122)
[windows-jdk8] 	at org.codehaus.groovy.runtime.GroovyCategorySupport.use(GroovyCategorySupport.java:261)
[windows-jdk8] 	at com.cloudbees.groovy.cps.Continuable.run0(Continuable.java:163)
[windows-jdk8] 	at org.jenkinsci.plugins.workflow.cps.SandboxContinuable.access$101(SandboxContinuable.java:34)
[windows-jdk8] 	at org.jenkinsci.plugins.workflow.cps.SandboxContinuable.lambda$run0$0(SandboxContinuable.java:59)
[windows-jdk8] 	at org.jenkinsci.plugins.scriptsecurity.sandbox.groovy.GroovySandbox.runInSandbox(GroovySandbox.java:108)
[windows-jdk8] 	at org.jenkinsci.plugins.workflow.cps.SandboxContinuable.run0(SandboxContinuable.java:58)
[windows-jdk8] 	at org.jenkinsci.plugins.workflow.cps.CpsThread.runNextChunk(CpsThread.java:174)
[windows-jdk8] 	at org.jenkinsci.plugins.workflow.cps.CpsThreadGroup.run(CpsThreadGroup.java:332)
[windows-jdk8] 	at org.jenkinsci.plugins.workflow.cps.CpsThreadGroup.access$200(CpsThreadGroup.java:83)
[windows-jdk8] 	at org.jenkinsci.plugins.workflow.cps.CpsThreadGroup$2.call(CpsThreadGroup.java:244)
[windows-jdk8] 	at org.jenkinsci.plugins.workflow.cps.CpsThreadGroup$2.call(CpsThreadGroup.java:232)
[windows-jdk8] 	at org.jenkinsci.plugins.workflow.cps.CpsVmExecutorService$2.call(CpsVmExecutorService.java:64)
[windows-jdk8] 	at java.util.concurrent.FutureTask.run(FutureTask.java:266)
[windows-jdk8] 	at hudson.remoting.SingleLaneExecutorService$1.run(SingleLaneExecutorService.java:131)
[windows-jdk8] 	at jenkins.util.ContextResettingExecutorService$1.run(ContextResettingExecutorService.java:28)
[windows-jdk8] 	at jenkins.security.ImpersonatingExecutorService$1.run(ImpersonatingExecutorService.java:59)
[windows-jdk8] 	at java.util.concurrent.Executors$RunnableAdapter.call(Executors.java:511)
[windows-jdk8] 	at java.util.concurrent.FutureTask.run(FutureTask.java:266)
[windows-jdk8] 	at java.util.concurrent.ThreadPoolExecutor.runWorker(ThreadPoolExecutor.java:1149)
[windows-jdk8] 	at java.util.concurrent.ThreadPoolExecutor$Worker.run(ThreadPoolExecutor.java:624)
[windows-jdk8] 	at java.lang.Thread.run(Thread.java:748)
[windows-jdk8] ERROR: [withMaven] artifactsPublisher - WARNING: Exception archiving and fingerprinting
MavenArtifact{org.apache.maven.its:core-it-suite:pom:2.1-SNAPSHOT(version: 2.1-SNAPSHOT, snapshot:false)
 C:\mvn-it-0.tmp\core-it-suite\pom.xml}, skip archiving of the artifacts
[windows-jdk8] java.lang.IllegalArgumentException: Cannot relativize 'C:\mvn-it-0.tmp\core-it-suite\pom.xml'
relatively to '/mvn-it-0.tmp'
[windows-jdk8] 	at org.jenkinsci.plugins.pipeline.maven.util.XmlUtils.getPathInWorkspace(XmlUtils.java:397)
[windows-jdk8] 	at org.jenkinsci.plugins.pipeline.maven.publishers.GeneratedArtifactsPublisher.process(GeneratedArtifactsPublisher.java:75)
[windows-jdk8] 	at org.jenkinsci.plugins.pipeline.maven.MavenSpyLogProcessor.processMavenSpyLogs(MavenSpyLogProcessor.java:118)
[windows-jdk8] 	at org.jenkinsci.plugins.pipeline.maven.WithMavenStepExecution$WithMavenStepExecutionCallBack.finished(WithMavenStepExecution.java:1050)
[windows-jdk8] 	at org.jenkinsci.plugins.workflow.steps.BodyExecutionCallback$TailCall.onSuccess(BodyExecutionCallback.java:114)
[windows-jdk8] 	at org.jenkinsci.plugins.workflow.cps.CpsBodyExecution$SuccessAdapter.receive(CpsBodyExecution.java:366)
[windows-jdk8] 	at com.cloudbees.groovy.cps.Outcome.resumeFrom(Outcome.java:73)
[windows-jdk8] 	at com.cloudbees.groovy.cps.Continuable$1.call(Continuable.java:166)
[windows-jdk8] 	at com.cloudbees.groovy.cps.Continuable$1.call(Continuable.java:163)
[windows-jdk8] 	at org.codehaus.groovy.runtime.GroovyCategorySupport$ThreadCategoryInfo.use(GroovyCategorySupport.java:122)
[windows-jdk8] 	at org.codehaus.groovy.runtime.GroovyCategorySupport.use(GroovyCategorySupport.java:261)
[windows-jdk8] 	at com.cloudbees.groovy.cps.Continuable.run0(Continuable.java:163)
[windows-jdk8] 	at org.jenkinsci.plugins.workflow.cps.SandboxContinuable.access$101(SandboxContinuable.java:34)
[windows-jdk8] 	at org.jenkinsci.plugins.workflow.cps.SandboxContinuable.lambda$run0$0(SandboxContinuable.java:59)
[windows-jdk8] 	at org.jenkinsci.plugins.scriptsecurity.sandbox.groovy.GroovySandbox.runInSandbox(GroovySandbox.java:108)
[windows-jdk8] 	at org.jenkinsci.plugins.workflow.cps.SandboxContinuable.run0(SandboxContinuable.java:58)
[windows-jdk8] 	at org.jenkinsci.plugins.workflow.cps.CpsThread.runNextChunk(CpsThread.java:174)
[windows-jdk8] 	at org.jenkinsci.plugins.workflow.cps.CpsThreadGroup.run(CpsThreadGroup.java:332)
[windows-jdk8] 	at org.jenkinsci.plugins.workflow.cps.CpsThreadGroup.access$200(CpsThreadGroup.java:83)
[windows-jdk8] 	at org.jenkinsci.plugins.workflow.cps.CpsThreadGroup$2.call(CpsThreadGroup.java:244)
[windows-jdk8] 	at org.jenkinsci.plugins.workflow.cps.CpsThreadGroup$2.call(CpsThreadGroup.java:232)
[windows-jdk8] 	at org.jenkinsci.plugins.workflow.cps.CpsVmExecutorService$2.call(CpsVmExecutorService.java:64)
[windows-jdk8] 	at java.util.concurrent.FutureTask.run(FutureTask.java:266)
[windows-jdk8] 	at hudson.remoting.SingleLaneExecutorService$1.run(SingleLaneExecutorService.java:131)
[windows-jdk8] 	at jenkins.util.ContextResettingExecutorService$1.run(ContextResettingExecutorService.java:28)
[windows-jdk8] 	at jenkins.security.ImpersonatingExecutorService$1.run(ImpersonatingExecutorService.java:59)
[windows-jdk8] 	at java.util.concurrent.Executors$RunnableAdapter.call(Executors.java:511)
[windows-jdk8] 	at java.util.concurrent.FutureTask.run(FutureTask.java:266)
[windows-jdk8] 	at java.util.concurrent.ThreadPoolExecutor.runWorker(ThreadPoolExecutor.java:1149)
[windows-jdk8] 	at java.util.concurrent.ThreadPoolExecutor$Worker.run(ThreadPoolExecutor.java:624)
[windows-jdk8] 	at java.lang.Thread.run(Thread.java:748)
[windows-jdk8] ERROR: [withMaven] artifactsPublisher - WARNING: Exception archiving and fingerprinting
MavenArtifact{org.apache.maven.its:core-it-suite:jar:2.1-SNAPSHOT(version: 2.1-SNAPSHOT, snapshot:true)
 C:\mvn-it-0.tmp\core-it-suite\target\core-it-suite-2.1-SNAPSHOT.jar}, skip archiving of the
artifacts
[windows-jdk8] java.lang.IllegalArgumentException: Cannot relativize 'C:\mvn-it-0.tmp\core-it-suite\target\core-it-suite-2.1-SNAPSHOT.jar'
relatively to '/mvn-it-0.tmp'
[windows-jdk8] 	at org.jenkinsci.plugins.pipeline.maven.util.XmlUtils.getPathInWorkspace(XmlUtils.java:397)
[windows-jdk8] 	at org.jenkinsci.plugins.pipeline.maven.publishers.GeneratedArtifactsPublisher.process(GeneratedArtifactsPublisher.java:90)
[windows-jdk8] 	at org.jenkinsci.plugins.pipeline.maven.MavenSpyLogProcessor.processMavenSpyLogs(MavenSpyLogProcessor.java:118)
[windows-jdk8] 	at org.jenkinsci.plugins.pipeline.maven.WithMavenStepExecution$WithMavenStepExecutionCallBack.finished(WithMavenStepExecution.java:1050)
[windows-jdk8] 	at org.jenkinsci.plugins.workflow.steps.BodyExecutionCallback$TailCall.onSuccess(BodyExecutionCallback.java:114)
[windows-jdk8] 	at org.jenkinsci.plugins.workflow.cps.CpsBodyExecution$SuccessAdapter.receive(CpsBodyExecution.java:366)
[windows-jdk8] 	at com.cloudbees.groovy.cps.Outcome.resumeFrom(Outcome.java:73)
[windows-jdk8] 	at com.cloudbees.groovy.cps.Continuable$1.call(Continuable.java:166)
[windows-jdk8] 	at com.cloudbees.groovy.cps.Continuable$1.call(Continuable.java:163)
[windows-jdk8] 	at org.codehaus.groovy.runtime.GroovyCategorySupport$ThreadCategoryInfo.use(GroovyCategorySupport.java:122)
[windows-jdk8] 	at org.codehaus.groovy.runtime.GroovyCategorySupport.use(GroovyCategorySupport.java:261)
[windows-jdk8] 	at com.cloudbees.groovy.cps.Continuable.run0(Continuable.java:163)
[windows-jdk8] 	at org.jenkinsci.plugins.workflow.cps.SandboxContinuable.access$101(SandboxContinuable.java:34)
[windows-jdk8] 	at org.jenkinsci.plugins.workflow.cps.SandboxContinuable.lambda$run0$0(SandboxContinuable.java:59)
[windows-jdk8] 	at org.jenkinsci.plugins.scriptsecurity.sandbox.groovy.GroovySandbox.runInSandbox(GroovySandbox.java:108)
[windows-jdk8] 	at org.jenkinsci.plugins.workflow.cps.SandboxContinuable.run0(SandboxContinuable.java:58)
[windows-jdk8] 	at org.jenkinsci.plugins.workflow.cps.CpsThread.runNextChunk(CpsThread.java:174)
[windows-jdk8] 	at org.jenkinsci.plugins.workflow.cps.CpsThreadGroup.run(CpsThreadGroup.java:332)
[windows-jdk8] 	at org.jenkinsci.plugins.workflow.cps.CpsThreadGroup.access$200(CpsThreadGroup.java:83)
[windows-jdk8] 	at org.jenkinsci.plugins.workflow.cps.CpsThreadGroup$2.call(CpsThreadGroup.java:244)
[windows-jdk8] 	at org.jenkinsci.plugins.workflow.cps.CpsThreadGroup$2.call(CpsThreadGroup.java:232)
[windows-jdk8] 	at org.jenkinsci.plugins.workflow.cps.CpsVmExecutorService$2.call(CpsVmExecutorService.java:64)
[windows-jdk8] 	at java.util.concurrent.FutureTask.run(FutureTask.java:266)
[windows-jdk8] 	at hudson.remoting.SingleLaneExecutorService$1.run(SingleLaneExecutorService.java:131)
[windows-jdk8] 	at jenkins.util.ContextResettingExecutorService$1.run(ContextResettingExecutorService.java:28)
[windows-jdk8] 	at jenkins.security.ImpersonatingExecutorService$1.run(ImpersonatingExecutorService.java:59)
[windows-jdk8] 	at java.util.concurrent.Executors$RunnableAdapter.call(Executors.java:511)
[windows-jdk8] 	at java.util.concurrent.FutureTask.run(FutureTask.java:266)
[windows-jdk8] 	at java.util.concurrent.ThreadPoolExecutor.runWorker(ThreadPoolExecutor.java:1149)
[windows-jdk8] 	at java.util.concurrent.ThreadPoolExecutor$Worker.run(ThreadPoolExecutor.java:624)
[windows-jdk8] 	at java.lang.Thread.run(Thread.java:748)
[windows-jdk8] ERROR: [withMaven] artifactsPublisher - WARNING: Exception archiving and fingerprinting
MavenArtifact{org.apache.maven.its:core-it-suite:test-jar:tests:2.1-SNAPSHOT(version: 2.1-SNAPSHOT,
snapshot:true)  C:\mvn-it-0.tmp\core-it-suite\target\core-it-suite-2.1-SNAPSHOT-tests.jar},
skip archiving of the artifacts
[windows-jdk8] java.lang.IllegalArgumentException: Cannot relativize 'C:\mvn-it-0.tmp\core-it-suite\target\core-it-suite-2.1-SNAPSHOT-tests.jar'
relatively to '/mvn-it-0.tmp'
[windows-jdk8] 	at org.jenkinsci.plugins.pipeline.maven.util.XmlUtils.getPathInWorkspace(XmlUtils.java:397)
[windows-jdk8] 	at org.jenkinsci.plugins.pipeline.maven.publishers.GeneratedArtifactsPublisher.process(GeneratedArtifactsPublisher.java:90)
[windows-jdk8] 	at org.jenkinsci.plugins.pipeline.maven.MavenSpyLogProcessor.processMavenSpyLogs(MavenSpyLogProcessor.java:118)
[windows-jdk8] 	at org.jenkinsci.plugins.pipeline.maven.WithMavenStepExecution$WithMavenStepExecutionCallBack.finished(WithMavenStepExecution.java:1050)
[windows-jdk8] 	at org.jenkinsci.plugins.workflow.steps.BodyExecutionCallback$TailCall.onSuccess(BodyExecutionCallback.java:114)
[windows-jdk8] 	at org.jenkinsci.plugins.workflow.cps.CpsBodyExecution$SuccessAdapter.receive(CpsBodyExecution.java:366)
[windows-jdk8] 	at com.cloudbees.groovy.cps.Outcome.resumeFrom(Outcome.java:73)
[windows-jdk8] 	at com.cloudbees.groovy.cps.Continuable$1.call(Continuable.java:166)
[windows-jdk8] 	at com.cloudbees.groovy.cps.Continuable$1.call(Continuable.java:163)
[windows-jdk8] 	at org.codehaus.groovy.runtime.GroovyCategorySupport$ThreadCategoryInfo.use(GroovyCategorySupport.java:122)
[windows-jdk8] 	at org.codehaus.groovy.runtime.GroovyCategorySupport.use(GroovyCategorySupport.java:261)
[windows-jdk8] 	at com.cloudbees.groovy.cps.Continuable.run0(Continuable.java:163)
[windows-jdk8] 	at org.jenkinsci.plugins.workflow.cps.SandboxContinuable.access$101(SandboxContinuable.java:34)
[windows-jdk8] 	at org.jenkinsci.plugins.workflow.cps.SandboxContinuable.lambda$run0$0(SandboxContinuable.java:59)
[windows-jdk8] 	at org.jenkinsci.plugins.scriptsecurity.sandbox.groovy.GroovySandbox.runInSandbox(GroovySandbox.java:108)
[windows-jdk8] 	at org.jenkinsci.plugins.workflow.cps.SandboxContinuable.run0(SandboxContinuable.java:58)
[windows-jdk8] 	at org.jenkinsci.plugins.workflow.cps.CpsThread.runNextChunk(CpsThread.java:174)
[windows-jdk8] 	at org.jenkinsci.plugins.workflow.cps.CpsThreadGroup.run(CpsThreadGroup.java:332)
[windows-jdk8] 	at org.jenkinsci.plugins.workflow.cps.CpsThreadGroup.access$200(CpsThreadGroup.java:83)
[windows-jdk8] 	at org.jenkinsci.plugins.workflow.cps.CpsThreadGroup$2.call(CpsThreadGroup.java:244)
[windows-jdk8] 	at org.jenkinsci.plugins.workflow.cps.CpsThreadGroup$2.call(CpsThreadGroup.java:232)
[windows-jdk8] 	at org.jenkinsci.plugins.workflow.cps.CpsVmExecutorService$2.call(CpsVmExecutorService.java:64)
[windows-jdk8] 	at java.util.concurrent.FutureTask.run(FutureTask.java:266)
[windows-jdk8] 	at hudson.remoting.SingleLaneExecutorService$1.run(SingleLaneExecutorService.java:131)
[windows-jdk8] 	at jenkins.util.ContextResettingExecutorService$1.run(ContextResettingExecutorService.java:28)
[windows-jdk8] 	at jenkins.security.ImpersonatingExecutorService$1.run(ImpersonatingExecutorService.java:59)
[windows-jdk8] 	at java.util.concurrent.Executors$RunnableAdapter.call(Executors.java:511)
[windows-jdk8] 	at java.util.concurrent.FutureTask.run(FutureTask.java:266)
[windows-jdk8] 	at java.util.concurrent.ThreadPoolExecutor.runWorker(ThreadPoolExecutor.java:1149)
[windows-jdk8] 	at java.util.concurrent.ThreadPoolExecutor$Worker.run(ThreadPoolExecutor.java:624)
[windows-jdk8] 	at java.lang.Thread.run(Thread.java:748)
[windows-jdk8] ERROR: [withMaven] WARNING Exception executing Maven reporter 'Junit Publisher'
/ org.jenkinsci.plugins.pipeline.maven.publishers.JunitTestsPublisher. Please report a bug
associated for the component 'pipeline-maven-plugin' at https://issues.jenkins-ci.org 
[windows-jdk8] java.lang.IllegalArgumentException: Cannot relativize 'C:\mvn-it-0.tmp\core-it-support\core-it-plugins\maven-it-plugin-active-collection\target/surefire-reports'
relatively to '/mvn-it-0.tmp'
[windows-jdk8] 	at org.jenkinsci.plugins.pipeline.maven.util.XmlUtils.getPathInWorkspace(XmlUtils.java:397)
[windows-jdk8] 	at org.jenkinsci.plugins.pipeline.maven.publishers.JunitTestsPublisher.executeReporter(JunitTestsPublisher.java:256)
[windows-jdk8] 	at org.jenkinsci.plugins.pipeline.maven.publishers.JunitTestsPublisher.process(JunitTestsPublisher.java:196)
[windows-jdk8] 	at org.jenkinsci.plugins.pipeline.maven.MavenSpyLogProcessor.processMavenSpyLogs(MavenSpyLogProcessor.java:118)
[windows-jdk8] 	at org.jenkinsci.plugins.pipeline.maven.WithMavenStepExecution$WithMavenStepExecutionCallBack.finished(WithMavenStepExecution.java:1050)
[windows-jdk8] 	at org.jenkinsci.plugins.workflow.steps.BodyExecutionCallback$TailCall.onSuccess(BodyExecutionCallback.java:114)
[windows-jdk8] 	at org.jenkinsci.plugins.workflow.cps.CpsBodyExecution$SuccessAdapter.receive(CpsBodyExecution.java:366)
[windows-jdk8] 	at com.cloudbees.groovy.cps.Outcome.resumeFrom(Outcome.java:73)
[windows-jdk8] 	at com.cloudbees.groovy.cps.Continuable$1.call(Continuable.java:166)
[windows-jdk8] 	at com.cloudbees.groovy.cps.Continuable$1.call(Continuable.java:163)
[windows-jdk8] 	at org.codehaus.groovy.runtime.GroovyCategorySupport$ThreadCategoryInfo.use(GroovyCategorySupport.java:122)
[windows-jdk8] 	at org.codehaus.groovy.runtime.GroovyCategorySupport.use(GroovyCategorySupport.java:261)
[windows-jdk8] 	at com.cloudbees.groovy.cps.Continuable.run0(Continuable.java:163)
[windows-jdk8] 	at org.jenkinsci.plugins.workflow.cps.SandboxContinuable.access$101(SandboxContinuable.java:34)
[windows-jdk8] 	at org.jenkinsci.plugins.workflow.cps.SandboxContinuable.lambda$run0$0(SandboxContinuable.java:59)
[windows-jdk8] 	at org.jenkinsci.plugins.scriptsecurity.sandbox.groovy.GroovySandbox.runInSandbox(GroovySandbox.java:108)
[windows-jdk8] 	at org.jenkinsci.plugins.workflow.cps.SandboxContinuable.run0(SandboxContinuable.java:58)
[windows-jdk8] 	at org.jenkinsci.plugins.workflow.cps.CpsThread.runNextChunk(CpsThread.java:174)
[windows-jdk8] 	at org.jenkinsci.plugins.workflow.cps.CpsThreadGroup.run(CpsThreadGroup.java:332)
[windows-jdk8] 	at org.jenkinsci.plugins.workflow.cps.CpsThreadGroup.access$200(CpsThreadGroup.java:83)
[windows-jdk8] 	at org.jenkinsci.plugins.workflow.cps.CpsThreadGroup$2.call(CpsThreadGroup.java:244)
[windows-jdk8] 	at org.jenkinsci.plugins.workflow.cps.CpsThreadGroup$2.call(CpsThreadGroup.java:232)
[windows-jdk8] 	at org.jenkinsci.plugins.workflow.cps.CpsVmExecutorService$2.call(CpsVmExecutorService.java:64)
[windows-jdk8] 	at java.util.concurrent.FutureTask.run(FutureTask.java:266)
[windows-jdk8] 	at hudson.remoting.SingleLaneExecutorService$1.run(SingleLaneExecutorService.java:131)
[windows-jdk8] 	at jenkins.util.ContextResettingExecutorService$1.run(ContextResettingExecutorService.java:28)
[windows-jdk8] 	at jenkins.security.ImpersonatingExecutorService$1.run(ImpersonatingExecutorService.java:59)
[windows-jdk8] 	at java.util.concurrent.Executors$RunnableAdapter.call(Executors.java:511)
[windows-jdk8] 	at java.util.concurrent.FutureTask.run(FutureTask.java:266)
[windows-jdk8] 	at java.util.concurrent.ThreadPoolExecutor.runWorker(ThreadPoolExecutor.java:1149)
[windows-jdk8] 	at java.util.concurrent.ThreadPoolExecutor$Worker.run(ThreadPoolExecutor.java:624)
[windows-jdk8] 	at java.lang.Thread.run(Thread.java:748)
[windows-jdk8] ERROR: [withMaven] WARNING Exception executing Maven reporter 'Open Task Scanner
Publisher' / org.jenkinsci.plugins.pipeline.maven.publishers.TasksScannerPublisher. Please
report a bug associated for the component 'pipeline-maven-plugin' at https://issues.jenkins-ci.org

[windows-jdk8] java.lang.IllegalArgumentException: Cannot relativize 'C:\mvn-it-0.tmp\src\main\java'
relatively to '/mvn-it-0.tmp'
[windows-jdk8] 	at org.jenkinsci.plugins.pipeline.maven.util.XmlUtils.getPathInWorkspace(XmlUtils.java:397)
[windows-jdk8] 	at org.jenkinsci.plugins.pipeline.maven.publishers.TasksScannerPublisher.process(TasksScannerPublisher.java:134)
[windows-jdk8] 	at org.jenkinsci.plugins.pipeline.maven.MavenSpyLogProcessor.processMavenSpyLogs(MavenSpyLogProcessor.java:118)
[windows-jdk8] 	at org.jenkinsci.plugins.pipeline.maven.WithMavenStepExecution$WithMavenStepExecutionCallBack.finished(WithMavenStepExecution.java:1050)
[windows-jdk8] 	at org.jenkinsci.plugins.workflow.steps.BodyExecutionCallback$TailCall.onSuccess(BodyExecutionCallback.java:114)
[windows-jdk8] 	at org.jenkinsci.plugins.workflow.cps.CpsBodyExecution$SuccessAdapter.receive(CpsBodyExecution.java:366)
[windows-jdk8] 	at com.cloudbees.groovy.cps.Outcome.resumeFrom(Outcome.java:73)
[windows-jdk8] 	at com.cloudbees.groovy.cps.Continuable$1.call(Continuable.java:166)
[windows-jdk8] 	at com.cloudbees.groovy.cps.Continuable$1.call(Continuable.java:163)
[windows-jdk8] 	at org.codehaus.groovy.runtime.GroovyCategorySupport$ThreadCategoryInfo.use(GroovyCategorySupport.java:122)
[windows-jdk8] 	at org.codehaus.groovy.runtime.GroovyCategorySupport.use(GroovyCategorySupport.java:261)
[windows-jdk8] 	at com.cloudbees.groovy.cps.Continuable.run0(Continuable.java:163)
[windows-jdk8] 	at org.jenkinsci.plugins.workflow.cps.SandboxContinuable.access$101(SandboxContinuable.java:34)
[windows-jdk8] 	at org.jenkinsci.plugins.workflow.cps.SandboxContinuable.lambda$run0$0(SandboxContinuable.java:59)
[windows-jdk8] 	at org.jenkinsci.plugins.scriptsecurity.sandbox.groovy.GroovySandbox.runInSandbox(GroovySandbox.java:108)
[windows-jdk8] 	at org.jenkinsci.plugins.workflow.cps.SandboxContinuable.run0(SandboxContinuable.java:58)
[windows-jdk8] 	at org.jenkinsci.plugins.workflow.cps.CpsThread.runNextChunk(CpsThread.java:174)
[windows-jdk8] 	at org.jenkinsci.plugins.workflow.cps.CpsThreadGroup.run(CpsThreadGroup.java:332)
[windows-jdk8] 	at org.jenkinsci.plugins.workflow.cps.CpsThreadGroup.access$200(CpsThreadGroup.java:83)
[windows-jdk8] 	at org.jenkinsci.plugins.workflow.cps.CpsThreadGroup$2.call(CpsThreadGroup.java:244)
[windows-jdk8] 	at org.jenkinsci.plugins.workflow.cps.CpsThreadGroup$2.call(CpsThreadGroup.java:232)
[windows-jdk8] 	at org.jenkinsci.plugins.workflow.cps.CpsVmExecutorService$2.call(CpsVmExecutorService.java:64)
[windows-jdk8] 	at java.util.concurrent.FutureTask.run(FutureTask.java:266)
[windows-jdk8] 	at hudson.remoting.SingleLaneExecutorService$1.run(SingleLaneExecutorService.java:131)
[windows-jdk8] 	at jenkins.util.ContextResettingExecutorService$1.run(ContextResettingExecutorService.java:28)
[windows-jdk8] 	at jenkins.security.ImpersonatingExecutorService$1.run(ImpersonatingExecutorService.java:59)
[windows-jdk8] 	at java.util.concurrent.Executors$RunnableAdapter.call(Executors.java:511)
[windows-jdk8] 	at java.util.concurrent.FutureTask.run(FutureTask.java:266)
[windows-jdk8] 	at java.util.concurrent.ThreadPoolExecutor.runWorker(ThreadPoolExecutor.java:1149)
[windows-jdk8] 	at java.util.concurrent.ThreadPoolExecutor$Worker.run(ThreadPoolExecutor.java:624)
[windows-jdk8] 	at java.lang.Thread.run(Thread.java:748)
[Pipeline] [linux-jdk7] // dir
[Pipeline] [windows-jdk7] // withMaven
[Pipeline] [windows-jdk8] // withMaven
[Pipeline] [linux-jdk7] }
[Pipeline] [linux-jdk8] }
[Pipeline] [linux-jdk9] }
[Pipeline] [windows-jdk7] deleteDir
[Pipeline] [windows-jdk8] deleteDir
[Pipeline] [linux-jdk7] // stage
[Pipeline] [linux-jdk8] // dir
[Pipeline] [linux-jdk9] // dir
[Pipeline] [linux-jdk7] }
[Pipeline] [linux-jdk8] }
[Pipeline] [linux-jdk9] }
[Pipeline] [linux-jdk7] // node
[Pipeline] [linux-jdk8] // stage
[Pipeline] [linux-jdk9] // stage
[Pipeline] [linux-jdk7] }
[Pipeline] [linux-jdk8] }
[Pipeline] [linux-jdk9] }
[Pipeline] [linux-jdk8] // node
[Pipeline] [linux-jdk9] // node
[Pipeline] [linux-jdk8] }
[Pipeline] [linux-jdk9] }
[Pipeline] [windows-jdk7] }
[Pipeline] [windows-jdk7] // dir
[Pipeline] [windows-jdk7] }
[Pipeline] [windows-jdk7] // stage
[Pipeline] [windows-jdk7] }
[Pipeline] [windows-jdk7] // node
[Pipeline] [windows-jdk7] }
[Pipeline] [windows-jdk9] }
[Pipeline] [windows-jdk9] // dir
[Pipeline] [windows-jdk9] }
[Pipeline] [windows-jdk9] // stage
[Pipeline] [windows-jdk9] }
[Pipeline] [windows-jdk9] // node
[Pipeline] [windows-jdk9] }
[Pipeline] [windows-jdk8] }
[Pipeline] [windows-jdk8] // dir
[Pipeline] [windows-jdk8] }
[Pipeline] [windows-jdk8] // stage
[Pipeline] [windows-jdk8] }
[Pipeline] [windows-jdk8] // node
[Pipeline] [windows-jdk8] }
[Pipeline] // parallel
[Pipeline] stage
[Pipeline] { (Notifications)
[Pipeline] echo
Build result: UNSTABLE
[Pipeline] jiraIssueSelector
[Pipeline] emailext
Mime
  • Unnamed multipart/mixed (inline, None, 0 bytes)
View raw message