maven-notifications mailing list archives

Site index · List index
Message view « Date » · « Thread »
Top « Date » · « Thread »
From Apache Jenkins Server <jenk...@builds.apache.org>
Subject Build unstable in Jenkins: Maven TLP » maven-plugin-testing » master #14
Date Fri, 14 Sep 2018 15:33:50 GMT
See https://builds.apache.org/job/maven-box/job/maven-plugin-testing/job/master/14/

No changes.

5 tests failed.
FAILED:  org.apache.maven.plugin.testing.PluginArtifactFileTest.testArtifact

Error Message:
null

Stack Trace:
junit.framework.AssertionFailedError: null
	at junit.framework.Assert.fail(Assert.java:55)
	at junit.framework.Assert.assertTrue(Assert.java:22)
	at junit.framework.Assert.assertTrue(Assert.java:31)
	at junit.framework.TestCase.assertTrue(TestCase.java:201)
	at org.apache.maven.plugin.testing.PluginArtifactFileTest.testArtifact(PluginArtifactFileTest.java:45)


FAILED:  org.apache.maven.shared.test.plugin.ProjectToolTest.testPackageProjectArtifact_ShouldPopulateWithCorrectArtifactAndMetadata

Error Message:
Missing target/unit/projects/basic/target/it-build-target/maven-it-plugin-test.jar

Stack Trace:
junit.framework.AssertionFailedError: Missing target/unit/projects/basic/target/it-build-target/maven-it-plugin-test.jar
	at junit.framework.Assert.fail(Assert.java:57)
	at junit.framework.Assert.assertTrue(Assert.java:22)
	at junit.framework.TestCase.assertTrue(TestCase.java:192)
	at org.apache.maven.shared.test.plugin.ProjectToolTest.testPackageProjectArtifact_ShouldPopulateWithCorrectArtifactAndMetadata(ProjectToolTest.java:99)


FAILED:  org.apache.maven.shared.test.plugin.ProjectToolTest.testPackageProjectArtifact_ShouldPopulateWithCorrectArtifactAndMetadata

Error Message:
Missing target/unit/projects/basic/target/it-build-target/maven-it-plugin-test.jar

Stack Trace:
junit.framework.AssertionFailedError: Missing target/unit/projects/basic/target/it-build-target/maven-it-plugin-test.jar
	at junit.framework.Assert.fail(Assert.java:57)
	at junit.framework.Assert.assertTrue(Assert.java:22)
	at junit.framework.TestCase.assertTrue(TestCase.java:192)
	at org.apache.maven.shared.test.plugin.ProjectToolTest.testPackageProjectArtifact_ShouldPopulateWithCorrectArtifactAndMetadata(ProjectToolTest.java:99)


FAILED:  org.apache.maven.shared.test.plugin.ProjectToolTest.testPackageProjectArtifact_ShouldPopulateWithCorrectArtifactAndMetadata

Error Message:
Missing target\unit\projects\basic\target\it-build-target\maven-it-plugin-test.jar

Stack Trace:
junit.framework.AssertionFailedError: Missing target\unit\projects\basic\target\it-build-target\maven-it-plugin-test.jar
	at junit.framework.Assert.fail(Assert.java:57)
	at junit.framework.Assert.assertTrue(Assert.java:22)
	at junit.framework.TestCase.assertTrue(TestCase.java:192)
	at org.apache.maven.shared.test.plugin.ProjectToolTest.testPackageProjectArtifact_ShouldPopulateWithCorrectArtifactAndMetadata(ProjectToolTest.java:99)


FAILED:  org.apache.maven.shared.test.plugin.ProjectToolTest.testPackageProjectArtifact_ShouldPopulateWithCorrectArtifactAndMetadata

Error Message:
Missing target\unit\projects\basic\target\it-build-target\maven-it-plugin-test.jar

Stack Trace:
junit.framework.AssertionFailedError: Missing target\unit\projects\basic\target\it-build-target\maven-it-plugin-test.jar
	at junit.framework.Assert.fail(Assert.java:57)
	at junit.framework.Assert.assertTrue(Assert.java:22)
	at junit.framework.TestCase.assertTrue(TestCase.java:192)
	at org.apache.maven.shared.test.plugin.ProjectToolTest.testPackageProjectArtifact_ShouldPopulateWithCorrectArtifactAndMetadata(ProjectToolTest.java:99)




Build log:
[...truncated 1.96 MB...]
[windows-jdk9] [WARNING] /F:/jenkins/jenkins-slave/workspace/maven-plugin-testing_master-DVW6YN5BVVM46OW7TA3KT7FW4MNQLXDPGDLTWG6QD4JLKCSIG7YQ/m/maven-test-tools/src/main/java/org/apache/maven/shared/tools/easymock/TestFileManager.java:
Some input files use or override a deprecated API.
[windows-jdk9] [WARNING] /F:/jenkins/jenkins-slave/workspace/maven-plugin-testing_master-DVW6YN5BVVM46OW7TA3KT7FW4MNQLXDPGDLTWG6QD4JLKCSIG7YQ/m/maven-test-tools/src/main/java/org/apache/maven/shared/tools/easymock/TestFileManager.java:
Recompile with -Xlint:deprecation for details.
[windows-jdk9] [INFO] 
[windows-jdk9] [INFO] --- maven-resources-plugin:2.6:testResources (default-testResources)
@ maven-test-tools ---
[windows-jdk9] [INFO] Using 'UTF-8' encoding to copy filtered resources.
[windows-jdk9] [INFO] skip non existing resourceDirectory F:\jenkins\jenkins-slave\workspace\maven-plugin-testing_master-DVW6YN5BVVM46OW7TA3KT7FW4MNQLXDPGDLTWG6QD4JLKCSIG7YQ\m\maven-test-tools\src\test\resources
[windows-jdk9] [INFO] Copying 3 resources
[windows-jdk9] [INFO] 
[windows-jdk9] [INFO] --- maven-compiler-plugin:3.1:testCompile (default-testCompile) @ maven-test-tools
---
[windows-jdk9] [INFO] No sources to compile
[windows-jdk9] [INFO] 
[windows-jdk9] [INFO] --- maven-surefire-plugin:2.16:test (default-test) @ maven-test-tools
---
[windows-jdk9] [INFO] 
[windows-jdk9] [INFO] --- maven-jar-plugin:2.4:jar (default-jar) @ maven-test-tools ---
[windows-jdk9] [INFO] Building jar: F:\jenkins\jenkins-slave\workspace\maven-plugin-testing_master-DVW6YN5BVVM46OW7TA3KT7FW4MNQLXDPGDLTWG6QD4JLKCSIG7YQ\m\maven-test-tools\target\maven-test-tools-3.3.1-SNAPSHOT.jar
[windows-jdk9] [INFO] 
[windows-jdk9] [INFO] ------------------------------------------------------------------------
[windows-jdk9] [INFO] Building Maven Plugin Testing Tools 3.3.1-SNAPSHOT
[windows-jdk9] [INFO] ------------------------------------------------------------------------
[windows-jdk9] [INFO] Downloading from central: https://repo.maven.apache.org/maven2/org/codehaus/plexus/plexus-component-metadata/1.5.5/plexus-component-metadata-1.5.5.pom
[windows-jdk9] [INFO] Downloaded from central: https://repo.maven.apache.org/maven2/org/codehaus/plexus/plexus-component-metadata/1.5.5/plexus-component-metadata-1.5.5.pom
(3.9 kB at 257 kB/s)
[windows-jdk9] [INFO] Downloading from central: https://repo.maven.apache.org/maven2/org/codehaus/plexus/plexus-component-metadata/1.5.5/plexus-component-metadata-1.5.5.jar
[windows-jdk9] [INFO] Downloaded from central: https://repo.maven.apache.org/maven2/org/codehaus/plexus/plexus-component-metadata/1.5.5/plexus-component-metadata-1.5.5.jar
(110 kB at 3.6 MB/s)
[windows-jdk9] [INFO] Downloading from central: https://repo.maven.apache.org/maven2/org/apache/maven/shared/maven-invoker/2.2/maven-invoker-2.2.pom
[windows-jdk9] [INFO] Downloaded from central: https://repo.maven.apache.org/maven2/org/apache/maven/shared/maven-invoker/2.2/maven-invoker-2.2.pom
(5.9 kB at 366 kB/s)
[windows-jdk9] [INFO] Downloading from central: https://repo.maven.apache.org/maven2/org/apache/maven/shared/maven-shared-components/21/maven-shared-components-21.pom
[windows-jdk9] [INFO] Downloaded from central: https://repo.maven.apache.org/maven2/org/apache/maven/shared/maven-shared-components/21/maven-shared-components-21.pom
(5.1 kB at 319 kB/s)
[windows-jdk9] [INFO] Downloading from central: https://repo.maven.apache.org/maven2/org/apache/maven/wagon/wagon-file/2.1/wagon-file-2.1.pom
[windows-jdk9] [INFO] Downloaded from central: https://repo.maven.apache.org/maven2/org/apache/maven/wagon/wagon-file/2.1/wagon-file-2.1.pom
(1.4 kB at 90 kB/s)
[windows-jdk9] [INFO] Downloading from central: https://repo.maven.apache.org/maven2/org/apache/maven/wagon/wagon-providers/2.1/wagon-providers-2.1.pom
[windows-jdk9] [INFO] Downloaded from central: https://repo.maven.apache.org/maven2/org/apache/maven/wagon/wagon-providers/2.1/wagon-providers-2.1.pom
(2.8 kB at 89 kB/s)
[windows-jdk9] [INFO] Downloading from central: https://repo.maven.apache.org/maven2/org/apache/maven/wagon/wagon/2.1/wagon-2.1.pom
[windows-jdk9] [INFO] Downloaded from central: https://repo.maven.apache.org/maven2/org/apache/maven/wagon/wagon/2.1/wagon-2.1.pom
(16 kB at 509 kB/s)
[windows-jdk9] [INFO] Downloading from central: https://repo.maven.apache.org/maven2/org/apache/maven/wagon/wagon-provider-api/2.1/wagon-provider-api-2.1.pom
[windows-jdk9] [INFO] Downloaded from central: https://repo.maven.apache.org/maven2/org/apache/maven/wagon/wagon-provider-api/2.1/wagon-provider-api-2.1.pom
(1.7 kB at 56 kB/s)
[windows-jdk9] [INFO] Downloading from central: https://repo.maven.apache.org/maven2/org/apache/maven/shared/maven-invoker/2.2/maven-invoker-2.2.jar
[windows-jdk9] [INFO] Downloading from central: https://repo.maven.apache.org/maven2/org/apache/maven/wagon/wagon-file/2.1/wagon-file-2.1.jar
[windows-jdk9] [INFO] Downloaded from central: https://repo.maven.apache.org/maven2/org/apache/maven/wagon/wagon-file/2.1/wagon-file-2.1.jar
(11 kB at 192 kB/s)
[windows-jdk9] [INFO] Downloaded from central: https://repo.maven.apache.org/maven2/org/apache/maven/shared/maven-invoker/2.2/maven-invoker-2.2.jar
(30 kB at 181 kB/s)
[windows-jdk9] [INFO] 
[windows-jdk9] [INFO] --- maven-clean-plugin:2.5:clean (default-clean) @ maven-plugin-testing-tools
---
[windows-jdk9] [INFO] 
[windows-jdk9] [INFO] --- maven-enforcer-plugin:1.3.1:enforce (enforce-bytecode-version) @
maven-plugin-testing-tools ---
[windows-jdk9] [INFO] Downloading from central: https://repo.maven.apache.org/maven2/org/apache/maven/wagon/wagon-provider-api/2.1/wagon-provider-api-2.1.jar
[windows-jdk9] [INFO] Downloaded from central: https://repo.maven.apache.org/maven2/org/apache/maven/wagon/wagon-provider-api/2.1/wagon-provider-api-2.1.jar
(52 kB at 668 kB/s)
[windows-jdk9] [INFO] 
[windows-jdk9] [INFO] --- maven-enforcer-plugin:1.3.1:enforce (ban-known-bad-maven-versions)
@ maven-plugin-testing-tools ---
[windows-jdk9] [INFO] 
[windows-jdk9] [INFO] --- maven-remote-resources-plugin:1.5:process (default) @ maven-plugin-testing-tools
---
[windows-jdk9] [INFO] 
[windows-jdk9] [INFO] --- maven-resources-plugin:2.6:resources (default-resources) @ maven-plugin-testing-tools
---
[windows-jdk9] [INFO] Using 'UTF-8' encoding to copy filtered resources.
[windows-jdk9] [INFO] skip non existing resourceDirectory F:\jenkins\jenkins-slave\workspace\maven-plugin-testing_master-DVW6YN5BVVM46OW7TA3KT7FW4MNQLXDPGDLTWG6QD4JLKCSIG7YQ\m\maven-plugin-testing-tools\src\main\resources
[windows-jdk9] [INFO] Copying 3 resources
[windows-jdk9] [INFO] 
[windows-jdk9] [INFO] --- maven-compiler-plugin:3.1:compile (default-compile) @ maven-plugin-testing-tools
---
[windows-jdk9] [INFO] Changes detected - recompiling the module!
[windows-jdk9] [INFO] Compiling 6 source files to F:\jenkins\jenkins-slave\workspace\maven-plugin-testing_master-DVW6YN5BVVM46OW7TA3KT7FW4MNQLXDPGDLTWG6QD4JLKCSIG7YQ\m\maven-plugin-testing-tools\target\classes
[windows-jdk9] [WARNING] /F:/jenkins/jenkins-slave/workspace/maven-plugin-testing_master-DVW6YN5BVVM46OW7TA3KT7FW4MNQLXDPGDLTWG6QD4JLKCSIG7YQ/m/maven-plugin-testing-tools/src/main/java/org/apache/maven/shared/test/plugin/ProjectTool.java:
Some input files use or override a deprecated API.
[windows-jdk9] [WARNING] /F:/jenkins/jenkins-slave/workspace/maven-plugin-testing_master-DVW6YN5BVVM46OW7TA3KT7FW4MNQLXDPGDLTWG6QD4JLKCSIG7YQ/m/maven-plugin-testing-tools/src/main/java/org/apache/maven/shared/test/plugin/ProjectTool.java:
Recompile with -Xlint:deprecation for details.
[windows-jdk9] [INFO] 
[windows-jdk9] [INFO] --- plexus-component-metadata:1.5.5:generate-metadata (default) @ maven-plugin-testing-tools
---
[windows-jdk9] [INFO] Downloading from central: https://repo.maven.apache.org/maven2/com/thoughtworks/qdox/qdox/1.9.2/qdox-1.9.2.pom
[windows-jdk9] [INFO] Downloaded from central: https://repo.maven.apache.org/maven2/com/thoughtworks/qdox/qdox/1.9.2/qdox-1.9.2.pom
(17 kB at 1.1 MB/s)
[windows-jdk9] [INFO] Downloading from central: https://repo.maven.apache.org/maven2/jdom/jdom/1.0/jdom-1.0.pom
[windows-jdk9] [INFO] Downloaded from central: https://repo.maven.apache.org/maven2/jdom/jdom/1.0/jdom-1.0.pom
(1.2 kB at 73 kB/s)
[windows-jdk9] [INFO] Downloading from central: https://repo.maven.apache.org/maven2/org/codehaus/plexus/plexus-cli/1.2/plexus-cli-1.2.pom
[windows-jdk9] [INFO] Downloaded from central: https://repo.maven.apache.org/maven2/org/codehaus/plexus/plexus-cli/1.2/plexus-cli-1.2.pom
(1.8 kB at 58 kB/s)
[windows-jdk9] [INFO] Downloading from central: https://repo.maven.apache.org/maven2/org/codehaus/plexus/plexus-tools/1.0.8/plexus-tools-1.0.8.pom
[windows-jdk9] [INFO] Downloaded from central: https://repo.maven.apache.org/maven2/org/codehaus/plexus/plexus-tools/1.0.8/plexus-tools-1.0.8.pom
(953 B at 60 kB/s)
[windows-jdk9] [INFO] Downloading from central: https://repo.maven.apache.org/maven2/commons-lang/commons-lang/1.0/commons-lang-1.0.pom
[windows-jdk9] [INFO] Downloaded from central: https://repo.maven.apache.org/maven2/commons-lang/commons-lang/1.0/commons-lang-1.0.pom
(2.5 kB at 77 kB/s)
[windows-jdk9] [INFO] Downloading from central: https://repo.maven.apache.org/maven2/asm/asm/3.1/asm-3.1.pom
[windows-jdk9] [INFO] Downloaded from central: https://repo.maven.apache.org/maven2/asm/asm/3.1/asm-3.1.pom
(278 B at 17 kB/s)
[windows-jdk9] [INFO] Downloading from central: https://repo.maven.apache.org/maven2/asm/asm-parent/3.1/asm-parent-3.1.pom
[windows-jdk9] [INFO] Downloaded from central: https://repo.maven.apache.org/maven2/asm/asm-parent/3.1/asm-parent-3.1.pom
(4.2 kB at 277 kB/s)
[windows-jdk9] [INFO] Downloading from central: https://repo.maven.apache.org/maven2/jdom/jdom/1.0/jdom-1.0.jar
[windows-jdk9] [INFO] Downloading from central: https://repo.maven.apache.org/maven2/org/codehaus/plexus/plexus-cli/1.2/plexus-cli-1.2.jar
[windows-jdk9] [INFO] Downloading from central: https://repo.maven.apache.org/maven2/org/codehaus/plexus/plexus-utils/1.4.5/plexus-utils-1.4.5.jar
[windows-jdk9] [INFO] Downloading from central: https://repo.maven.apache.org/maven2/com/thoughtworks/qdox/qdox/1.9.2/qdox-1.9.2.jar
[windows-jdk9] [INFO] Downloading from central: https://repo.maven.apache.org/maven2/commons-logging/commons-logging/1.0/commons-logging-1.0.jar
[windows-jdk9] [INFO] Downloaded from central: https://repo.maven.apache.org/maven2/org/codehaus/plexus/plexus-cli/1.2/plexus-cli-1.2.jar
(7.7 kB at 124 kB/s)
[windows-jdk9] [INFO] Downloading from central: https://repo.maven.apache.org/maven2/commons-lang/commons-lang/1.0/commons-lang-1.0.jar
[windows-jdk9] [INFO] Downloaded from central: https://repo.maven.apache.org/maven2/org/codehaus/plexus/plexus-utils/1.4.5/plexus-utils-1.4.5.jar
(205 kB at 3.3 MB/s)
[windows-jdk9] [INFO] Downloading from central: https://repo.maven.apache.org/maven2/asm/asm/3.1/asm-3.1.jar
[windows-jdk9] [INFO] Downloaded from central: https://repo.maven.apache.org/maven2/jdom/jdom/1.0/jdom-1.0.jar
(153 kB at 2.0 MB/s)
[windows-jdk9] [INFO] Downloaded from central: https://repo.maven.apache.org/maven2/commons-lang/commons-lang/1.0/commons-lang-1.0.jar
(64 kB at 819 kB/s)
[windows-jdk9] [INFO] Downloaded from central: https://repo.maven.apache.org/maven2/com/thoughtworks/qdox/qdox/1.9.2/qdox-1.9.2.jar
(170 kB at 1.8 MB/s)
[windows-jdk9] [INFO] Downloaded from central: https://repo.maven.apache.org/maven2/asm/asm/3.1/asm-3.1.jar
(43 kB at 395 kB/s)
[windows-jdk9] [INFO] Downloaded from central: https://repo.maven.apache.org/maven2/commons-logging/commons-logging/1.0/commons-logging-1.0.jar
(22 kB at 141 kB/s)
[windows-jdk10] Using IT Plugin Jar: F:\jenkins\jenkins-slave\workspace\maven-plugin-testing_master-DVW6YN5BVVM46OW7TA3KT7FW4MNQLXDPGDLTWG6QD4JLKCSIG7YQ@2\m\maven-plugin-testing-tools\target\unit\projects\basic\target\it-build-target\maven-it-plugin-test.jar
[windows-jdk10] Using target\it-build-target and target\it-build-target\classes to build IT
version of plugin
[windows-jdk10] Now Building test version of the plugin...
[windows-jdk10] Using staged plugin-pom: F:\jenkins\jenkins-slave\workspace\maven-plugin-testing_master-DVW6YN5BVVM46OW7TA3KT7FW4MNQLXDPGDLTWG6QD4JLKCSIG7YQ@2\m\maven-plugin-testing-tools\target\unit\projects\basic\pom-test.xml
[windows-jdk9] [INFO] Discovered 5 component descriptors(s)
[windows-jdk9] [INFO] 
[windows-jdk9] [INFO] --- maven-resources-plugin:2.6:testResources (default-testResources)
@ maven-plugin-testing-tools ---
[windows-jdk9] [INFO] Using 'UTF-8' encoding to copy filtered resources.
[windows-jdk9] [INFO] Copying 2 resources
[windows-jdk9] [INFO] Copying 3 resources
[windows-jdk9] [INFO] 
[windows-jdk9] [INFO] --- maven-compiler-plugin:3.1:testCompile (default-testCompile) @ maven-plugin-testing-tools
---
[windows-jdk9] [INFO] Changes detected - recompiling the module!
[windows-jdk9] [INFO] Compiling 2 source files to F:\jenkins\jenkins-slave\workspace\maven-plugin-testing_master-DVW6YN5BVVM46OW7TA3KT7FW4MNQLXDPGDLTWG6QD4JLKCSIG7YQ\m\maven-plugin-testing-tools\target\test-classes
[windows-jdk9] [WARNING] /F:/jenkins/jenkins-slave/workspace/maven-plugin-testing_master-DVW6YN5BVVM46OW7TA3KT7FW4MNQLXDPGDLTWG6QD4JLKCSIG7YQ/m/maven-plugin-testing-tools/src/test/java/org/apache/maven/shared/test/plugin/RepositoryToolTest.java:
Some input files use or override a deprecated API.
[windows-jdk9] [WARNING] /F:/jenkins/jenkins-slave/workspace/maven-plugin-testing_master-DVW6YN5BVVM46OW7TA3KT7FW4MNQLXDPGDLTWG6QD4JLKCSIG7YQ/m/maven-plugin-testing-tools/src/test/java/org/apache/maven/shared/test/plugin/RepositoryToolTest.java:
Recompile with -Xlint:deprecation for details.
[windows-jdk9] [INFO] 
[windows-jdk9] [INFO] --- maven-surefire-plugin:2.16:test (default-test) @ maven-plugin-testing-tools
---
[windows-jdk9] [INFO] Surefire report directory: F:\jenkins\jenkins-slave\workspace\maven-plugin-testing_master-DVW6YN5BVVM46OW7TA3KT7FW4MNQLXDPGDLTWG6QD4JLKCSIG7YQ\m\maven-plugin-testing-tools\target\surefire-reports
[windows-jdk9] 
[windows-jdk9] -------------------------------------------------------
[windows-jdk9]  T E S T S
[windows-jdk9] -------------------------------------------------------
[windows-jdk9] Picked up JAVA_TOOL_OPTIONS: -Dmaven.ext.class.path="f:\jenkins\jenkins-slave\workspace\maven-plugin-testing_master-DVW6YN5BVVM46OW7TA3KT7FW4MNQLXDPGDLTWG6QD4JLKCSIG7YQ@tmp\withMaven784969af\pipeline-maven-spy.jar"
-Dorg.jenkinsci.plugins.pipeline.maven.reportsFolder="f:\jenkins\jenkins-slave\workspace\maven-plugin-testing_master-DVW6YN5BVVM46OW7TA3KT7FW4MNQLXDPGDLTWG6QD4JLKCSIG7YQ@tmp\withMaven784969af"

[windows-jdk9] Running org.apache.maven.shared.test.plugin.ProjectToolTest
[windows-jdk9] Using target\it-build-target and target\it-build-target\classes to build IT
version of plugin
[windows-jdk9] Now Building test version of the plugin...
[windows-jdk9] Using staged plugin-pom: F:\jenkins\jenkins-slave\workspace\maven-plugin-testing_master-DVW6YN5BVVM46OW7TA3KT7FW4MNQLXDPGDLTWG6QD4JLKCSIG7YQ\m\maven-plugin-testing-tools\target\unit\projects\basic\pom-test.xml
[windows-jdk10] Using IT Plugin Jar: F:\jenkins\jenkins-slave\workspace\maven-plugin-testing_master-DVW6YN5BVVM46OW7TA3KT7FW4MNQLXDPGDLTWG6QD4JLKCSIG7YQ@2\m\maven-plugin-testing-tools\target\unit\projects\basic\target\it-build-target\maven-it-plugin-test.jar
[windows-jdk10] Using target\it-build-target and target\it-build-target\classes to build IT
version of plugin
[windows-jdk10] Tests run: 3, Failures: 1, Errors: 0, Skipped: 0, Time elapsed: 12.646 sec
<<< FAILURE! - in org.apache.maven.shared.test.plugin.ProjectToolTest
[windows-jdk10] testPackageProjectArtifact_ShouldPopulateWithCorrectArtifactAndMetadata(org.apache.maven.shared.test.plugin.ProjectToolTest)
 Time elapsed: 5.182 sec  <<< FAILURE!
[windows-jdk10] junit.framework.AssertionFailedError: Missing target\unit\projects\basic\target\it-build-target\maven-it-plugin-test.jar
[windows-jdk10] 	at junit.framework.Assert.fail(Assert.java:57)
[windows-jdk10] 	at junit.framework.Assert.assertTrue(Assert.java:22)
[windows-jdk10] 	at junit.framework.TestCase.assertTrue(TestCase.java:192)
[windows-jdk10] 	at org.apache.maven.shared.test.plugin.ProjectToolTest.testPackageProjectArtifact_ShouldPopulateWithCorrectArtifactAndMetadata(ProjectToolTest.java:99)
[windows-jdk10] 
[windows-jdk10] Running org.apache.maven.shared.test.plugin.RepositoryToolTest
[windows-jdk10] Tests run: 1, Failures: 0, Errors: 0, Skipped: 0, Time elapsed: 0.571 sec
- in org.apache.maven.shared.test.plugin.RepositoryToolTest
[windows-jdk10] 
[windows-jdk10] Results :
[windows-jdk10] 
[windows-jdk10] Failed tests: 
[windows-jdk10]   ProjectToolTest.testPackageProjectArtifact_ShouldPopulateWithCorrectArtifactAndMetadata:99
Missing target\unit\projects\basic\target\it-build-target\maven-it-plugin-test.jar
[windows-jdk10] 
[windows-jdk10] Tests run: 4, Failures: 1, Errors: 0, Skipped: 0
[windows-jdk10] 
[windows-jdk10] [ERROR] There are test failures.
[windows-jdk10] 
[windows-jdk10] Please refer to F:\jenkins\jenkins-slave\workspace\maven-plugin-testing_master-DVW6YN5BVVM46OW7TA3KT7FW4MNQLXDPGDLTWG6QD4JLKCSIG7YQ@2\m\maven-plugin-testing-tools\target\surefire-reports
for the individual test results.
[windows-jdk10] [INFO] 
[windows-jdk10] [INFO] --- maven-jar-plugin:2.4:jar (default-jar) @ maven-plugin-testing-tools
---
[windows-jdk10] [INFO] Building jar: F:\jenkins\jenkins-slave\workspace\maven-plugin-testing_master-DVW6YN5BVVM46OW7TA3KT7FW4MNQLXDPGDLTWG6QD4JLKCSIG7YQ@2\m\maven-plugin-testing-tools\target\maven-plugin-testing-tools-3.3.1-SNAPSHOT.jar
[windows-jdk10] [INFO] ------------------------------------------------------------------------
[windows-jdk10] [INFO] Reactor Summary:
[windows-jdk10] [INFO] 
[windows-jdk10] [INFO] Maven Plugin Testing ............................... SUCCESS [  9.626
s]
[windows-jdk10] [INFO] Maven Plugin Testing Mechanism ..................... SUCCESS [ 14.589
s]
[windows-jdk10] [INFO] Maven Testing Tools ................................ SUCCESS [  0.336
s]
[windows-jdk10] [INFO] Maven Plugin Testing Tools ......................... SUCCESS [ 16.139
s]
[windows-jdk10] [INFO] ------------------------------------------------------------------------
[windows-jdk10] [INFO] BUILD SUCCESS
[windows-jdk10] [INFO] ------------------------------------------------------------------------
[windows-jdk10] [INFO] Total time: 41.850 s
[windows-jdk10] [INFO] Finished at: 2018-09-14T15:33:38Z
[windows-jdk10] [INFO] Final Memory: 30M/104M
[windows-jdk10] [INFO] ------------------------------------------------------------------------
[windows-jdk10] [WARNING] The requested profile "run-its" could not be activated because it
does not exist.
[windows-jdk10] [INFO] [jenkins-event-spy] Generated F:\jenkins\jenkins-slave\workspace\maven-plugin-testing_master-DVW6YN5BVVM46OW7TA3KT7FW4MNQLXDPGDLTWG6QD4JLKCSIG7YQ@2@tmp\withMaven946c4f2a\maven-spy-20180914-153255-90813380078345672507993.log
[Pipeline] [windows-jdk10] }
[Pipeline] [windows-jdk10] // dir
[Pipeline] [windows-jdk10] }
[windows-jdk10] [withMaven] junitPublisher - Archive test results for Maven artifact org.apache.maven.plugin-testing:maven-plugin-testing-harness:3.3.1-SNAPSHOT
generated by maven-surefire-plugin:test (default-test): m\maven-plugin-testing-harness\target\surefire-reports\*.xml
[windows-jdk10] Recording test results
[windows-jdk10] [withMaven] junitPublisher - Archive test results for Maven artifact org.apache.maven.plugin-testing:maven-test-tools:3.3.1-SNAPSHOT
generated by maven-surefire-plugin:test (default-test): m\maven-test-tools\target\surefire-reports\*.xml
[windows-jdk10] Recording test results
[windows-jdk10] None of the test reports contained any result
[windows-jdk10] [withMaven] junitPublisher - Archive test results for Maven artifact org.apache.maven.plugin-testing:maven-plugin-testing-tools:3.3.1-SNAPSHOT
generated by maven-surefire-plugin:test (default-test): m\maven-plugin-testing-tools\target\surefire-reports\*.xml
[windows-jdk10] Recording test results
[Pipeline] [windows-jdk10] // withMaven
[Pipeline] [windows-jdk10] cleanWs
[windows-jdk10] [WS-CLEANUP] Deleting project workspace...[WS-CLEANUP] done
[Pipeline] [windows-jdk10] }
[Pipeline] [windows-jdk10] // stage
[Pipeline] [windows-jdk10] }
[Pipeline] [windows-jdk10] // node
[Pipeline] [windows-jdk10] }
[windows-jdk9] Using IT Plugin Jar: F:\jenkins\jenkins-slave\workspace\maven-plugin-testing_master-DVW6YN5BVVM46OW7TA3KT7FW4MNQLXDPGDLTWG6QD4JLKCSIG7YQ\m\maven-plugin-testing-tools\target\unit\projects\basic\target\it-build-target\maven-it-plugin-test.jar
[windows-jdk9] Using target\it-build-target and target\it-build-target\classes to build IT
version of plugin
[windows-jdk9] Now Building test version of the plugin...
[windows-jdk9] Using staged plugin-pom: F:\jenkins\jenkins-slave\workspace\maven-plugin-testing_master-DVW6YN5BVVM46OW7TA3KT7FW4MNQLXDPGDLTWG6QD4JLKCSIG7YQ\m\maven-plugin-testing-tools\target\unit\projects\basic\pom-test.xml
[windows-jdk9] Using IT Plugin Jar: F:\jenkins\jenkins-slave\workspace\maven-plugin-testing_master-DVW6YN5BVVM46OW7TA3KT7FW4MNQLXDPGDLTWG6QD4JLKCSIG7YQ\m\maven-plugin-testing-tools\target\unit\projects\basic\target\it-build-target\maven-it-plugin-test.jar
[windows-jdk9] Using target\it-build-target and target\it-build-target\classes to build IT
version of plugin
[windows-jdk9] Tests run: 3, Failures: 1, Errors: 0, Skipped: 0, Time elapsed: 13.1 sec <<<
FAILURE! - in org.apache.maven.shared.test.plugin.ProjectToolTest
[windows-jdk9] testPackageProjectArtifact_ShouldPopulateWithCorrectArtifactAndMetadata(org.apache.maven.shared.test.plugin.ProjectToolTest)
 Time elapsed: 5.182 sec  <<< FAILURE!
[windows-jdk9] junit.framework.AssertionFailedError: Missing target\unit\projects\basic\target\it-build-target\maven-it-plugin-test.jar
[windows-jdk9] 	at junit.framework.Assert.fail(Assert.java:57)
[windows-jdk9] 	at junit.framework.Assert.assertTrue(Assert.java:22)
[windows-jdk9] 	at junit.framework.TestCase.assertTrue(TestCase.java:192)
[windows-jdk9] 	at org.apache.maven.shared.test.plugin.ProjectToolTest.testPackageProjectArtifact_ShouldPopulateWithCorrectArtifactAndMetadata(ProjectToolTest.java:99)
[windows-jdk9] 
[windows-jdk9] Running org.apache.maven.shared.test.plugin.RepositoryToolTest
[windows-jdk9] Tests run: 1, Failures: 0, Errors: 0, Skipped: 0, Time elapsed: 0.11 sec -
in org.apache.maven.shared.test.plugin.RepositoryToolTest
[windows-jdk9] 
[windows-jdk9] Results :
[windows-jdk9] 
[windows-jdk9] Failed tests: 
[windows-jdk9]   ProjectToolTest.testPackageProjectArtifact_ShouldPopulateWithCorrectArtifactAndMetadata:99
Missing target\unit\projects\basic\target\it-build-target\maven-it-plugin-test.jar
[windows-jdk9] 
[windows-jdk9] Tests run: 4, Failures: 1, Errors: 0, Skipped: 0
[windows-jdk9] 
[windows-jdk9] [ERROR] There are test failures.
[windows-jdk9] 
[windows-jdk9] Please refer to F:\jenkins\jenkins-slave\workspace\maven-plugin-testing_master-DVW6YN5BVVM46OW7TA3KT7FW4MNQLXDPGDLTWG6QD4JLKCSIG7YQ\m\maven-plugin-testing-tools\target\surefire-reports
for the individual test results.
[windows-jdk9] [INFO] 
[windows-jdk9] [INFO] --- maven-jar-plugin:2.4:jar (default-jar) @ maven-plugin-testing-tools
---
[windows-jdk9] [INFO] Building jar: F:\jenkins\jenkins-slave\workspace\maven-plugin-testing_master-DVW6YN5BVVM46OW7TA3KT7FW4MNQLXDPGDLTWG6QD4JLKCSIG7YQ\m\maven-plugin-testing-tools\target\maven-plugin-testing-tools-3.3.1-SNAPSHOT.jar
[windows-jdk9] [INFO] ------------------------------------------------------------------------
[windows-jdk9] [INFO] Reactor Summary:
[windows-jdk9] [INFO] 
[windows-jdk9] [INFO] Maven Plugin Testing ............................... SUCCESS [ 20.304
s]
[windows-jdk9] [INFO] Maven Plugin Testing Mechanism ..................... SUCCESS [ 18.495
s]
[windows-jdk9] [INFO] Maven Testing Tools ................................ SUCCESS [  0.930
s]
[windows-jdk9] [INFO] Maven Plugin Testing Tools ......................... SUCCESS [ 17.288
s]
[windows-jdk9] [INFO] ------------------------------------------------------------------------
[windows-jdk9] [INFO] BUILD SUCCESS
[windows-jdk9] [INFO] ------------------------------------------------------------------------
[windows-jdk9] [INFO] Total time: 58.215 s
[windows-jdk9] [INFO] Finished at: 2018-09-14T08:33:48-07:00
[windows-jdk9] [INFO] Final Memory: 48M/161M
[windows-jdk9] [INFO] ------------------------------------------------------------------------
[windows-jdk9] [WARNING] The requested profile "run-its" could not be activated because it
does not exist.
[windows-jdk9] [INFO] [jenkins-event-spy] Generated F:\jenkins\jenkins-slave\workspace\maven-plugin-testing_master-DVW6YN5BVVM46OW7TA3KT7FW4MNQLXDPGDLTWG6QD4JLKCSIG7YQ@tmp\withMaven784969af\maven-spy-20180914-083249-82017749998563360878808.log
[Pipeline] [windows-jdk9] }
[Pipeline] [windows-jdk9] // dir
[Pipeline] [windows-jdk9] }
[windows-jdk9] [withMaven] junitPublisher - Archive test results for Maven artifact org.apache.maven.plugin-testing:maven-plugin-testing-harness:3.3.1-SNAPSHOT
generated by maven-surefire-plugin:test (default-test): m\maven-plugin-testing-harness\target\surefire-reports\*.xml
[windows-jdk9] Recording test results
[windows-jdk9] [withMaven] junitPublisher - Archive test results for Maven artifact org.apache.maven.plugin-testing:maven-test-tools:3.3.1-SNAPSHOT
generated by maven-surefire-plugin:test (default-test): m\maven-test-tools\target\surefire-reports\*.xml
[windows-jdk9] Recording test results
[windows-jdk9] None of the test reports contained any result
[windows-jdk9] [withMaven] junitPublisher - Archive test results for Maven artifact org.apache.maven.plugin-testing:maven-plugin-testing-tools:3.3.1-SNAPSHOT
generated by maven-surefire-plugin:test (default-test): m\maven-plugin-testing-tools\target\surefire-reports\*.xml
[windows-jdk9] Recording test results
[Pipeline] [windows-jdk9] // withMaven
[Pipeline] [windows-jdk9] cleanWs
[windows-jdk9] [WS-CLEANUP] Deleting project workspace...[WS-CLEANUP] done
[Pipeline] [windows-jdk9] }
[Pipeline] [windows-jdk9] // stage
[Pipeline] [windows-jdk9] }
[Pipeline] [windows-jdk9] // node
[Pipeline] [windows-jdk9] }
[Pipeline] // parallel
[Pipeline] stage
[Pipeline] { (Notifications)
[Pipeline] echo
Build result: UNSTABLE
[Pipeline] jiraIssueSelector
[Pipeline] emailext
Mime
  • Unnamed multipart/mixed (inline, None, 0 bytes)
View raw message