maven-notifications mailing list archives

Site index · List index
Message view « Date » · « Thread »
Top « Date » · « Thread »
From Apache Jenkins Server <jenk...@builds.apache.org>
Subject Build unstable in Jenkins: Maven TLP » maven-jxr » JXR-100 #11
Date Mon, 10 Sep 2018 05:46:36 GMT
See https://builds.apache.org/job/maven-box/job/maven-jxr/job/JXR-100/11/

No changes.

All tests passed

Build log:
[...truncated 4.79 MB...]
[windows-jdk10-m3.5.x_build] [INFO] java-annotations mojo extractor found 5 mojo descriptors.
[windows-jdk10-m3.5.x_build] [INFO] 
[windows-jdk10-m3.5.x_build] [INFO] --- maven-plugin-plugin:3.5.1:descriptor (mojo-descriptor)
@ maven-jxr-plugin ---
[windows-jdk10-m3.5.x_build] [INFO] Using 'UTF-8' encoding to read mojo source files.
[windows-jdk10-m3.5.x_build] [INFO] java-javadoc mojo extractor found 0 mojo descriptor.
[windows-jdk10-m3.5.x_build] [INFO] java-annotations mojo extractor found 5 mojo descriptors.
[windows-jdk10-m3.5.x_build] [INFO] 
[windows-jdk10-m3.5.x_build] [INFO] --- maven-resources-plugin:3.0.2:testResources (default-testResources)
@ maven-jxr-plugin ---
[windows-jdk10-m3.5.x_build] [INFO] Using 'UTF-8' encoding to copy filtered resources.
[windows-jdk10-m3.5.x_build] [INFO] Copying 52 resources
[windows-jdk10-m3.5.x_build] [INFO] Copying 3 resources
[windows-jdk10-m3.5.x_build] [INFO] 
[windows-jdk10-m3.5.x_build] [INFO] --- maven-compiler-plugin:3.7.0:testCompile (default-testCompile)
@ maven-jxr-plugin ---
[windows-jdk10-m3.5.x_build] [INFO] Changes detected - recompiling the module!
[windows-jdk10-m3.5.x_build] [INFO] Compiling 14 source files to F:\jenkins\jenkins-slave\workspace\maven-box_maven-jxr_JXR-100-GW63T7YI5V3MNKGKIDDNOVVEH3WQEZVGTRUH5JFV4NSQM2R36VXQ\windows-jdk10-m3.5.x_build\maven-jxr-plugin\target\test-classes
[windows-jdk10-m3.5.x_build] [INFO] /F:/jenkins/jenkins-slave/workspace/maven-box_maven-jxr_JXR-100-GW63T7YI5V3MNKGKIDDNOVVEH3WQEZVGTRUH5JFV4NSQM2R36VXQ/windows-jdk10-m3.5.x_build/maven-jxr-plugin/src/test/java/org/apache/maven/plugin/jxr/stubs/JxrPluginArtifactStub.java:
Some input files use unchecked or unsafe operations.
[windows-jdk10-m3.5.x_build] [INFO] /F:/jenkins/jenkins-slave/workspace/maven-box_maven-jxr_JXR-100-GW63T7YI5V3MNKGKIDDNOVVEH3WQEZVGTRUH5JFV4NSQM2R36VXQ/windows-jdk10-m3.5.x_build/maven-jxr-plugin/src/test/java/org/apache/maven/plugin/jxr/stubs/JxrPluginArtifactStub.java:
Recompile with -Xlint:unchecked for details.
[windows-jdk10-m3.5.x_build] [INFO] 
[windows-jdk10-m3.5.x_build] [INFO] --- maven-surefire-plugin:2.21.0:test (default-test) @
maven-jxr-plugin ---
[windows-jdk10-m3.5.x_build] [INFO] 
[windows-jdk10-m3.5.x_build] [INFO] -------------------------------------------------------
[windows-jdk10-m3.5.x_build] [INFO]  T E S T S
[windows-jdk10-m3.5.x_build] [INFO] -------------------------------------------------------
[windows-jdk10-m3.5.x_build] [INFO] Running org.apache.maven.plugin.jxr.JxrReportTest
[windows-jdk10-m3.5.x_build] [ERROR] ResourceManager : unable to find resource 'temp/index.vm'
in any resource loader.
[windows-jdk10-m3.5.x_build] [INFO] Tests run: 8, Failures: 0, Errors: 0, Skipped: 0, Time
elapsed: 2.612 s - in org.apache.maven.plugin.jxr.JxrReportTest
[windows-jdk10-m3.5.x_build] [INFO] Running org.apache.maven.plugin.jxr.JxrTestReportTest
[windows-jdk10-m3.5.x_build] [INFO] Tests run: 1, Failures: 0, Errors: 0, Skipped: 0, Time
elapsed: 0.224 s - in org.apache.maven.plugin.jxr.JxrTestReportTest
[windows-jdk10-m3.5.x_build] [INFO] 
[windows-jdk10-m3.5.x_build] [INFO] Results:
[windows-jdk10-m3.5.x_build] [INFO] 
[windows-jdk10-m3.5.x_build] [INFO] Tests run: 9, Failures: 0, Errors: 0, Skipped: 0
[windows-jdk10-m3.5.x_build] [INFO] 
[windows-jdk10-m3.5.x_build] [INFO] 
[windows-jdk10-m3.5.x_build] [INFO] --- maven-jar-plugin:3.0.2:jar (default-jar) @ maven-jxr-plugin
---
[windows-jdk10-m3.5.x_build] [INFO] Building jar: F:\jenkins\jenkins-slave\workspace\maven-box_maven-jxr_JXR-100-GW63T7YI5V3MNKGKIDDNOVVEH3WQEZVGTRUH5JFV4NSQM2R36VXQ\windows-jdk10-m3.5.x_build\maven-jxr-plugin\target\maven-jxr-plugin-2.6-SNAPSHOT.jar
[windows-jdk10-m3.5.x_build] [INFO] 
[windows-jdk10-m3.5.x_build] [INFO] --- maven-plugin-plugin:3.5.1:addPluginArtifactMetadata
(default-addPluginArtifactMetadata) @ maven-jxr-plugin ---
[windows-jdk10-m3.5.x_build] [INFO] 
[windows-jdk10-m3.5.x_build] [INFO] --- maven-site-plugin:3.7:attach-descriptor (attach-descriptor)
@ maven-jxr-plugin ---
[windows-jdk10-m3.5.x_build] [INFO] Skipping because packaging 'maven-plugin' is not pom.
[windows-jdk10-m3.5.x_build] [INFO] 
[windows-jdk10-m3.5.x_build] [INFO] --- maven-invoker-plugin:3.0.1:install (integration-test)
@ maven-jxr-plugin ---
[windows-jdk10-m3.5.x_build] [INFO] Downloading from central: https://repo.maven.apache.org/maven2/org/apache/maven/shared/maven-invoker/3.0.0/maven-invoker-3.0.0.pom
[windows-jdk10-m3.5.x_build] [INFO] Downloaded from central: https://repo.maven.apache.org/maven2/org/apache/maven/shared/maven-invoker/3.0.0/maven-invoker-3.0.0.pom
(5.0 kB at 209 kB/s)
[windows-jdk10-m3.5.x_build] [INFO] Downloading from central: https://repo.maven.apache.org/maven2/org/apache/maven/reporting/maven-reporting-impl/2.4/maven-reporting-impl-2.4.pom
[windows-jdk10-m3.5.x_build] [INFO] Downloaded from central: https://repo.maven.apache.org/maven2/org/apache/maven/reporting/maven-reporting-impl/2.4/maven-reporting-impl-2.4.pom
(6.1 kB at 124 kB/s)
[windows-jdk10-m3.5.x_build] [INFO] Downloading from central: https://repo.maven.apache.org/maven2/commons-validator/commons-validator/1.4.1/commons-validator-1.4.1.pom
[windows-jdk10-m3.5.x_build] [INFO] Downloaded from central: https://repo.maven.apache.org/maven2/commons-validator/commons-validator/1.4.1/commons-validator-1.4.1.pom
(13 kB at 528 kB/s)
[windows-jdk10-m3.5.x_build] [INFO] Downloading from central: https://repo.maven.apache.org/maven2/org/apache/commons/commons-parent/36/commons-parent-36.pom
[windows-jdk10-m3.5.x_build] [INFO] Downloaded from central: https://repo.maven.apache.org/maven2/org/apache/commons/commons-parent/36/commons-parent-36.pom
(58 kB at 1.9 MB/s)
[windows-jdk10-m3.5.x_build] [INFO] Downloading from central: https://repo.maven.apache.org/maven2/commons-beanutils/commons-beanutils/1.8.3/commons-beanutils-1.8.3.pom
[windows-jdk10-m3.5.x_build] [INFO] Downloaded from central: https://repo.maven.apache.org/maven2/commons-beanutils/commons-beanutils/1.8.3/commons-beanutils-1.8.3.pom
(11 kB at 467 kB/s)
[windows-jdk10-m3.5.x_build] [INFO] Downloading from central: https://repo.maven.apache.org/maven2/org/apache/commons/commons-parent/14/commons-parent-14.pom
[windows-jdk10-m3.5.x_build] [INFO] Downloaded from central: https://repo.maven.apache.org/maven2/org/apache/commons/commons-parent/14/commons-parent-14.pom
(31 kB at 1.2 MB/s)
[windows-jdk10-m3.5.x_build] [INFO] Downloading from central: https://repo.maven.apache.org/maven2/commons-digester/commons-digester/1.8.1/commons-digester-1.8.1.pom
[windows-jdk10-m3.5.x_build] [INFO] Downloaded from central: https://repo.maven.apache.org/maven2/commons-digester/commons-digester/1.8.1/commons-digester-1.8.1.pom
(10 kB at 386 kB/s)
[windows-jdk10-m3.5.x_build] [INFO] Downloading from central: https://repo.maven.apache.org/maven2/org/apache/maven/shared/maven-script-interpreter/1.2/maven-script-interpreter-1.2.pom
[windows-jdk10-m3.5.x_build] [INFO] Downloaded from central: https://repo.maven.apache.org/maven2/org/apache/maven/shared/maven-script-interpreter/1.2/maven-script-interpreter-1.2.pom
(4.0 kB at 182 kB/s)
[windows-jdk10-m3.5.x_build] [INFO] Downloading from central: https://repo.maven.apache.org/maven2/org/apache/ant/ant/1.8.1/ant-1.8.1.pom
[windows-jdk10-m3.5.x_build] [INFO] Downloaded from central: https://repo.maven.apache.org/maven2/org/apache/ant/ant/1.8.1/ant-1.8.1.pom
(8.8 kB at 400 kB/s)
[windows-jdk10-m3.5.x_build] [INFO] Downloading from central: https://repo.maven.apache.org/maven2/org/apache/ant/ant-parent/1.8.1/ant-parent-1.8.1.pom
[windows-jdk10-m3.5.x_build] [INFO] Downloaded from central: https://repo.maven.apache.org/maven2/org/apache/ant/ant-parent/1.8.1/ant-parent-1.8.1.pom
(4.3 kB at 186 kB/s)
[windows-jdk10-m3.5.x_build] [INFO] Downloading from central: https://repo.maven.apache.org/maven2/org/apache/maven/shared/maven-artifact-transfer/0.9.1/maven-artifact-transfer-0.9.1.pom
[windows-jdk10-m3.5.x_build] [INFO] Downloaded from central: https://repo.maven.apache.org/maven2/org/apache/maven/shared/maven-artifact-transfer/0.9.1/maven-artifact-transfer-0.9.1.pom
(7.6 kB at 262 kB/s)
[windows-jdk10-m3.5.x_build] [INFO] Downloading from central: https://repo.maven.apache.org/maven2/org/apache/maven/shared/maven-common-artifact-filters/3.0.1/maven-common-artifact-filters-3.0.1.pom
[windows-jdk10-m3.5.x_build] [INFO] Downloaded from central: https://repo.maven.apache.org/maven2/org/apache/maven/shared/maven-common-artifact-filters/3.0.1/maven-common-artifact-filters-3.0.1.pom
(4.8 kB at 161 kB/s)
[windows-jdk10-m3.5.x_build] [INFO] Downloading from central: https://repo.maven.apache.org/maven2/commons-codec/commons-codec/1.6/commons-codec-1.6.pom
[windows-jdk10-m3.5.x_build] [INFO] Downloaded from central: https://repo.maven.apache.org/maven2/commons-codec/commons-codec/1.6/commons-codec-1.6.pom
(11 kB at 507 kB/s)
[windows-jdk10-m3.5.x_build] [INFO] Downloading from central: https://repo.maven.apache.org/maven2/org/slf4j/slf4j-api/1.7.5/slf4j-api-1.7.5.pom
[windows-jdk10-m3.5.x_build] [INFO] Downloaded from central: https://repo.maven.apache.org/maven2/org/slf4j/slf4j-api/1.7.5/slf4j-api-1.7.5.pom
(2.7 kB at 149 kB/s)
[windows-jdk10-m3.5.x_build] [INFO] Downloading from central: https://repo.maven.apache.org/maven2/org/slf4j/slf4j-parent/1.7.5/slf4j-parent-1.7.5.pom
[windows-jdk10-m3.5.x_build] [INFO] Downloaded from central: https://repo.maven.apache.org/maven2/org/slf4j/slf4j-parent/1.7.5/slf4j-parent-1.7.5.pom
(12 kB at 454 kB/s)
[windows-jdk10-m3.5.x_build] [INFO] Downloading from central: https://repo.maven.apache.org/maven2/org/apache/maven/doxia/doxia-sink-api/1.7/doxia-sink-api-1.7.pom
[windows-jdk10-m3.5.x_build] [INFO] Downloaded from central: https://repo.maven.apache.org/maven2/org/apache/maven/doxia/doxia-sink-api/1.7/doxia-sink-api-1.7.pom
(1.5 kB at 44 kB/s)
[windows-jdk10-m3.5.x_build] [INFO] Downloading from central: https://repo.maven.apache.org/maven2/org/apache/maven/doxia/doxia/1.7/doxia-1.7.pom
[windows-jdk10-m3.5.x_build] [INFO] Downloaded from central: https://repo.maven.apache.org/maven2/org/apache/maven/doxia/doxia/1.7/doxia-1.7.pom
(15 kB at 610 kB/s)
[windows-jdk10-m3.5.x_build] [INFO] Downloading from central: https://repo.maven.apache.org/maven2/org/apache/maven/doxia/doxia-logging-api/1.7/doxia-logging-api-1.7.pom
[windows-jdk10-m3.5.x_build] [INFO] Downloaded from central: https://repo.maven.apache.org/maven2/org/apache/maven/doxia/doxia-logging-api/1.7/doxia-logging-api-1.7.pom
(1.5 kB at 67 kB/s)
[windows-jdk10-m3.5.x_build] [INFO] Downloading from central: https://repo.maven.apache.org/maven2/org/apache/maven/doxia/doxia-site-renderer/1.7.4/doxia-site-renderer-1.7.4.pom
[windows-jdk10-m3.5.x_build] [INFO] Downloaded from central: https://repo.maven.apache.org/maven2/org/apache/maven/doxia/doxia-site-renderer/1.7.4/doxia-site-renderer-1.7.4.pom
(6.7 kB at 334 kB/s)
[windows-jdk10-m3.5.x_build] [INFO] Downloading from central: https://repo.maven.apache.org/maven2/org/apache/maven/doxia/doxia-sitetools/1.7.4/doxia-sitetools-1.7.4.pom
[windows-jdk10-m3.5.x_build] [INFO] Downloaded from central: https://repo.maven.apache.org/maven2/org/apache/maven/doxia/doxia-sitetools/1.7.4/doxia-sitetools-1.7.4.pom
(14 kB at 690 kB/s)
[windows-jdk10-m3.5.x_build] [INFO] Downloading from central: https://repo.maven.apache.org/maven2/org/apache/maven/doxia/doxia-core/1.7/doxia-core-1.7.pom
[windows-jdk10-m3.5.x_build] [INFO] Downloaded from central: https://repo.maven.apache.org/maven2/org/apache/maven/doxia/doxia-core/1.7/doxia-core-1.7.pom
(4.1 kB at 145 kB/s)
[windows-jdk10-m3.5.x_build] [INFO] Downloading from central: https://repo.maven.apache.org/maven2/org/apache/maven/doxia/doxia-decoration-model/1.7.4/doxia-decoration-model-1.7.4.pom
[windows-jdk10-m3.5.x_build] [INFO] Downloaded from central: https://repo.maven.apache.org/maven2/org/apache/maven/doxia/doxia-decoration-model/1.7.4/doxia-decoration-model-1.7.4.pom
(3.4 kB at 46 kB/s)
[windows-jdk10-m3.5.x_build] [INFO] Downloading from central: https://repo.maven.apache.org/maven2/org/apache/maven/doxia/doxia-skin-model/1.7.4/doxia-skin-model-1.7.4.pom
[windows-jdk10-m3.5.x_build] [INFO] Downloaded from central: https://repo.maven.apache.org/maven2/org/apache/maven/doxia/doxia-skin-model/1.7.4/doxia-skin-model-1.7.4.pom
(3.0 kB at 64 kB/s)
[windows-jdk10-m3.5.x_build] [INFO] Downloading from central: https://repo.maven.apache.org/maven2/org/apache/maven/doxia/doxia-module-xhtml/1.7/doxia-module-xhtml-1.7.pom
[windows-jdk10-m3.5.x_build] [INFO] Downloaded from central: https://repo.maven.apache.org/maven2/org/apache/maven/doxia/doxia-module-xhtml/1.7/doxia-module-xhtml-1.7.pom
(1.6 kB at 58 kB/s)
[windows-jdk10-m3.5.x_build] [INFO] Downloading from central: https://repo.maven.apache.org/maven2/org/apache/maven/doxia/doxia-modules/1.7/doxia-modules-1.7.pom
[windows-jdk10-m3.5.x_build] [INFO] Downloaded from central: https://repo.maven.apache.org/maven2/org/apache/maven/doxia/doxia-modules/1.7/doxia-modules-1.7.pom
(2.6 kB at 90 kB/s)
[windows-jdk10-m3.5.x_build] [INFO] Downloading from central: https://repo.maven.apache.org/maven2/org/codehaus/groovy/groovy-all/2.4.8/groovy-all-2.4.8.pom
[windows-jdk10-m3.5.x_build] [INFO] Downloaded from central: https://repo.maven.apache.org/maven2/org/codehaus/groovy/groovy-all/2.4.8/groovy-all-2.4.8.pom
(21 kB at 427 kB/s)
[windows-jdk10-m3.5.x_build] [INFO] Downloading from central: https://repo.maven.apache.org/maven2/org/apache/maven/reporting/maven-reporting-impl/2.4/maven-reporting-impl-2.4.jar
[windows-jdk10-m3.5.x_build] [INFO] Downloading from central: https://repo.maven.apache.org/maven2/commons-validator/commons-validator/1.4.1/commons-validator-1.4.1.jar
[windows-jdk10-m3.5.x_build] [INFO] Downloading from central: https://repo.maven.apache.org/maven2/org/apache/maven/shared/maven-invoker/3.0.0/maven-invoker-3.0.0.jar
[windows-jdk10-m3.5.x_build] [INFO] Downloading from central: https://repo.maven.apache.org/maven2/commons-digester/commons-digester/1.8.1/commons-digester-1.8.1.jar
[windows-jdk10-m3.5.x_build] [INFO] Downloading from central: https://repo.maven.apache.org/maven2/commons-beanutils/commons-beanutils/1.8.3/commons-beanutils-1.8.3.jar
[windows-jdk10-m3.5.x_build] [INFO] Downloaded from central: https://repo.maven.apache.org/maven2/commons-digester/commons-digester/1.8.1/commons-digester-1.8.1.jar
(146 kB at 875 kB/s)
[windows-jdk10-m3.5.x_build] [INFO] Downloading from central: https://repo.maven.apache.org/maven2/commons-logging/commons-logging/1.2/commons-logging-1.2.jar
[windows-jdk10-m3.5.x_build] [INFO] Downloaded from central: https://repo.maven.apache.org/maven2/commons-validator/commons-validator/1.4.1/commons-validator-1.4.1.jar
(190 kB at 834 kB/s)
[windows-jdk10-m3.5.x_build] [INFO] Downloading from central: https://repo.maven.apache.org/maven2/org/apache/maven/shared/maven-script-interpreter/1.2/maven-script-interpreter-1.2.jar
[windows-jdk10-m3.5.x_build] [INFO] Downloaded from central: https://repo.maven.apache.org/maven2/commons-beanutils/commons-beanutils/1.8.3/commons-beanutils-1.8.3.jar
(232 kB at 751 kB/s)
[windows-jdk10-m3.5.x_build] [INFO] Downloading from central: https://repo.maven.apache.org/maven2/org/apache/ant/ant/1.8.1/ant-1.8.1.jar
[windows-jdk10-m3.5.x_build] [INFO] Downloaded from central: https://repo.maven.apache.org/maven2/org/apache/maven/shared/maven-script-interpreter/1.2/maven-script-interpreter-1.2.jar
(22 kB at 45 kB/s)
[windows-jdk10-m3.5.x_build] [INFO] Downloaded from central: https://repo.maven.apache.org/maven2/org/apache/maven/reporting/maven-reporting-impl/2.4/maven-reporting-impl-2.4.jar
(20 kB at 40 kB/s)
[windows-jdk10-m3.5.x_build] [INFO] Downloading from central: https://repo.maven.apache.org/maven2/org/apache/maven/shared/maven-artifact-transfer/0.9.1/maven-artifact-transfer-0.9.1.jar
[windows-jdk10-m3.5.x_build] [INFO] Downloading from central: https://repo.maven.apache.org/maven2/org/apache/maven/shared/maven-common-artifact-filters/3.0.1/maven-common-artifact-filters-3.0.1.jar
[windows-jdk10-m3.5.x_build] [INFO] Downloaded from central: https://repo.maven.apache.org/maven2/org/apache/maven/shared/maven-artifact-transfer/0.9.1/maven-artifact-transfer-0.9.1.jar
(123 kB at 215 kB/s)
[windows-jdk10-m3.5.x_build] [INFO] Downloading from central: https://repo.maven.apache.org/maven2/commons-codec/commons-codec/1.6/commons-codec-1.6.jar
[windows-jdk10-m3.5.x_build] [INFO] Downloaded from central: https://repo.maven.apache.org/maven2/commons-logging/commons-logging/1.2/commons-logging-1.2.jar
(62 kB at 106 kB/s)
[windows-jdk10-m3.5.x_build] [INFO] Downloading from central: https://repo.maven.apache.org/maven2/org/slf4j/slf4j-api/1.7.5/slf4j-api-1.7.5.jar
[windows-jdk10-m3.5.x_build] [INFO] Downloaded from central: https://repo.maven.apache.org/maven2/org/apache/ant/ant/1.8.1/ant-1.8.1.jar
(1.5 MB at 2.6 MB/s)
[windows-jdk10-m3.5.x_build] [INFO] Downloading from central: https://repo.maven.apache.org/maven2/org/apache/maven/doxia/doxia-sink-api/1.7/doxia-sink-api-1.7.jar
[windows-jdk10-m3.5.x_build] [INFO] Downloaded from central: https://repo.maven.apache.org/maven2/org/apache/maven/shared/maven-common-artifact-filters/3.0.1/maven-common-artifact-filters-3.0.1.jar
(61 kB at 104 kB/s)
[windows-jdk10-m3.5.x_build] [INFO] Downloading from central: https://repo.maven.apache.org/maven2/org/apache/maven/doxia/doxia-logging-api/1.7/doxia-logging-api-1.7.jar
[windows-jdk10-m3.5.x_build] [INFO] Downloaded from central: https://repo.maven.apache.org/maven2/commons-codec/commons-codec/1.6/commons-codec-1.6.jar
(233 kB at 368 kB/s)
[windows-jdk10-m3.5.x_build] [INFO] Downloading from central: https://repo.maven.apache.org/maven2/org/apache/maven/doxia/doxia-site-renderer/1.7.4/doxia-site-renderer-1.7.4.jar
[windows-jdk10-m3.5.x_build] [INFO] Downloaded from central: https://repo.maven.apache.org/maven2/org/apache/maven/shared/maven-invoker/3.0.0/maven-invoker-3.0.0.jar
(33 kB at 50 kB/s)
[windows-jdk10-m3.5.x_build] [INFO] Downloading from central: https://repo.maven.apache.org/maven2/org/apache/maven/doxia/doxia-decoration-model/1.7.4/doxia-decoration-model-1.7.4.jar
[windows-jdk10-m3.5.x_build] [INFO] Downloaded from central: https://repo.maven.apache.org/maven2/org/apache/maven/doxia/doxia-sink-api/1.7/doxia-sink-api-1.7.jar
(11 kB at 16 kB/s)
[windows-jdk10-m3.5.x_build] [INFO] Downloading from central: https://repo.maven.apache.org/maven2/org/apache/maven/doxia/doxia-skin-model/1.7.4/doxia-skin-model-1.7.4.jar
[windows-jdk10-m3.5.x_build] [INFO] Downloaded from central: https://repo.maven.apache.org/maven2/org/apache/maven/doxia/doxia-logging-api/1.7/doxia-logging-api-1.7.jar
(12 kB at 16 kB/s)
[windows-jdk10-m3.5.x_build] [INFO] Downloading from central: https://repo.maven.apache.org/maven2/org/apache/maven/doxia/doxia-module-xhtml/1.7/doxia-module-xhtml-1.7.jar
[windows-jdk10-m3.5.x_build] [INFO] Downloaded from central: https://repo.maven.apache.org/maven2/org/apache/maven/doxia/doxia-decoration-model/1.7.4/doxia-decoration-model-1.7.4.jar
(61 kB at 86 kB/s)
[windows-jdk10-m3.5.x_build] [INFO] Downloading from central: https://repo.maven.apache.org/maven2/org/codehaus/groovy/groovy-all/2.4.8/groovy-all-2.4.8.jar
[windows-jdk10-m3.5.x_build] [INFO] Downloaded from central: https://repo.maven.apache.org/maven2/org/apache/maven/doxia/doxia-site-renderer/1.7.4/doxia-site-renderer-1.7.4.jar
(64 kB at 90 kB/s)
[windows-jdk10-m3.5.x_build] [INFO] Downloaded from central: https://repo.maven.apache.org/maven2/org/apache/maven/doxia/doxia-module-xhtml/1.7/doxia-module-xhtml-1.7.jar
(17 kB at 20 kB/s)
[windows-jdk10-m3.5.x_build] [INFO] Downloaded from central: https://repo.maven.apache.org/maven2/org/slf4j/slf4j-api/1.7.5/slf4j-api-1.7.5.jar
(26 kB at 31 kB/s)
[windows-jdk10-m3.5.x_build] [INFO] Downloaded from central: https://repo.maven.apache.org/maven2/org/apache/maven/doxia/doxia-skin-model/1.7.4/doxia-skin-model-1.7.4.jar
(16 kB at 18 kB/s)
[windows-jdk10-m3.5.x_build] [INFO] Downloaded from central: https://repo.maven.apache.org/maven2/org/codehaus/groovy/groovy-all/2.4.8/groovy-all-2.4.8.jar
(7.0 MB at 7.5 MB/s)
[windows-jdk10-m3.5.x_build] [INFO] Installing f:\jenkins\jenkins-slave\workspace\maven-box_maven-jxr_JXR-100-GW63T7YI5V3MNKGKIDDNOVVEH3WQEZVGTRUH5JFV4NSQM2R36VXQ\windows-jdk10-m3.5.x_build\pom.xml
to F:\jenkins\jenkins-slave\workspace\maven-box_maven-jxr_JXR-100-GW63T7YI5V3MNKGKIDDNOVVEH3WQEZVGTRUH5JFV4NSQM2R36VXQ\windows-jdk10-m3.5.x_build\maven-jxr-plugin\target\local-repo\org\apache\maven\jxr\jxr\2.6-SNAPSHOT\jxr-2.6-SNAPSHOT.pom
[windows-jdk10-m3.5.x_build] [INFO] Installing f:\jenkins\jenkins-slave\workspace\maven-box_maven-jxr_JXR-100-GW63T7YI5V3MNKGKIDDNOVVEH3WQEZVGTRUH5JFV4NSQM2R36VXQ\windows-jdk10-m3.5.x_build\target\jxr-2.6-SNAPSHOT-site.xml
to F:\jenkins\jenkins-slave\workspace\maven-box_maven-jxr_JXR-100-GW63T7YI5V3MNKGKIDDNOVVEH3WQEZVGTRUH5JFV4NSQM2R36VXQ\windows-jdk10-m3.5.x_build\maven-jxr-plugin\target\local-repo\org\apache\maven\jxr\jxr\2.6-SNAPSHOT\jxr-2.6-SNAPSHOT-site.xml
[windows-jdk10-m3.5.x_build] [INFO] Installing F:\jenkins\jenkins-slave\workspace\maven-box_maven-jxr_JXR-100-GW63T7YI5V3MNKGKIDDNOVVEH3WQEZVGTRUH5JFV4NSQM2R36VXQ\windows-jdk10-m3.5.x_build\maven-jxr\pom.xml
to F:\jenkins\jenkins-slave\workspace\maven-box_maven-jxr_JXR-100-GW63T7YI5V3MNKGKIDDNOVVEH3WQEZVGTRUH5JFV4NSQM2R36VXQ\windows-jdk10-m3.5.x_build\maven-jxr-plugin\target\local-repo\org\apache\maven\maven-jxr\2.6-SNAPSHOT\maven-jxr-2.6-SNAPSHOT.pom
[windows-jdk10-m3.5.x_build] [INFO] Installing F:\jenkins\jenkins-slave\workspace\maven-box_maven-jxr_JXR-100-GW63T7YI5V3MNKGKIDDNOVVEH3WQEZVGTRUH5JFV4NSQM2R36VXQ\windows-jdk10-m3.5.x_build\maven-jxr\target\maven-jxr-2.6-SNAPSHOT.jar
to F:\jenkins\jenkins-slave\workspace\maven-box_maven-jxr_JXR-100-GW63T7YI5V3MNKGKIDDNOVVEH3WQEZVGTRUH5JFV4NSQM2R36VXQ\windows-jdk10-m3.5.x_build\maven-jxr-plugin\target\local-repo\org\apache\maven\maven-jxr\2.6-SNAPSHOT\maven-jxr-2.6-SNAPSHOT.jar
[windows-jdk10-m3.5.x_build] [INFO] Installing F:\jenkins\jenkins-slave\workspace\maven-box_maven-jxr_JXR-100-GW63T7YI5V3MNKGKIDDNOVVEH3WQEZVGTRUH5JFV4NSQM2R36VXQ\windows-jdk10-m3.5.x_build\maven-jxr-plugin\pom.xml
to F:\jenkins\jenkins-slave\workspace\maven-box_maven-jxr_JXR-100-GW63T7YI5V3MNKGKIDDNOVVEH3WQEZVGTRUH5JFV4NSQM2R36VXQ\windows-jdk10-m3.5.x_build\maven-jxr-plugin\target\local-repo\org\apache\maven\plugins\maven-jxr-plugin\2.6-SNAPSHOT\maven-jxr-plugin-2.6-SNAPSHOT.pom
[windows-jdk10-m3.5.x_build] [INFO] Installing F:\jenkins\jenkins-slave\workspace\maven-box_maven-jxr_JXR-100-GW63T7YI5V3MNKGKIDDNOVVEH3WQEZVGTRUH5JFV4NSQM2R36VXQ\windows-jdk10-m3.5.x_build\maven-jxr-plugin\target\maven-jxr-plugin-2.6-SNAPSHOT.jar
to F:\jenkins\jenkins-slave\workspace\maven-box_maven-jxr_JXR-100-GW63T7YI5V3MNKGKIDDNOVVEH3WQEZVGTRUH5JFV4NSQM2R36VXQ\windows-jdk10-m3.5.x_build\maven-jxr-plugin\target\local-repo\org\apache\maven\plugins\maven-jxr-plugin\2.6-SNAPSHOT\maven-jxr-plugin-2.6-SNAPSHOT.jar
[windows-jdk10-m3.5.x_build] [INFO] 
[windows-jdk10-m3.5.x_build] [INFO] --- maven-invoker-plugin:3.0.1:run (integration-test)
@ maven-jxr-plugin ---
[windows-jdk10-m3.5.x_build] [INFO] Running Setup Jobs
[windows-jdk10-m3.5.x_build] [INFO] Building: aggregate\pom.xml
[windows-jdk10-m3.5.x_build] [INFO] run post-build script verify.groovy
[windows-jdk10-m3.5.x_build] WARNING: An illegal reflective access operation has occurred
[windows-jdk10-m3.5.x_build] WARNING: Illegal reflective access by org.codehaus.groovy.reflection.CachedClass
(file:/f:/jenkins/jenkins-slave/workspace/maven-box_maven-jxr_JXR-100-GW63T7YI5V3MNKGKIDDNOVVEH3WQEZVGTRUH5JFV4NSQM2R36VXQ/.repository/org/codehaus/groovy/groovy-all/2.4.8/groovy-all-2.4.8.jar)
to method java.lang.Object.finalize()
[windows-jdk10-m3.5.x_build] WARNING: Please consider reporting this to the maintainers of
org.codehaus.groovy.reflection.CachedClass
[windows-jdk10-m3.5.x_build] WARNING: Use --illegal-access=warn to enable warnings of further
illegal reflective access operations
[windows-jdk10-m3.5.x_build] WARNING: All illegal access operations will be denied in a future
release
[windows-jdk10-m3.5.x_build] [INFO]           aggregate\pom.xml ................................
FAILED (29.1 s)
[windows-jdk10-m3.5.x_build] [INFO]   The post-build script did not succeed. assert new File(
basedir, 'target/site' ).exists()
[windows-jdk10-m3.5.x_build]        |         |                        |
[windows-jdk10-m3.5.x_build]        |         |                        false
[windows-jdk10-m3.5.x_build]        |         F:\jenkins\jenkins-slave\workspace\maven-box_maven-jxr_JXR-100-GW63T7YI5V3MNKGKIDDNOVVEH3WQEZVGTRUH5JFV4NSQM2R36VXQ\windows-jdk10-m3.5.x_build\maven-jxr-plugin\target\it\aggregate
[windows-jdk10-m3.5.x_build]        F:\jenkins\jenkins-slave\workspace\maven-box_maven-jxr_JXR-100-GW63T7YI5V3MNKGKIDDNOVVEH3WQEZVGTRUH5JFV4NSQM2R36VXQ\windows-jdk10-m3.5.x_build\maven-jxr-plugin\target\it\aggregate\target\site
[windows-jdk10-m3.5.x_build] [INFO] Building: JXR-100_parameterlink\pom.xml
[windows-jdk10-m3.5.x_build] [INFO] run post-build script verify.groovy
[windows-jdk10-m3.5.x_build] [INFO]           JXR-100_parameterlink\pom.xml ....................
SUCCESS (10.1 s)
[windows-jdk10-m3.5.x_build] [INFO] Building: mixed-plugin-report\pom.xml
[windows-jdk10-m3.5.x_build] [INFO] run post-build script verify.groovy
[windows-jdk10-m3.5.x_build] [INFO]           mixed-plugin-report\pom.xml ......................
FAILED (10.3 s)
[windows-jdk10-m3.5.x_build] [INFO]   The post-build script did not succeed. assert new File(
basedir, 'target/site' ).exists()
[windows-jdk10-m3.5.x_build]        |         |                        |
[windows-jdk10-m3.5.x_build]        |         |                        false
[windows-jdk10-m3.5.x_build]        |         F:\jenkins\jenkins-slave\workspace\maven-box_maven-jxr_JXR-100-GW63T7YI5V3MNKGKIDDNOVVEH3WQEZVGTRUH5JFV4NSQM2R36VXQ\windows-jdk10-m3.5.x_build\maven-jxr-plugin\target\it\mixed-plugin-report
[windows-jdk10-m3.5.x_build]        F:\jenkins\jenkins-slave\workspace\maven-box_maven-jxr_JXR-100-GW63T7YI5V3MNKGKIDDNOVVEH3WQEZVGTRUH5JFV4NSQM2R36VXQ\windows-jdk10-m3.5.x_build\maven-jxr-plugin\target\it\mixed-plugin-report\target\site
[windows-jdk10-m3.5.x_build] [INFO] Building: new-site-config\pom.xml
[windows-jdk10-m3.5.x_build] [INFO] run post-build script verify.groovy
[windows-jdk10-m3.5.x_build] [INFO]           new-site-config\pom.xml ..........................
FAILED (8.3 s)
[windows-jdk10-m3.5.x_build] [INFO]   The post-build script did not succeed. assert new File(
basedir, 'target/site' ).exists()
[windows-jdk10-m3.5.x_build]        |         |                        |
[windows-jdk10-m3.5.x_build]        |         |                        false
[windows-jdk10-m3.5.x_build]        |         F:\jenkins\jenkins-slave\workspace\maven-box_maven-jxr_JXR-100-GW63T7YI5V3MNKGKIDDNOVVEH3WQEZVGTRUH5JFV4NSQM2R36VXQ\windows-jdk10-m3.5.x_build\maven-jxr-plugin\target\it\new-site-config
[windows-jdk10-m3.5.x_build]        F:\jenkins\jenkins-slave\workspace\maven-box_maven-jxr_JXR-100-GW63T7YI5V3MNKGKIDDNOVVEH3WQEZVGTRUH5JFV4NSQM2R36VXQ\windows-jdk10-m3.5.x_build\maven-jxr-plugin\target\it\new-site-config\target\site
[windows-jdk10-m3.5.x_build] [INFO] Building: simple-project\pom.xml
[windows-jdk10-m3.5.x_build] [INFO] run post-build script verify.groovy
[windows-jdk10-m3.5.x_build] [INFO]           simple-project\pom.xml ...........................
FAILED (8.5 s)
[windows-jdk10-m3.5.x_build] [INFO]   The post-build script did not succeed. assert new File(
basedir, 'target/site' ).exists()
[windows-jdk10-m3.5.x_build]        |         |                        |
[windows-jdk10-m3.5.x_build]        |         |                        false
[windows-jdk10-m3.5.x_build]        |         F:\jenkins\jenkins-slave\workspace\maven-box_maven-jxr_JXR-100-GW63T7YI5V3MNKGKIDDNOVVEH3WQEZVGTRUH5JFV4NSQM2R36VXQ\windows-jdk10-m3.5.x_build\maven-jxr-plugin\target\it\simple-project
[windows-jdk10-m3.5.x_build]        F:\jenkins\jenkins-slave\workspace\maven-box_maven-jxr_JXR-100-GW63T7YI5V3MNKGKIDDNOVVEH3WQEZVGTRUH5JFV4NSQM2R36VXQ\windows-jdk10-m3.5.x_build\maven-jxr-plugin\target\it\simple-project\target\site
[windows-jdk10-m3.5.x_build] [INFO] -------------------------------------------------
[windows-jdk10-m3.5.x_build] [INFO] Build Summary:
[windows-jdk10-m3.5.x_build] [INFO]   Passed: 1, Failed: 4, Errors: 0, Skipped: 0
[windows-jdk10-m3.5.x_build] [INFO] -------------------------------------------------
[windows-jdk10-m3.5.x_build] [WARNING] The following builds failed:
[windows-jdk10-m3.5.x_build] [WARNING] *  aggregate\pom.xml
[windows-jdk10-m3.5.x_build] [WARNING] *  mixed-plugin-report\pom.xml
[windows-jdk10-m3.5.x_build] [WARNING] *  new-site-config\pom.xml
[windows-jdk10-m3.5.x_build] [WARNING] *  simple-project\pom.xml
[windows-jdk10-m3.5.x_build] [INFO] -------------------------------------------------
[windows-jdk10-m3.5.x_build] [WARNING] Ignoring that 4 builds failed.
[windows-jdk10-m3.5.x_build] [INFO] 
[windows-jdk10-m3.5.x_build] [INFO] --- maven-checkstyle-plugin:3.0.0:check (checkstyle-check)
@ maven-jxr-plugin ---
[windows-jdk10-m3.5.x_build] [INFO] ------------------------------------------------------------------------
[windows-jdk10-m3.5.x_build] [INFO] Reactor Summary:
[windows-jdk10-m3.5.x_build] [INFO] 
[windows-jdk10-m3.5.x_build] [INFO] Maven JXR Parent ................................... SUCCESS
[ 46.524 s]
[windows-jdk10-m3.5.x_build] [INFO] Maven JXR .......................................... SUCCESS
[ 16.209 s]
[windows-jdk10-m3.5.x_build] [INFO] Maven JXR Plugin ................................... SUCCESS
[01:41 min]
[windows-jdk10-m3.5.x_build] [INFO] ------------------------------------------------------------------------
[windows-jdk10-m3.5.x_build] [INFO] BUILD SUCCESS
[windows-jdk10-m3.5.x_build] [INFO] ------------------------------------------------------------------------
[windows-jdk10-m3.5.x_build] [INFO] Total time: 02:45 min
[windows-jdk10-m3.5.x_build] [INFO] Finished at: 2018-09-09T22:46:32-07:00
[windows-jdk10-m3.5.x_build] [INFO] Final Memory: 46M/160M
[windows-jdk10-m3.5.x_build] [INFO] ------------------------------------------------------------------------
[windows-jdk10-m3.5.x_build] [INFO] [jenkins-event-spy] Generated F:\jenkins\jenkins-slave\workspace\maven-box_maven-jxr_JXR-100-GW63T7YI5V3MNKGKIDDNOVVEH3WQEZVGTRUH5JFV4NSQM2R36VXQ@tmp\withMaven43ca5864\maven-spy-20180909-224346-8536748575107690164271.log
[Pipeline] [windows-jdk10-m3.5.x_build] }
[Pipeline] [windows-jdk10-m3.5.x_build] // dir
[Pipeline] [windows-jdk10-m3.5.x_build] }
[windows-jdk10-m3.5.x_build] [withMaven] artifactsPublisher - Archive artifact windows-jdk10-m3.5.x_build\pom.xml
under org\apache\maven\jxr\jxr\2.6-SNAPSHOT\jxr-2.6-SNAPSHOT.pom
[windows-jdk10-m3.5.x_build] [withMaven] artifactsPublisher - Archive artifact windows-jdk10-m3.5.x_build\target\jxr-2.6-SNAPSHOT-site.xml
under org\apache\maven\jxr\jxr\2.6-SNAPSHOT\jxr-2.6-SNAPSHOT-site.xml
[windows-jdk10-m3.5.x_build] [withMaven] artifactsPublisher - Archive artifact windows-jdk10-m3.5.x_build\maven-jxr\pom.xml
under org\apache\maven\maven-jxr\2.6-SNAPSHOT\maven-jxr-2.6-SNAPSHOT.pom
[windows-jdk10-m3.5.x_build] [withMaven] artifactsPublisher - Archive artifact windows-jdk10-m3.5.x_build\maven-jxr\target\maven-jxr-2.6-SNAPSHOT.jar
under org\apache\maven\maven-jxr\2.6-SNAPSHOT\maven-jxr-2.6-SNAPSHOT.jar
[windows-jdk10-m3.5.x_build] [withMaven] artifactsPublisher - Archive artifact windows-jdk10-m3.5.x_build\maven-jxr-plugin\pom.xml
under org\apache\maven\plugins\maven-jxr-plugin\2.6-SNAPSHOT\maven-jxr-plugin-2.6-SNAPSHOT.pom
[windows-jdk10-m3.5.x_build] [withMaven] artifactsPublisher - Archive artifact windows-jdk10-m3.5.x_build\maven-jxr-plugin\target\maven-jxr-plugin-2.6-SNAPSHOT.jar
under org\apache\maven\plugins\maven-jxr-plugin\2.6-SNAPSHOT\maven-jxr-plugin-2.6-SNAPSHOT.jar
[windows-jdk10-m3.5.x_build] [withMaven] invokerPublisher - Archive invoker results for Maven
artifact MavenArtifact{org.apache.maven.plugins:maven-jxr-plugin::2.6-SNAPSHOT(version: 2.6-SNAPSHOT,
snapshot:false) } generated by PluginInvocation{org.apache.maven.plugins:maven-invoker-plugin:3.0.1@run
 integration-test}: windows-jdk10-m3.5.x_build\maven-jxr-plugin\target\invoker-reports\*.xml
[windows-jdk10-m3.5.x_build] performing MavenInvokerRecorder, reportsFilenamePattern:'**/windows-jdk10-m3.5.x_build\maven-jxr-plugin\target\invoker-reports/BUILD*.xml',
invokerBuildDir:'**/windows-jdk10-m3.5.x_build\maven-jxr-plugin\target\it'
[windows-jdk10-m3.5.x_build] Found reports:[f:\jenkins\jenkins-slave\workspace\maven-box_maven-jxr_JXR-100-GW63T7YI5V3MNKGKIDDNOVVEH3WQEZVGTRUH5JFV4NSQM2R36VXQ\windows-jdk10-m3.5.x_build\maven-jxr-plugin\target\invoker-reports\BUILD-JXR-100_parameterlink.xml,
f:\jenkins\jenkins-slave\workspace\maven-box_maven-jxr_JXR-100-GW63T7YI5V3MNKGKIDDNOVVEH3WQEZVGTRUH5JFV4NSQM2R36VXQ\windows-jdk10-m3.5.x_build\maven-jxr-plugin\target\invoker-reports\BUILD-aggregate.xml,
f:\jenkins\jenkins-slave\workspace\maven-box_maven-jxr_JXR-100-GW63T7YI5V3MNKGKIDDNOVVEH3WQEZVGTRUH5JFV4NSQM2R36VXQ\windows-jdk10-m3.5.x_build\maven-jxr-plugin\target\invoker-reports\BUILD-mixed-plugin-report.xml,
f:\jenkins\jenkins-slave\workspace\maven-box_maven-jxr_JXR-100-GW63T7YI5V3MNKGKIDDNOVVEH3WQEZVGTRUH5JFV4NSQM2R36VXQ\windows-jdk10-m3.5.x_build\maven-jxr-plugin\target\invoker-reports\BUILD-new-site-config.xml,
f:\jenkins\jenkins-slave\workspace\maven-box_maven-jxr_JXR-100-GW63T7YI5V3MNKGKIDDNOVVEH3WQEZVGTRUH5JFV4NSQM2R36VXQ\windows-jdk10-m3.5.x_build\maven-jxr-plugin\target\invoker-reports\BUILD-simple-project.xml]
[windows-jdk10-m3.5.x_build] Found logs:[f:\jenkins\jenkins-slave\workspace\maven-box_maven-jxr_JXR-100-GW63T7YI5V3MNKGKIDDNOVVEH3WQEZVGTRUH5JFV4NSQM2R36VXQ\windows-jdk10-m3.5.x_build\maven-jxr-plugin\target\it\JXR-100_parameterlink\build.log,
f:\jenkins\jenkins-slave\workspace\maven-box_maven-jxr_JXR-100-GW63T7YI5V3MNKGKIDDNOVVEH3WQEZVGTRUH5JFV4NSQM2R36VXQ\windows-jdk10-m3.5.x_build\maven-jxr-plugin\target\it\aggregate\build.log,
f:\jenkins\jenkins-slave\workspace\maven-box_maven-jxr_JXR-100-GW63T7YI5V3MNKGKIDDNOVVEH3WQEZVGTRUH5JFV4NSQM2R36VXQ\windows-jdk10-m3.5.x_build\maven-jxr-plugin\target\it\mixed-plugin-report\build.log,
f:\jenkins\jenkins-slave\workspace\maven-box_maven-jxr_JXR-100-GW63T7YI5V3MNKGKIDDNOVVEH3WQEZVGTRUH5JFV4NSQM2R36VXQ\windows-jdk10-m3.5.x_build\maven-jxr-plugin\target\it\new-site-config\build.log,
f:\jenkins\jenkins-slave\workspace\maven-box_maven-jxr_JXR-100-GW63T7YI5V3MNKGKIDDNOVVEH3WQEZVGTRUH5JFV4NSQM2R36VXQ\windows-jdk10-m3.5.x_build\maven-jxr-plugin\target\it\simple-project\build.log]
[windows-jdk10-m3.5.x_build] Finished parsing Maven Invoker results (found 5)
[windows-jdk10-m3.5.x_build] [withMaven] junitPublisher - Archive test results for Maven artifact
org.apache.maven:maven-jxr:2.6-SNAPSHOT generated by maven-surefire-plugin:test (default-test):
windows-jdk10-m3.5.x_build\maven-jxr\target\surefire-reports\*.xml
[windows-jdk10-m3.5.x_build] Recording test results
[windows-jdk10-m3.5.x_build] [withMaven] junitPublisher - Archive test results for Maven artifact
org.apache.maven.plugins:maven-jxr-plugin:2.6-SNAPSHOT generated by maven-surefire-plugin:test
(default-test): windows-jdk10-m3.5.x_build\maven-jxr-plugin\target\surefire-reports\*.xml
[windows-jdk10-m3.5.x_build] Recording test results
[windows-jdk10-m3.5.x_build] [withMaven] openTasksPublisher - Scan Tasks for Maven artifact
org.apache.maven:maven-jxr:2.6-SNAPSHOT in source directory windows-jdk10-m3.5.x_build\maven-jxr\src\main\java
[windows-jdk10-m3.5.x_build] [withMaven] openTasksPublisher - Scan Tasks for Maven artifact
org.apache.maven.plugins:maven-jxr-plugin:2.6-SNAPSHOT in source directory windows-jdk10-m3.5.x_build\maven-jxr-plugin\src\main\java
[windows-jdk10-m3.5.x_build] [TASKS] Scanning folder 'f:\jenkins\jenkins-slave\workspace\maven-box_maven-jxr_JXR-100-GW63T7YI5V3MNKGKIDDNOVVEH3WQEZVGTRUH5JFV4NSQM2R36VXQ'
for files matching the pattern 'windows-jdk10-m3.5.x_build\maven-jxr\src\main\java\**\*,windows-jdk10-m3.5.x_build\maven-jxr-plugin\src\main\java\**\*'
- excludes: null
[windows-jdk10-m3.5.x_build] [TASKS] Found 24 files to scan for tasks
[windows-jdk10-m3.5.x_build] [TASKS] Found 4 open tasks.
[windows-jdk10-m3.5.x_build] Skipping warnings blame since pipelines do not have an SCM link.%n
[windows-jdk10-m3.5.x_build] [TASKS] Computing warning deltas based on reference build #10
[Pipeline] [windows-jdk10-m3.5.x_build] // withMaven
[Pipeline] [windows-jdk10-m3.5.x_build] cleanWs
[windows-jdk10-m3.5.x_build] [WS-CLEANUP] Deleting project workspace...[WS-CLEANUP] done
[Pipeline] [windows-jdk10-m3.5.x_build] }
[Pipeline] [windows-jdk10-m3.5.x_build] // stage
[Pipeline] [windows-jdk10-m3.5.x_build] }
[Pipeline] [windows-jdk10-m3.5.x_build] // node
[Pipeline] [windows-jdk10-m3.5.x_build] }
[Pipeline] // parallel
[Pipeline] stage
[Pipeline] { (Notifications)
[Pipeline] echo
Build result: UNSTABLE
[Pipeline] jiraIssueSelector
[Pipeline] emailext
Mime
  • Unnamed multipart/mixed (inline, None, 0 bytes)
View raw message