maven-notifications mailing list archives

Site index · List index
Message view « Date » · « Thread »
Top « Date » · « Thread »
From Apache Jenkins Server <jenk...@builds.apache.org>
Subject Build failed in Jenkins: Maven TLP » maven-enforcer » MENFORCER-276 #14
Date Fri, 14 Sep 2018 05:33:48 GMT
See https://builds.apache.org/job/maven-box/job/maven-enforcer/job/MENFORCER-276/14/

No changes.

No tests ran.

Build log:
[...truncated 1.10 MB...]
[windows-jdk10] [INFO] Downloaded from central: https://repo.maven.apache.org/maven2/org/codehaus/plexus/plexus-compiler-api/2.8.2/plexus-compiler-api-2.8.2.jar
(26 kB at 220 kB/s)
[windows-jdk10] [INFO] Downloaded from central: https://repo.maven.apache.org/maven2/org/codehaus/plexus/plexus-java/0.9.2/plexus-java-0.9.2.jar
(31 kB at 208 kB/s)
[windows-jdk10] [INFO] Changes detected - recompiling the module!
[windows-jdk10] [INFO] Compiling 5 source files to F:\jenkins\jenkins-slave\workspace\aven-enforcer_MENFORCER-276-ARAEEUQ3DZKGP7LK65FX6C75KHKIJYNAPASQYCZKRS4IVUWL44FA\m\enforcer-api\target\classes
[windows-jdk10] [INFO] 
[windows-jdk10] [INFO] --- maven-resources-plugin:3.0.2:testResources (default-testResources)
@ enforcer-api ---
[windows-jdk10] [INFO] Using 'UTF-8' encoding to copy filtered resources.
[windows-jdk10] [INFO] skip non existing resourceDirectory F:\jenkins\jenkins-slave\workspace\aven-enforcer_MENFORCER-276-ARAEEUQ3DZKGP7LK65FX6C75KHKIJYNAPASQYCZKRS4IVUWL44FA\m\enforcer-api\src\test\resources
[windows-jdk10] [INFO] Copying 3 resources
[windows-jdk10] [INFO] 
[windows-jdk10] [INFO] --- maven-compiler-plugin:3.7.0:testCompile (default-testCompile) @
enforcer-api ---
[windows-jdk10] [INFO] No sources to compile
[windows-jdk10] [INFO] 
[windows-jdk10] [INFO] --- maven-surefire-plugin:2.21.0:test (default-test) @ enforcer-api
---
[windows-jdk10] [INFO] Downloading from central: https://repo.maven.apache.org/maven2/org/apache/maven/surefire/maven-surefire-common/2.21.0/maven-surefire-common-2.21.0.pom
[windows-jdk10] [INFO] Downloaded from central: https://repo.maven.apache.org/maven2/org/apache/maven/surefire/maven-surefire-common/2.21.0/maven-surefire-common-2.21.0.pom
(11 kB at 812 kB/s)
[windows-jdk10] [INFO] Downloading from central: https://repo.maven.apache.org/maven2/org/apache/maven/plugin-tools/maven-plugin-annotations/3.5/maven-plugin-annotations-3.5.pom
[windows-jdk10] [INFO] Downloaded from central: https://repo.maven.apache.org/maven2/org/apache/maven/plugin-tools/maven-plugin-annotations/3.5/maven-plugin-annotations-3.5.pom
(1.7 kB at 128 kB/s)
[windows-jdk10] [INFO] Downloading from central: https://repo.maven.apache.org/maven2/org/apache/maven/plugin-tools/maven-plugin-tools/3.5/maven-plugin-tools-3.5.pom
[windows-jdk10] [INFO] Downloaded from central: https://repo.maven.apache.org/maven2/org/apache/maven/plugin-tools/maven-plugin-tools/3.5/maven-plugin-tools-3.5.pom
(16 kB at 1.2 MB/s)
[windows-jdk10] [INFO] Downloading from central: https://repo.maven.apache.org/maven2/org/apache/maven/surefire/surefire-api/2.21.0/surefire-api-2.21.0.pom
[windows-jdk10] [INFO] Downloaded from central: https://repo.maven.apache.org/maven2/org/apache/maven/surefire/surefire-api/2.21.0/surefire-api-2.21.0.pom
(3.5 kB at 272 kB/s)
[windows-jdk10] [INFO] Downloading from central: https://repo.maven.apache.org/maven2/org/apache/maven/surefire/surefire-logger-api/2.21.0/surefire-logger-api-2.21.0.pom
[windows-jdk10] [INFO] Downloaded from central: https://repo.maven.apache.org/maven2/org/apache/maven/surefire/surefire-logger-api/2.21.0/surefire-logger-api-2.21.0.pom
(2.0 kB at 168 kB/s)
[windows-jdk10] [INFO] Downloading from central: https://repo.maven.apache.org/maven2/org/apache/maven/surefire/surefire-booter/2.21.0/surefire-booter-2.21.0.pom
[windows-jdk10] [INFO] Downloaded from central: https://repo.maven.apache.org/maven2/org/apache/maven/surefire/surefire-booter/2.21.0/surefire-booter-2.21.0.pom
(7.4 kB at 614 kB/s)
[windows-jdk10] [INFO] Downloading from central: https://repo.maven.apache.org/maven2/org/apache/maven/maven-toolchain/2.2.1/maven-toolchain-2.2.1.pom
[windows-jdk10] [INFO] Downloaded from central: https://repo.maven.apache.org/maven2/org/apache/maven/maven-toolchain/2.2.1/maven-toolchain-2.2.1.pom
(3.3 kB at 239 kB/s)
[windows-jdk10] [INFO] Downloading from central: https://repo.maven.apache.org/maven2/org/codehaus/plexus/plexus-java/0.9.3/plexus-java-0.9.3.pom
[windows-jdk10] [INFO] Downloaded from central: https://repo.maven.apache.org/maven2/org/codehaus/plexus/plexus-java/0.9.3/plexus-java-0.9.3.pom
(2.4 kB at 196 kB/s)
[windows-jdk10] [INFO] Downloading from central: https://repo.maven.apache.org/maven2/org/codehaus/plexus/plexus-languages/0.9.3/plexus-languages-0.9.3.pom
[windows-jdk10] [INFO] Downloaded from central: https://repo.maven.apache.org/maven2/org/codehaus/plexus/plexus-languages/0.9.3/plexus-languages-0.9.3.pom
(2.2 kB at 183 kB/s)
[windows-jdk10] [INFO] Downloading from central: https://repo.maven.apache.org/maven2/org/apache/maven/surefire/maven-surefire-common/2.21.0/maven-surefire-common-2.21.0.jar
[windows-jdk10] [INFO] Downloading from central: https://repo.maven.apache.org/maven2/org/apache/maven/plugin-tools/maven-plugin-annotations/3.5/maven-plugin-annotations-3.5.jar
[windows-jdk10] [INFO] Downloading from central: https://repo.maven.apache.org/maven2/org/apache/maven/surefire/surefire-api/2.21.0/surefire-api-2.21.0.jar
[windows-jdk10] [INFO] Downloading from central: https://repo.maven.apache.org/maven2/org/apache/maven/surefire/surefire-booter/2.21.0/surefire-booter-2.21.0.jar
[windows-jdk10] [INFO] Downloading from central: https://repo.maven.apache.org/maven2/org/apache/maven/surefire/surefire-logger-api/2.21.0/surefire-logger-api-2.21.0.jar
[windows-jdk10] [INFO] Downloaded from central: https://repo.maven.apache.org/maven2/org/apache/maven/surefire/surefire-booter/2.21.0/surefire-booter-2.21.0.jar
(273 kB at 7.2 MB/s)
[windows-jdk10] [INFO] Downloading from central: https://repo.maven.apache.org/maven2/junit/junit/4.12/junit-4.12.jar
[windows-jdk10] [INFO] Downloaded from central: https://repo.maven.apache.org/maven2/org/apache/maven/surefire/surefire-api/2.21.0/surefire-api-2.21.0.jar
(185 kB at 4.1 MB/s)
[windows-jdk10] [INFO] Downloading from central: https://repo.maven.apache.org/maven2/org/apache/maven/maven-toolchain/2.2.1/maven-toolchain-2.2.1.jar
[windows-jdk10] [INFO] Downloaded from central: https://repo.maven.apache.org/maven2/org/apache/maven/surefire/maven-surefire-common/2.21.0/maven-surefire-common-2.21.0.jar
(521 kB at 11 MB/s)
[windows-jdk10] [INFO] Downloading from central: https://repo.maven.apache.org/maven2/org/codehaus/plexus/plexus-java/0.9.3/plexus-java-0.9.3.jar
[windows-jdk10] [INFO] Downloaded from central: https://repo.maven.apache.org/maven2/junit/junit/4.12/junit-4.12.jar
(315 kB at 5.3 MB/s)
[windows-jdk10] [INFO] Downloaded from central: https://repo.maven.apache.org/maven2/org/apache/maven/surefire/surefire-logger-api/2.21.0/surefire-logger-api-2.21.0.jar
(13 kB at 184 kB/s)
[windows-jdk10] [INFO] Downloaded from central: https://repo.maven.apache.org/maven2/org/apache/maven/plugin-tools/maven-plugin-annotations/3.5/maven-plugin-annotations-3.5.jar
(14 kB at 186 kB/s)
[windows-jdk10] [INFO] Downloaded from central: https://repo.maven.apache.org/maven2/org/codehaus/plexus/plexus-java/0.9.3/plexus-java-0.9.3.jar
(32 kB at 174 kB/s)
[windows-jdk10] [INFO] Downloaded from central: https://repo.maven.apache.org/maven2/org/apache/maven/maven-toolchain/2.2.1/maven-toolchain-2.2.1.jar
(38 kB at 173 kB/s)
[windows-jdk10] [INFO] 
[windows-jdk10] [INFO] --- maven-jar-plugin:3.0.2:jar (default-jar) @ enforcer-api ---
[windows-jdk10] [INFO] Downloading from central: https://repo.maven.apache.org/maven2/org/apache/maven/shared/maven-shared-utils/3.0.1/maven-shared-utils-3.0.1.jar
[windows-jdk10] [INFO] Downloaded from central: https://repo.maven.apache.org/maven2/org/apache/maven/shared/maven-shared-utils/3.0.1/maven-shared-utils-3.0.1.jar
(154 kB at 8.6 MB/s)
[windows-jdk10] [INFO] Building jar: F:\jenkins\jenkins-slave\workspace\aven-enforcer_MENFORCER-276-ARAEEUQ3DZKGP7LK65FX6C75KHKIJYNAPASQYCZKRS4IVUWL44FA\m\enforcer-api\target\enforcer-api-3.0.0-SNAPSHOT.jar
[windows-jdk10] [INFO] 
[windows-jdk10] [INFO] --- maven-site-plugin:3.7:attach-descriptor (attach-descriptor) @ enforcer-api
---
[windows-jdk10] [INFO] Skipping because packaging 'jar' is not pom.
[windows-jdk10] [INFO] 
[windows-jdk10] [INFO] --- maven-checkstyle-plugin:3.0.0:check (checkstyle-check) @ enforcer-api
---
[windows-jdk10] [INFO] 
[windows-jdk10] [INFO] ------------------------------------------------------------------------
[windows-jdk10] [INFO] Building Apache Maven Enforcer Built-In Rules 3.0.0-SNAPSHOT
[windows-jdk10] [INFO] ------------------------------------------------------------------------
[windows-jdk10] [INFO] Downloading from central: https://repo.maven.apache.org/maven2/org/apache/maven/shared/maven-common-artifact-filters/3.0.1/maven-common-artifact-filters-3.0.1.pom
[windows-jdk10] [INFO] Downloaded from central: https://repo.maven.apache.org/maven2/org/apache/maven/shared/maven-common-artifact-filters/3.0.1/maven-common-artifact-filters-3.0.1.pom
(4.8 kB at 345 kB/s)
[windows-jdk10] [INFO] Downloading from central: https://repo.maven.apache.org/maven2/org/apache/maven/plugin-testing/maven-plugin-testing-harness/2.1/maven-plugin-testing-harness-2.1.pom
[windows-jdk10] [INFO] Downloaded from central: https://repo.maven.apache.org/maven2/org/apache/maven/plugin-testing/maven-plugin-testing-harness/2.1/maven-plugin-testing-harness-2.1.pom
(3.2 kB at 294 kB/s)
[windows-jdk10] [INFO] Downloading from central: https://repo.maven.apache.org/maven2/org/apache/maven/plugin-testing/maven-plugin-testing/2.1/maven-plugin-testing-2.1.pom
[windows-jdk10] [INFO] Downloaded from central: https://repo.maven.apache.org/maven2/org/apache/maven/plugin-testing/maven-plugin-testing/2.1/maven-plugin-testing-2.1.pom
(10 kB at 773 kB/s)
[windows-jdk10] [INFO] Downloading from central: https://repo.maven.apache.org/maven2/commons-codec/commons-codec/1.6/commons-codec-1.6.pom
[windows-jdk10] [INFO] Downloaded from central: https://repo.maven.apache.org/maven2/commons-codec/commons-codec/1.6/commons-codec-1.6.pom
(11 kB at 858 kB/s)
[windows-jdk10] [INFO] Downloading from central: https://repo.maven.apache.org/maven2/org/apache/commons/commons-parent/22/commons-parent-22.pom
[windows-jdk10] [INFO] Downloaded from central: https://repo.maven.apache.org/maven2/org/apache/commons/commons-parent/22/commons-parent-22.pom
(42 kB at 3.0 MB/s)
[windows-jdk10] [INFO] Downloading from central: https://repo.maven.apache.org/maven2/org/mockito/mockito-core/2.18.3/mockito-core-2.18.3.pom
[windows-jdk10] [INFO] Downloaded from central: https://repo.maven.apache.org/maven2/org/mockito/mockito-core/2.18.3/mockito-core-2.18.3.pom
(16 kB at 1.2 MB/s)
[windows-jdk10] [INFO] Downloading from central: https://repo.maven.apache.org/maven2/net/bytebuddy/byte-buddy/1.8.5/byte-buddy-1.8.5.pom
[windows-jdk10] [INFO] Downloaded from central: https://repo.maven.apache.org/maven2/net/bytebuddy/byte-buddy/1.8.5/byte-buddy-1.8.5.pom
(12 kB at 1.0 MB/s)
[windows-jdk10] [INFO] Downloading from central: https://repo.maven.apache.org/maven2/net/bytebuddy/byte-buddy-parent/1.8.5/byte-buddy-parent-1.8.5.pom
[windows-jdk10] [INFO] Downloaded from central: https://repo.maven.apache.org/maven2/net/bytebuddy/byte-buddy-parent/1.8.5/byte-buddy-parent-1.8.5.pom
(27 kB at 2.1 MB/s)
[windows-jdk10] [INFO] Downloading from central: https://repo.maven.apache.org/maven2/net/bytebuddy/byte-buddy-agent/1.8.5/byte-buddy-agent-1.8.5.pom
[windows-jdk10] [INFO] Downloaded from central: https://repo.maven.apache.org/maven2/net/bytebuddy/byte-buddy-agent/1.8.5/byte-buddy-agent-1.8.5.pom
(4.9 kB at 447 kB/s)
[windows-jdk10] [INFO] Downloading from central: https://repo.maven.apache.org/maven2/org/objenesis/objenesis/2.6/objenesis-2.6.pom
[windows-jdk10] [INFO] Downloaded from central: https://repo.maven.apache.org/maven2/org/objenesis/objenesis/2.6/objenesis-2.6.pom
(2.8 kB at 232 kB/s)
[windows-jdk10] [INFO] Downloading from central: https://repo.maven.apache.org/maven2/org/objenesis/objenesis-parent/2.6/objenesis-parent-2.6.pom
[windows-jdk10] [INFO] Downloaded from central: https://repo.maven.apache.org/maven2/org/objenesis/objenesis-parent/2.6/objenesis-parent-2.6.pom
(17 kB at 1.4 MB/s)
[windows-jdk10] [INFO] Downloading from central: https://repo.maven.apache.org/maven2/org/apache/maven/maven-compat/3.0/maven-compat-3.0.pom
[windows-jdk10] [INFO] Downloaded from central: https://repo.maven.apache.org/maven2/org/apache/maven/maven-compat/3.0/maven-compat-3.0.pom
(4.0 kB at 366 kB/s)
[windows-jdk10] [INFO] Downloading from central: https://repo.maven.apache.org/maven2/org/apache/maven/wagon/wagon-provider-api/1.0-beta-6/wagon-provider-api-1.0-beta-6.pom
[windows-jdk10] [INFO] Downloaded from central: https://repo.maven.apache.org/maven2/org/apache/maven/wagon/wagon-provider-api/1.0-beta-6/wagon-provider-api-1.0-beta-6.pom
(1.8 kB at 160 kB/s)
[windows-jdk10] [INFO] Downloading from central: https://repo.maven.apache.org/maven2/org/apache/maven/wagon/wagon/1.0-beta-6/wagon-1.0-beta-6.pom
[windows-jdk10] [INFO] Downloaded from central: https://repo.maven.apache.org/maven2/org/apache/maven/wagon/wagon/1.0-beta-6/wagon-1.0-beta-6.pom
(12 kB at 1.0 MB/s)
[windows-jdk10] [INFO] Downloading from central: https://repo.maven.apache.org/maven2/org/assertj/assertj-core/1.7.1/assertj-core-1.7.1.pom
[windows-jdk10] [INFO] Downloaded from central: https://repo.maven.apache.org/maven2/org/assertj/assertj-core/1.7.1/assertj-core-1.7.1.pom
(4.7 kB at 360 kB/s)
[windows-jdk10] [INFO] Downloading from central: https://repo.maven.apache.org/maven2/org/assertj/assertj-parent-pom/1.2.6/assertj-parent-pom-1.2.6.pom
[windows-jdk10] [INFO] Downloaded from central: https://repo.maven.apache.org/maven2/org/assertj/assertj-parent-pom/1.2.6/assertj-parent-pom-1.2.6.pom
(13 kB at 1.1 MB/s)
[windows-jdk10] [INFO] Downloading from central: https://repo.maven.apache.org/maven2/org/apache/maven/shared/maven-common-artifact-filters/3.0.1/maven-common-artifact-filters-3.0.1.jar
[windows-jdk10] [INFO] Downloading from central: https://repo.maven.apache.org/maven2/commons-codec/commons-codec/1.6/commons-codec-1.6.jar
[windows-jdk10] [INFO] Downloading from central: https://repo.maven.apache.org/maven2/org/apache/commons/commons-lang3/3.5/commons-lang3-3.5.jar
[windows-jdk10] [INFO] Downloading from central: https://repo.maven.apache.org/maven2/org/mockito/mockito-core/2.18.3/mockito-core-2.18.3.jar
[windows-jdk10] [INFO] Downloading from central: https://repo.maven.apache.org/maven2/org/apache/maven/plugin-testing/maven-plugin-testing-harness/2.1/maven-plugin-testing-harness-2.1.jar
[windows-jdk10] [INFO] Downloaded from central: https://repo.maven.apache.org/maven2/org/apache/maven/shared/maven-common-artifact-filters/3.0.1/maven-common-artifact-filters-3.0.1.jar
(61 kB at 2.5 MB/s)
[windows-jdk10] [INFO] Downloading from central: https://repo.maven.apache.org/maven2/net/bytebuddy/byte-buddy/1.8.5/byte-buddy-1.8.5.jar
[windows-jdk10] [INFO] Downloaded from central: https://repo.maven.apache.org/maven2/org/mockito/mockito-core/2.18.3/mockito-core-2.18.3.jar
(556 kB at 7.3 MB/s)
[windows-jdk10] [INFO] Downloading from central: https://repo.maven.apache.org/maven2/net/bytebuddy/byte-buddy-agent/1.8.5/byte-buddy-agent-1.8.5.jar
[windows-jdk10] [INFO] Downloaded from central: https://repo.maven.apache.org/maven2/commons-codec/commons-codec/1.6/commons-codec-1.6.jar
(233 kB at 3.0 MB/s)
[windows-jdk10] [INFO] Downloading from central: https://repo.maven.apache.org/maven2/org/objenesis/objenesis/2.6/objenesis-2.6.jar
[windows-jdk10] [INFO] Downloaded from central: https://repo.maven.apache.org/maven2/org/apache/commons/commons-lang3/3.5/commons-lang3-3.5.jar
(480 kB at 5.6 MB/s)
[windows-jdk10] [INFO] Downloading from central: https://repo.maven.apache.org/maven2/org/apache/maven/maven-compat/3.0/maven-compat-3.0.jar
[windows-jdk10] [INFO] Downloaded from central: https://repo.maven.apache.org/maven2/org/apache/maven/maven-compat/3.0/maven-compat-3.0.jar
(285 kB at 2.4 MB/s)
[windows-jdk10] [INFO] Downloading from central: https://repo.maven.apache.org/maven2/org/apache/maven/wagon/wagon-provider-api/1.0-beta-6/wagon-provider-api-1.0-beta-6.jar
[windows-jdk10] [INFO] Downloaded from central: https://repo.maven.apache.org/maven2/net/bytebuddy/byte-buddy/1.8.5/byte-buddy-1.8.5.jar
(3.0 MB at 26 MB/s)
[windows-jdk10] [INFO] Downloading from central: https://repo.maven.apache.org/maven2/org/assertj/assertj-core/1.7.1/assertj-core-1.7.1.jar
[windows-jdk10] [INFO] Downloaded from central: https://repo.maven.apache.org/maven2/org/apache/maven/wagon/wagon-provider-api/1.0-beta-6/wagon-provider-api-1.0-beta-6.jar
(53 kB at 362 kB/s)
[windows-jdk10] [INFO] Downloaded from central: https://repo.maven.apache.org/maven2/org/objenesis/objenesis/2.6/objenesis-2.6.jar
(56 kB at 374 kB/s)
[windows-jdk10] [INFO] Downloaded from central: https://repo.maven.apache.org/maven2/org/apache/maven/plugin-testing/maven-plugin-testing-harness/2.1/maven-plugin-testing-harness-2.1.jar
(39 kB at 248 kB/s)
[windows-jdk10] [INFO] Downloaded from central: https://repo.maven.apache.org/maven2/org/assertj/assertj-core/1.7.1/assertj-core-1.7.1.jar
(619 kB at 3.7 MB/s)
[windows-jdk10] [INFO] Downloaded from central: https://repo.maven.apache.org/maven2/net/bytebuddy/byte-buddy-agent/1.8.5/byte-buddy-agent-1.8.5.jar
(40 kB at 148 kB/s)
[windows-jdk10] [INFO] 
[windows-jdk10] [INFO] --- maven-clean-plugin:3.0.0:clean (default-clean) @ enforcer-rules
---
[windows-jdk10] [INFO] 
[windows-jdk10] [INFO] --- maven-enforcer-plugin:1.4.1:enforce (enforce-maven-version) @ enforcer-rules
---
[windows-jdk10] [INFO] 
[windows-jdk10] [INFO] --- maven-enforcer-plugin:1.4.1:enforce (enforce-bytecode-version)
@ enforcer-rules ---
[windows-jdk10] [INFO] 
[windows-jdk10] [INFO] --- maven-enforcer-plugin:1.4.1:enforce (ban-known-bad-maven-versions)
@ enforcer-rules ---
[windows-jdk10] [INFO] 
[windows-jdk10] [INFO] --- apache-rat-plugin:0.12:check (rat-check) @ enforcer-rules ---
[windows-jdk10] [INFO] Enabled default license matchers.
[windows-jdk10] [INFO] Will parse SCM ignores for exclusions...
[windows-jdk10] [INFO] Finished adding exclusions from SCM ignore files.
[windows-jdk10] [INFO] 61 implicit excludes (use -debug for more details).
[windows-jdk10] [INFO] Exclude: .repository/**
[windows-jdk10] [INFO] Exclude: .maven/spy.log
[windows-jdk10] [INFO] Exclude: dependency-reduced-pom.xml
[windows-jdk10] [INFO] Exclude: .java-version
[windows-jdk10] [INFO] 130 resources included (use -debug for more details)
[windows-jdk10] [INFO] Rat check: Summary over all files. Unapproved: 0, unknown: 0, generated:
0, approved: 124 licenses.
[windows-jdk10] [INFO] 
[windows-jdk10] [INFO] --- maven-remote-resources-plugin:1.5:process (process-resource-bundles)
@ enforcer-rules ---
[windows-jdk10] [INFO] 
[windows-jdk10] [INFO] --- maven-resources-plugin:3.0.2:resources (default-resources) @ enforcer-rules
---
[windows-jdk10] [INFO] Using 'UTF-8' encoding to copy filtered resources.
[windows-jdk10] [INFO] skip non existing resourceDirectory F:\jenkins\jenkins-slave\workspace\aven-enforcer_MENFORCER-276-ARAEEUQ3DZKGP7LK65FX6C75KHKIJYNAPASQYCZKRS4IVUWL44FA\m\enforcer-rules\src\main\resources
[windows-jdk10] [INFO] Copying 3 resources
[windows-jdk10] [INFO] 
[windows-jdk10] [INFO] --- maven-compiler-plugin:3.7.0:compile (default-compile) @ enforcer-rules
---
[windows-jdk10] [INFO] Changes detected - recompiling the module!
[windows-jdk10] [INFO] Compiling 43 source files to F:\jenkins\jenkins-slave\workspace\aven-enforcer_MENFORCER-276-ARAEEUQ3DZKGP7LK65FX6C75KHKIJYNAPASQYCZKRS4IVUWL44FA\m\enforcer-rules\target\classes
[windows-jdk10] [INFO] /F:/jenkins/jenkins-slave/workspace/aven-enforcer_MENFORCER-276-ARAEEUQ3DZKGP7LK65FX6C75KHKIJYNAPASQYCZKRS4IVUWL44FA/m/enforcer-rules/src/main/java/org/apache/maven/plugins/enforcer/RequirePluginVersions.java:
Some input files use or override a deprecated API.
[windows-jdk10] [INFO] /F:/jenkins/jenkins-slave/workspace/aven-enforcer_MENFORCER-276-ARAEEUQ3DZKGP7LK65FX6C75KHKIJYNAPASQYCZKRS4IVUWL44FA/m/enforcer-rules/src/main/java/org/apache/maven/plugins/enforcer/RequirePluginVersions.java:
Recompile with -Xlint:deprecation for details.
[windows-jdk10] [INFO] /F:/jenkins/jenkins-slave/workspace/aven-enforcer_MENFORCER-276-ARAEEUQ3DZKGP7LK65FX6C75KHKIJYNAPASQYCZKRS4IVUWL44FA/m/enforcer-rules/src/main/java/org/apache/maven/plugins/enforcer/RequirePluginVersions.java:
F:\jenkins\jenkins-slave\workspace\aven-enforcer_MENFORCER-276-ARAEEUQ3DZKGP7LK65FX6C75KHKIJYNAPASQYCZKRS4IVUWL44FA\m\enforcer-rules\src\main\java\org\apache\maven\plugins\enforcer\RequirePluginVersions.java
uses unchecked or unsafe operations.
[windows-jdk10] [INFO] /F:/jenkins/jenkins-slave/workspace/aven-enforcer_MENFORCER-276-ARAEEUQ3DZKGP7LK65FX6C75KHKIJYNAPASQYCZKRS4IVUWL44FA/m/enforcer-rules/src/main/java/org/apache/maven/plugins/enforcer/RequirePluginVersions.java:
Recompile with -Xlint:unchecked for details.
[windows-jdk10] [INFO] 
[windows-jdk10] [INFO] --- maven-resources-plugin:3.0.2:testResources (default-testResources)
@ enforcer-rules ---
[windows-jdk10] [INFO] Using 'UTF-8' encoding to copy filtered resources.
[windows-jdk10] [INFO] Copying 11 resources
[windows-jdk10] [INFO] Copying 3 resources
[windows-jdk10] [INFO] 
[windows-jdk10] [INFO] --- maven-compiler-plugin:3.7.0:testCompile (default-testCompile) @
enforcer-rules ---
[windows-jdk10] [INFO] Changes detected - recompiling the module!
[windows-jdk10] [INFO] Compiling 35 source files to F:\jenkins\jenkins-slave\workspace\aven-enforcer_MENFORCER-276-ARAEEUQ3DZKGP7LK65FX6C75KHKIJYNAPASQYCZKRS4IVUWL44FA\m\enforcer-rules\target\test-classes
[windows-jdk10] [INFO] /F:/jenkins/jenkins-slave/workspace/aven-enforcer_MENFORCER-276-ARAEEUQ3DZKGP7LK65FX6C75KHKIJYNAPASQYCZKRS4IVUWL44FA/m/enforcer-rules/src/test/java/org/apache/maven/plugins/enforcer/TestRequireUpperBoundDeps.java:
Some input files use or override a deprecated API.
[windows-jdk10] [INFO] /F:/jenkins/jenkins-slave/workspace/aven-enforcer_MENFORCER-276-ARAEEUQ3DZKGP7LK65FX6C75KHKIJYNAPASQYCZKRS4IVUWL44FA/m/enforcer-rules/src/test/java/org/apache/maven/plugins/enforcer/TestRequireUpperBoundDeps.java:
Recompile with -Xlint:deprecation for details.
[windows-jdk10] [INFO] /F:/jenkins/jenkins-slave/workspace/aven-enforcer_MENFORCER-276-ARAEEUQ3DZKGP7LK65FX6C75KHKIJYNAPASQYCZKRS4IVUWL44FA/m/enforcer-rules/src/test/java/org/apache/maven/plugins/enforcer/MockPlexusContainer.java:
Some input files use unchecked or unsafe operations.
[windows-jdk10] [INFO] /F:/jenkins/jenkins-slave/workspace/aven-enforcer_MENFORCER-276-ARAEEUQ3DZKGP7LK65FX6C75KHKIJYNAPASQYCZKRS4IVUWL44FA/m/enforcer-rules/src/test/java/org/apache/maven/plugins/enforcer/MockPlexusContainer.java:
Recompile with -Xlint:unchecked for details.
[windows-jdk10] [INFO] -------------------------------------------------------------
[windows-jdk10] [ERROR] COMPILATION ERROR : 
[windows-jdk10] [INFO] -------------------------------------------------------------
[windows-jdk10] [ERROR] /F:/jenkins/jenkins-slave/workspace/aven-enforcer_MENFORCER-276-ARAEEUQ3DZKGP7LK65FX6C75KHKIJYNAPASQYCZKRS4IVUWL44FA/m/enforcer-rules/src/test/java/org/apache/maven/plugins/enforcer/TestRequireUpperBoundDeps.java:[14,47]
cannot find symbol
[windows-jdk10]   symbol:   class TestEnforcerRuleUtils
[windows-jdk10]   location: package org.apache.maven.plugins.enforcer.utils
[windows-jdk10] [ERROR] /F:/jenkins/jenkins-slave/workspace/aven-enforcer_MENFORCER-276-ARAEEUQ3DZKGP7LK65FX6C75KHKIJYNAPASQYCZKRS4IVUWL44FA/m/enforcer-rules/src/test/java/org/apache/maven/plugins/enforcer/TestRequireUpperBoundDeps.java:[87,9]
cannot find symbol
[windows-jdk10]   symbol:   variable TestEnforcerRuleUtils
[windows-jdk10]   location: class org.apache.maven.plugins.enforcer.TestRequireUpperBoundDeps
[windows-jdk10] [ERROR] /F:/jenkins/jenkins-slave/workspace/aven-enforcer_MENFORCER-276-ARAEEUQ3DZKGP7LK65FX6C75KHKIJYNAPASQYCZKRS4IVUWL44FA/m/enforcer-rules/src/test/java/org/apache/maven/plugins/enforcer/TestRequireUpperBoundDeps.java:[97,9]
cannot find symbol
[windows-jdk10]   symbol:   variable TestEnforcerRuleUtils
[windows-jdk10]   location: class org.apache.maven.plugins.enforcer.TestRequireUpperBoundDeps
[windows-jdk10] [ERROR] /F:/jenkins/jenkins-slave/workspace/aven-enforcer_MENFORCER-276-ARAEEUQ3DZKGP7LK65FX6C75KHKIJYNAPASQYCZKRS4IVUWL44FA/m/enforcer-rules/src/test/java/org/apache/maven/plugins/enforcer/TestRequireUpperBoundDeps.java:[107,9]
cannot find symbol
[windows-jdk10]   symbol:   variable TestEnforcerRuleUtils
[windows-jdk10]   location: class org.apache.maven.plugins.enforcer.TestRequireUpperBoundDeps
[windows-jdk10] [ERROR] /F:/jenkins/jenkins-slave/workspace/aven-enforcer_MENFORCER-276-ARAEEUQ3DZKGP7LK65FX6C75KHKIJYNAPASQYCZKRS4IVUWL44FA/m/enforcer-rules/src/test/java/org/apache/maven/plugins/enforcer/TestRequireUpperBoundDeps.java:[118,9]
cannot find symbol
[windows-jdk10]   symbol:   variable TestEnforcerRuleUtils
[windows-jdk10]   location: class org.apache.maven.plugins.enforcer.TestRequireUpperBoundDeps
[windows-jdk10] [INFO] 5 errors 
[windows-jdk10] [INFO] -------------------------------------------------------------
[windows-jdk10] [INFO] ------------------------------------------------------------------------
[windows-jdk10] [INFO] Reactor Summary:
[windows-jdk10] [INFO] 
[windows-jdk10] [INFO] Apache Maven Enforcer .............................. SUCCESS [ 23.348
s]
[windows-jdk10] [INFO] Apache Maven Enforcer API .......................... SUCCESS [  4.250
s]
[windows-jdk10] [INFO] Apache Maven Enforcer Built-In Rules ............... FAILURE [  3.376
s]
[windows-jdk10] [INFO] Apache Maven Enforcer Plugin ....................... SKIPPED
[windows-jdk10] [INFO] ------------------------------------------------------------------------
[windows-jdk10] [INFO] BUILD FAILURE
[windows-jdk10] [INFO] ------------------------------------------------------------------------
[windows-jdk10] [INFO] Total time: 31.747 s
[windows-jdk10] [INFO] Finished at: 2018-09-14T05:33:44Z
[windows-jdk10] [INFO] Final Memory: 39M/137M
[windows-jdk10] [INFO] ------------------------------------------------------------------------
[windows-jdk10] [INFO] [jenkins-event-spy] Generated F:\jenkins\jenkins-slave\workspace\aven-enforcer_MENFORCER-276-ARAEEUQ3DZKGP7LK65FX6C75KHKIJYNAPASQYCZKRS4IVUWL44FA@tmp\withMaven7ce50041\maven-spy-20180914-053312-60211090064814451204636.log
[windows-jdk10] [ERROR] Failed to execute goal org.apache.maven.plugins:maven-compiler-plugin:3.7.0:testCompile
(default-testCompile) on project enforcer-rules: Compilation failure: Compilation failure:

[windows-jdk10] [ERROR] /F:/jenkins/jenkins-slave/workspace/aven-enforcer_MENFORCER-276-ARAEEUQ3DZKGP7LK65FX6C75KHKIJYNAPASQYCZKRS4IVUWL44FA/m/enforcer-rules/src/test/java/org/apache/maven/plugins/enforcer/TestRequireUpperBoundDeps.java:[14,47]
cannot find symbol
[windows-jdk10] [ERROR]   symbol:   class TestEnforcerRuleUtils
[windows-jdk10] [ERROR]   location: package org.apache.maven.plugins.enforcer.utils
[windows-jdk10] [ERROR] /F:/jenkins/jenkins-slave/workspace/aven-enforcer_MENFORCER-276-ARAEEUQ3DZKGP7LK65FX6C75KHKIJYNAPASQYCZKRS4IVUWL44FA/m/enforcer-rules/src/test/java/org/apache/maven/plugins/enforcer/TestRequireUpperBoundDeps.java:[87,9]
cannot find symbol
[windows-jdk10] [ERROR]   symbol:   variable TestEnforcerRuleUtils
[windows-jdk10] [ERROR]   location: class org.apache.maven.plugins.enforcer.TestRequireUpperBoundDeps
[windows-jdk10] [ERROR] /F:/jenkins/jenkins-slave/workspace/aven-enforcer_MENFORCER-276-ARAEEUQ3DZKGP7LK65FX6C75KHKIJYNAPASQYCZKRS4IVUWL44FA/m/enforcer-rules/src/test/java/org/apache/maven/plugins/enforcer/TestRequireUpperBoundDeps.java:[97,9]
cannot find symbol
[windows-jdk10] [ERROR]   symbol:   variable TestEnforcerRuleUtils
[windows-jdk10] [ERROR]   location: class org.apache.maven.plugins.enforcer.TestRequireUpperBoundDeps
[windows-jdk10] [ERROR] /F:/jenkins/jenkins-slave/workspace/aven-enforcer_MENFORCER-276-ARAEEUQ3DZKGP7LK65FX6C75KHKIJYNAPASQYCZKRS4IVUWL44FA/m/enforcer-rules/src/test/java/org/apache/maven/plugins/enforcer/TestRequireUpperBoundDeps.java:[107,9]
cannot find symbol
[windows-jdk10] [ERROR]   symbol:   variable TestEnforcerRuleUtils
[windows-jdk10] [ERROR]   location: class org.apache.maven.plugins.enforcer.TestRequireUpperBoundDeps
[windows-jdk10] [ERROR] /F:/jenkins/jenkins-slave/workspace/aven-enforcer_MENFORCER-276-ARAEEUQ3DZKGP7LK65FX6C75KHKIJYNAPASQYCZKRS4IVUWL44FA/m/enforcer-rules/src/test/java/org/apache/maven/plugins/enforcer/TestRequireUpperBoundDeps.java:[118,9]
cannot find symbol
[windows-jdk10] [ERROR]   symbol:   variable TestEnforcerRuleUtils
[windows-jdk10] [ERROR]   location: class org.apache.maven.plugins.enforcer.TestRequireUpperBoundDeps
[windows-jdk10] [ERROR] -> [Help 1]
[windows-jdk10] [ERROR] 
[windows-jdk10] [ERROR] To see the full stack trace of the errors, re-run Maven with the -e
switch.
[windows-jdk10] [ERROR] Re-run Maven using the -X switch to enable full debug logging.
[windows-jdk10] [ERROR] 
[windows-jdk10] [ERROR] For more information about the errors and possible solutions, please
read the following articles:
[windows-jdk10] [ERROR] [Help 1] http://cwiki.apache.org/confluence/display/MAVEN/MojoFailureException
[windows-jdk10] [ERROR] 
[windows-jdk10] [ERROR] After correcting the problems, you can resume the build with the command
[windows-jdk10] [ERROR]   mvn <goals> -rf :enforcer-rules
[Pipeline] [windows-jdk10] }
[Pipeline] [windows-jdk10] // dir
[Pipeline] [windows-jdk10] }
[windows-jdk10] [withMaven] junitPublisher - Archive test results for Maven artifact org.apache.maven.enforcer:enforcer-api:3.0.0-SNAPSHOT
generated by maven-surefire-plugin:test (default-test): m\enforcer-api\target\surefire-reports\*.xml
[windows-jdk10] Recording test results
[windows-jdk10] None of the test reports contained any result
[Pipeline] [windows-jdk10] // withMaven
[Pipeline] [windows-jdk10] cleanWs
[windows-jdk10] [WS-CLEANUP] Deleting project workspace...[WS-CLEANUP] done
[Pipeline] [windows-jdk10] cleanWs
[windows-jdk10] [WS-CLEANUP] Deleting project workspace...[WS-CLEANUP] done
[Pipeline] [windows-jdk10] }
[Pipeline] [windows-jdk10] // stage
[Pipeline] [windows-jdk10] }
[Pipeline] [windows-jdk10] // node
[Pipeline] [windows-jdk10] }
[windows-jdk10] Failed in branch windows-jdk10
[Pipeline] // parallel
[Pipeline] stage
[Pipeline] { (Notifications)
[Pipeline] echo
Build result: FAILURE
[Pipeline] jiraIssueSelector
[Pipeline] emailext
Mime
  • Unnamed multipart/mixed (inline, None, 0 bytes)
View raw message