maven-notifications mailing list archives

Site index · List index
Message view « Date » · « Thread »
Top « Date » · « Thread »
From Apache Jenkins Server <jenk...@builds.apache.org>
Subject Build failed in Jenkins: Maven TLP » maven-wagon » master #36
Date Sat, 08 Sep 2018 11:26:52 GMT
See https://builds.apache.org/job/maven-box/job/maven-wagon/job/master/36/

Changes:

* [WAGON-531] Add default TTL for HTTP connections
* [WAGON-531] Add default TTL for HTTP connections
* [WAGON-531] Add default TTL for HTTP connections
* [WAGON-531] Add default TTL for HTTP connections
* [WAGON-531] Add default TTL for HTTP connections
* [WAGON-531] Add default TTL for HTTP connections
* [WAGON-531] Add default TTL for HTTP connections
* [WAGON-531] Add default TTL for HTTP connections

38 tests failed.
FAILED:  org.apache.maven.wagon.providers.scm.ScmGitExeWagonTest.testWagonPutDirectory

Error Message:
Error interacting with SCM: Unable to commit file. The git-commit command failed. 
*** Please tell me who you are.

Run

  git config --global user.email "you@example.com"
  git config --global user.name "Your Name"

to set your account's default identity.
Omit --global to set the identity only in this repository.

fatal:********@asf921.gq1.ygridcore.net>) not allowed


Stack Trace:
org.apache.maven.wagon.TransferFailedException: 
Error interacting with SCM: Unable to commit file. The git-commit command failed. 
*** Please tell me who you are.

Run

  git config --global user.email "you@example.com"
  git config --global user.name "Your Name"

to set your account's default identity.
Omit --global to set the identity only in this repository.

fatal:********@asf921.gq1.ygridcore.net>) not allowed

Caused by: org.apache.maven.scm.ScmException: 
Unable to commit file. The git-commit command failed. 
*** Please tell me who you are.

Run

  git config --global user.email "you@example.com"
  git config --global user.name "Your Name"

to set your account's default identity.
Omit --global to set the identity only in this repository.

fatal:********@asf921.gq1.ygridcore.net>) not allowed



FAILED:  org.apache.maven.wagon.providers.scm.ScmGitExeWagonTest.testWagonPutDirectoryDeepDestination

Error Message:
Error interacting with SCM: Unable to commit file. The git-commit command failed. 
*** Please tell me who you are.

Run

  git config --global user.email "you@example.com"
  git config --global user.name "Your Name"

to set your account's default identity.
Omit --global to set the identity only in this repository.

fatal:********@asf921.gq1.ygridcore.net>) not allowed


Stack Trace:
org.apache.maven.wagon.TransferFailedException: 
Error interacting with SCM: Unable to commit file. The git-commit command failed. 
*** Please tell me who you are.

Run

  git config --global user.email "you@example.com"
  git config --global user.name "Your Name"

to set your account's default identity.
Omit --global to set the identity only in this repository.

fatal:********@asf921.gq1.ygridcore.net>) not allowed

Caused by: org.apache.maven.scm.ScmException: 
Unable to commit file. The git-commit command failed. 
*** Please tell me who you are.

Run

  git config --global user.email "you@example.com"
  git config --global user.name "Your Name"

to set your account's default identity.
Omit --global to set the identity only in this repository.

fatal:********@asf921.gq1.ygridcore.net>) not allowed



FAILED:  org.apache.maven.wagon.providers.scm.ScmGitExeWagonTest.testWagon

Error Message:

  Unexpected method call TransferListener.transferError(TransferEvent[PUT|ERROR|Repository[scm:git:file:///home/jenkins/jenkins-slave/workspace/aven-box_maven-wagon_master-XZVDTOWPBGAU5B2ZTHNA6F4MQMMNHGQARGBUDFHBYYQHQ7B4WPHA/m/wagon-providers/wagon-scm/target/test-classes/test-repo-git-test/]|null|test-resource[len = 18; mod = 1536405749000]]):
    TransferListener.transferCompleted(TransferEvent[PUT|COMPLETED|Repository[scm:git:file:///home/jenkins/jenkins-slave/workspace/aven-box_maven-wagon_master-XZVDTOWPBGAU5B2ZTHNA6F4MQMMNHGQARGBUDFHBYYQHQ7B4WPHA/m/wagon-providers/wagon-scm/target/test-classes/test-repo-git-test/]|/home/jenkins/jenkins-slave/workspace/aven-box_maven-wagon_master-XZVDTOWPBGAU5B2ZTHNA6F4MQMMNHGQARGBUDFHBYYQHQ7B4WPHA/m/wagon-providers/wagon-scm/target/test-output/test-resource|test-resource[len = 18; mod = 1536405749000]]): expected: 1, actual: 0

Stack Trace:
java.lang.AssertionError: 

  Unexpected method call TransferListener.transferError(TransferEvent[PUT|ERROR|Repository[scm:git:file:///home/jenkins/jenkins-slave/workspace/aven-box_maven-wagon_master-XZVDTOWPBGAU5B2ZTHNA6F4MQMMNHGQARGBUDFHBYYQHQ7B4WPHA/m/wagon-providers/wagon-scm/target/test-classes/test-repo-git-test/]|null|test-resource[len = 18; mod = 1536405749000]]):
    TransferListener.transferCompleted(TransferEvent[PUT|COMPLETED|Repository[scm:git:file:///home/jenkins/jenkins-slave/workspace/aven-box_maven-wagon_master-XZVDTOWPBGAU5B2ZTHNA6F4MQMMNHGQARGBUDFHBYYQHQ7B4WPHA/m/wagon-providers/wagon-scm/target/test-classes/test-repo-git-test/]|/home/jenkins/jenkins-slave/workspace/aven-box_maven-wagon_master-XZVDTOWPBGAU5B2ZTHNA6F4MQMMNHGQARGBUDFHBYYQHQ7B4WPHA/m/wagon-providers/wagon-scm/target/test-output/test-resource|test-resource[len = 18; mod = 1536405749000]]): expected: 1, actual: 0


FAILED:  org.apache.maven.wagon.providers.scm.ScmGitExeWagonTest.testWagonPutDirectoryForDot

Error Message:
Error interacting with SCM: Unable to commit file. The git-commit command failed. 
*** Please tell me who you are.

Run

  git config --global user.email "you@example.com"
  git config --global user.name "Your Name"

to set your account's default identity.
Omit --global to set the identity only in this repository.

fatal:********@asf921.gq1.ygridcore.net>) not allowed


Stack Trace:
org.apache.maven.wagon.TransferFailedException: 
Error interacting with SCM: Unable to commit file. The git-commit command failed. 
*** Please tell me who you are.

Run

  git config --global user.email "you@example.com"
  git config --global user.name "Your Name"

to set your account's default identity.
Omit --global to set the identity only in this repository.

fatal:********@asf921.gq1.ygridcore.net>) not allowed

Caused by: org.apache.maven.scm.ScmException: 
Unable to commit file. The git-commit command failed. 
*** Please tell me who you are.

Run

  git config --global user.email "you@example.com"
  git config --global user.name "Your Name"

to set your account's default identity.
Omit --global to set the identity only in this repository.

fatal:********@asf921.gq1.ygridcore.net>) not allowed



FAILED:  org.apache.maven.wagon.providers.scm.ScmGitExeWagonTest.testWagonPutDirectoryWhenDirectoryAlreadyExists

Error Message:
Error interacting with SCM: Unable to commit file. The git-commit command failed. 
*** Please tell me who you are.

Run

  git config --global user.email "you@example.com"
  git config --global user.name "Your Name"

to set your account's default identity.
Omit --global to set the identity only in this repository.

fatal:********@asf921.gq1.ygridcore.net>) not allowed


Stack Trace:
org.apache.maven.wagon.TransferFailedException: 
Error interacting with SCM: Unable to commit file. The git-commit command failed. 
*** Please tell me who you are.

Run

  git config --global user.email "you@example.com"
  git config --global user.name "Your Name"

to set your account's default identity.
Omit --global to set the identity only in this repository.

fatal:********@asf921.gq1.ygridcore.net>) not allowed

Caused by: org.apache.maven.scm.ScmException: 
Unable to commit file. The git-commit command failed. 
*** Please tell me who you are.

Run

  git config --global user.email "you@example.com"
  git config --global user.name "Your Name"

to set your account's default identity.
Omit --global to set the identity only in this repository.

fatal:********@asf921.gq1.ygridcore.net>) not allowed



FAILED:  org.apache.maven.wagon.providers.scm.ScmGitExeWagonTest.testWagonPutDirectory

Error Message:
Error interacting with SCM: Unable to commit file. The git-commit command failed. 
*** Please tell me who you are.

Run

  git config --global user.email "you@example.com"
  git config --global user.name "Your Name"

to set your account's default identity.
Omit --global to set the identity only in this repository.

fatal:********@asf929.gq1.ygridcore.net>) not allowed


Stack Trace:
org.apache.maven.wagon.TransferFailedException: 
Error interacting with SCM: Unable to commit file. The git-commit command failed. 
*** Please tell me who you are.

Run

  git config --global user.email "you@example.com"
  git config --global user.name "Your Name"

to set your account's default identity.
Omit --global to set the identity only in this repository.

fatal:********@asf929.gq1.ygridcore.net>) not allowed

Caused by: org.apache.maven.scm.ScmException: 
Unable to commit file. The git-commit command failed. 
*** Please tell me who you are.

Run

  git config --global user.email "you@example.com"
  git config --global user.name "Your Name"

to set your account's default identity.
Omit --global to set the identity only in this repository.

fatal:********@asf929.gq1.ygridcore.net>) not allowed



FAILED:  org.apache.maven.wagon.providers.scm.ScmGitExeWagonTest.testWagonPutDirectoryDeepDestination

Error Message:
Error interacting with SCM: Unable to commit file. The git-commit command failed. 
*** Please tell me who you are.

Run

  git config --global user.email "you@example.com"
  git config --global user.name "Your Name"

to set your account's default identity.
Omit --global to set the identity only in this repository.

fatal:********@asf929.gq1.ygridcore.net>) not allowed


Stack Trace:
org.apache.maven.wagon.TransferFailedException: 
Error interacting with SCM: Unable to commit file. The git-commit command failed. 
*** Please tell me who you are.

Run

  git config --global user.email "you@example.com"
  git config --global user.name "Your Name"

to set your account's default identity.
Omit --global to set the identity only in this repository.

fatal:********@asf929.gq1.ygridcore.net>) not allowed

Caused by: org.apache.maven.scm.ScmException: 
Unable to commit file. The git-commit command failed. 
*** Please tell me who you are.

Run

  git config --global user.email "you@example.com"
  git config --global user.name "Your Name"

to set your account's default identity.
Omit --global to set the identity only in this repository.

fatal:********@asf929.gq1.ygridcore.net>) not allowed



FAILED:  org.apache.maven.wagon.providers.scm.ScmGitExeWagonTest.testWagon

Error Message:

  Unexpected method call TransferListener.transferError(TransferEvent[PUT|ERROR|Repository[scm:git:file:///home/jenkins/jenkins-slave/workspace/aven-box_maven-wagon_master-XZVDTOWPBGAU5B2ZTHNA6F4MQMMNHGQARGBUDFHBYYQHQ7B4WPHA/m/wagon-providers/wagon-scm/target/test-classes/test-repo-git-test/]|null|test-resource[len = 18; mod = 1536405746000]]):
    TransferListener.transferCompleted(TransferEvent[PUT|COMPLETED|Repository[scm:git:file:///home/jenkins/jenkins-slave/workspace/aven-box_maven-wagon_master-XZVDTOWPBGAU5B2ZTHNA6F4MQMMNHGQARGBUDFHBYYQHQ7B4WPHA/m/wagon-providers/wagon-scm/target/test-classes/test-repo-git-test/]|/home/jenkins/jenkins-slave/workspace/aven-box_maven-wagon_master-XZVDTOWPBGAU5B2ZTHNA6F4MQMMNHGQARGBUDFHBYYQHQ7B4WPHA/m/wagon-providers/wagon-scm/target/test-output/test-resource|test-resource[len = 18; mod = 1536405746000]]): expected: 1, actual: 0

Stack Trace:
java.lang.AssertionError: 

  Unexpected method call TransferListener.transferError(TransferEvent[PUT|ERROR|Repository[scm:git:file:///home/jenkins/jenkins-slave/workspace/aven-box_maven-wagon_master-XZVDTOWPBGAU5B2ZTHNA6F4MQMMNHGQARGBUDFHBYYQHQ7B4WPHA/m/wagon-providers/wagon-scm/target/test-classes/test-repo-git-test/]|null|test-resource[len = 18; mod = 1536405746000]]):
    TransferListener.transferCompleted(TransferEvent[PUT|COMPLETED|Repository[scm:git:file:///home/jenkins/jenkins-slave/workspace/aven-box_maven-wagon_master-XZVDTOWPBGAU5B2ZTHNA6F4MQMMNHGQARGBUDFHBYYQHQ7B4WPHA/m/wagon-providers/wagon-scm/target/test-classes/test-repo-git-test/]|/home/jenkins/jenkins-slave/workspace/aven-box_maven-wagon_master-XZVDTOWPBGAU5B2ZTHNA6F4MQMMNHGQARGBUDFHBYYQHQ7B4WPHA/m/wagon-providers/wagon-scm/target/test-output/test-resource|test-resource[len = 18; mod = 1536405746000]]): expected: 1, actual: 0


FAILED:  org.apache.maven.wagon.providers.scm.ScmGitExeWagonTest.testWagonPutDirectoryForDot

Error Message:
Error interacting with SCM: Unable to commit file. The git-commit command failed. 
*** Please tell me who you are.

Run

  git config --global user.email "you@example.com"
  git config --global user.name "Your Name"

to set your account's default identity.
Omit --global to set the identity only in this repository.

fatal:********@asf929.gq1.ygridcore.net>) not allowed


Stack Trace:
org.apache.maven.wagon.TransferFailedException: 
Error interacting with SCM: Unable to commit file. The git-commit command failed. 
*** Please tell me who you are.

Run

  git config --global user.email "you@example.com"
  git config --global user.name "Your Name"

to set your account's default identity.
Omit --global to set the identity only in this repository.

fatal:********@asf929.gq1.ygridcore.net>) not allowed

Caused by: org.apache.maven.scm.ScmException: 
Unable to commit file. The git-commit command failed. 
*** Please tell me who you are.

Run

  git config --global user.email "you@example.com"
  git config --global user.name "Your Name"

to set your account's default identity.
Omit --global to set the identity only in this repository.

fatal:********@asf929.gq1.ygridcore.net>) not allowed



FAILED:  org.apache.maven.wagon.providers.scm.ScmGitExeWagonTest.testWagonPutDirectoryWhenDirectoryAlreadyExists

Error Message:
Error interacting with SCM: Unable to commit file. The git-commit command failed. 
*** Please tell me who you are.

Run

  git config --global user.email "you@example.com"
  git config --global user.name "Your Name"

to set your account's default identity.
Omit --global to set the identity only in this repository.

fatal:********@asf929.gq1.ygridcore.net>) not allowed


Stack Trace:
org.apache.maven.wagon.TransferFailedException: 
Error interacting with SCM: Unable to commit file. The git-commit command failed. 
*** Please tell me who you are.

Run

  git config --global user.email "you@example.com"
  git config --global user.name "Your Name"

to set your account's default identity.
Omit --global to set the identity only in this repository.

fatal:********@asf929.gq1.ygridcore.net>) not allowed

Caused by: org.apache.maven.scm.ScmException: 
Unable to commit file. The git-commit command failed. 
*** Please tell me who you are.

Run

  git config --global user.email "you@example.com"
  git config --global user.name "Your Name"

to set your account's default identity.
Omit --global to set the identity only in this repository.

fatal:********@asf929.gq1.ygridcore.net>) not allowed



FAILED:  org.apache.maven.wagon.providers.scm.ScmGitExeWagonTest.testWagonPutDirectory

Error Message:
Error interacting with SCM: Unable to commit file. The git-commit command failed. 
*** Please tell me who you are.

Run

  git config --global user.email "you@example.com"
  git config --global user.name "Your Name"

to set your account's default identity.
Omit --global to set the identity only in this repository.

fatal:********@asf928.gq1.ygridcore.net>) not allowed


Stack Trace:
org.apache.maven.wagon.TransferFailedException: 
Error interacting with SCM: Unable to commit file. The git-commit command failed. 
*** Please tell me who you are.

Run

  git config --global user.email "you@example.com"
  git config --global user.name "Your Name"

to set your account's default identity.
Omit --global to set the identity only in this repository.

fatal:********@asf928.gq1.ygridcore.net>) not allowed

Caused by: org.apache.maven.scm.ScmException: 
Unable to commit file. The git-commit command failed. 
*** Please tell me who you are.

Run

  git config --global user.email "you@example.com"
  git config --global user.name "Your Name"

to set your account's default identity.
Omit --global to set the identity only in this repository.

fatal:********@asf928.gq1.ygridcore.net>) not allowed



FAILED:  org.apache.maven.wagon.providers.scm.ScmGitExeWagonTest.testWagonPutDirectoryDeepDestination

Error Message:
Error interacting with SCM: Unable to commit file. The git-commit command failed. 
*** Please tell me who you are.

Run

  git config --global user.email "you@example.com"
  git config --global user.name "Your Name"

to set your account's default identity.
Omit --global to set the identity only in this repository.

fatal:********@asf928.gq1.ygridcore.net>) not allowed


Stack Trace:
org.apache.maven.wagon.TransferFailedException: 
Error interacting with SCM: Unable to commit file. The git-commit command failed. 
*** Please tell me who you are.

Run

  git config --global user.email "you@example.com"
  git config --global user.name "Your Name"

to set your account's default identity.
Omit --global to set the identity only in this repository.

fatal:********@asf928.gq1.ygridcore.net>) not allowed

Caused by: org.apache.maven.scm.ScmException: 
Unable to commit file. The git-commit command failed. 
*** Please tell me who you are.

Run

  git config --global user.email "you@example.com"
  git config --global user.name "Your Name"

to set your account's default identity.
Omit --global to set the identity only in this repository.

fatal:********@asf928.gq1.ygridcore.net>) not allowed



FAILED:  org.apache.maven.wagon.providers.scm.ScmGitExeWagonTest.testWagon

Error Message:

  Unexpected method call TransferListener.transferError(TransferEvent[PUT|ERROR|Repository[scm:git:file:///home/jenkins/jenkins-slave/workspace/aven-box_maven-wagon_master-XZVDTOWPBGAU5B2ZTHNA6F4MQMMNHGQARGBUDFHBYYQHQ7B4WPHA/m/wagon-providers/wagon-scm/target/test-classes/test-repo-git-test/]|null|test-resource[len = 18; mod = 1536405761567]]):
    TransferListener.transferCompleted(TransferEvent[PUT|COMPLETED|Repository[scm:git:file:///home/jenkins/jenkins-slave/workspace/aven-box_maven-wagon_master-XZVDTOWPBGAU5B2ZTHNA6F4MQMMNHGQARGBUDFHBYYQHQ7B4WPHA/m/wagon-providers/wagon-scm/target/test-classes/test-repo-git-test/]|/home/jenkins/jenkins-slave/workspace/aven-box_maven-wagon_master-XZVDTOWPBGAU5B2ZTHNA6F4MQMMNHGQARGBUDFHBYYQHQ7B4WPHA/m/wagon-providers/wagon-scm/target/test-output/test-resource|test-resource[len = 18; mod = 1536405761567]]): expected: 1, actual: 0

Stack Trace:
java.lang.AssertionError: 

  Unexpected method call TransferListener.transferError(TransferEvent[PUT|ERROR|Repository[scm:git:file:///home/jenkins/jenkins-slave/workspace/aven-box_maven-wagon_master-XZVDTOWPBGAU5B2ZTHNA6F4MQMMNHGQARGBUDFHBYYQHQ7B4WPHA/m/wagon-providers/wagon-scm/target/test-classes/test-repo-git-test/]|null|test-resource[len = 18; mod = 1536405761567]]):
    TransferListener.transferCompleted(TransferEvent[PUT|COMPLETED|Repository[scm:git:file:///home/jenkins/jenkins-slave/workspace/aven-box_maven-wagon_master-XZVDTOWPBGAU5B2ZTHNA6F4MQMMNHGQARGBUDFHBYYQHQ7B4WPHA/m/wagon-providers/wagon-scm/target/test-classes/test-repo-git-test/]|/home/jenkins/jenkins-slave/workspace/aven-box_maven-wagon_master-XZVDTOWPBGAU5B2ZTHNA6F4MQMMNHGQARGBUDFHBYYQHQ7B4WPHA/m/wagon-providers/wagon-scm/target/test-output/test-resource|test-resource[len = 18; mod = 1536405761567]]): expected: 1, actual: 0


FAILED:  org.apache.maven.wagon.providers.scm.ScmGitExeWagonTest.testWagonPutDirectoryForDot

Error Message:
Error interacting with SCM: Unable to commit file. The git-commit command failed. 
*** Please tell me who you are.

Run

  git config --global user.email "you@example.com"
  git config --global user.name "Your Name"

to set your account's default identity.
Omit --global to set the identity only in this repository.

fatal:********@asf928.gq1.ygridcore.net>) not allowed


Stack Trace:
org.apache.maven.wagon.TransferFailedException: 
Error interacting with SCM: Unable to commit file. The git-commit command failed. 
*** Please tell me who you are.

Run

  git config --global user.email "you@example.com"
  git config --global user.name "Your Name"

to set your account's default identity.
Omit --global to set the identity only in this repository.

fatal:********@asf928.gq1.ygridcore.net>) not allowed

Caused by: org.apache.maven.scm.ScmException: 
Unable to commit file. The git-commit command failed. 
*** Please tell me who you are.

Run

  git config --global user.email "you@example.com"
  git config --global user.name "Your Name"

to set your account's default identity.
Omit --global to set the identity only in this repository.

fatal:********@asf928.gq1.ygridcore.net>) not allowed



FAILED:  org.apache.maven.wagon.providers.scm.ScmGitExeWagonTest.testWagonPutDirectoryWhenDirectoryAlreadyExists

Error Message:
Error interacting with SCM: Unable to commit file. The git-commit command failed. 
*** Please tell me who you are.

Run

  git config --global user.email "you@example.com"
  git config --global user.name "Your Name"

to set your account's default identity.
Omit --global to set the identity only in this repository.

fatal:********@asf928.gq1.ygridcore.net>) not allowed


Stack Trace:
org.apache.maven.wagon.TransferFailedException: 
Error interacting with SCM: Unable to commit file. The git-commit command failed. 
*** Please tell me who you are.

Run

  git config --global user.email "you@example.com"
  git config --global user.name "Your Name"

to set your account's default identity.
Omit --global to set the identity only in this repository.

fatal:********@asf928.gq1.ygridcore.net>) not allowed

Caused by: org.apache.maven.scm.ScmException: 
Unable to commit file. The git-commit command failed. 
*** Please tell me who you are.

Run

  git config --global user.email "you@example.com"
  git config --global user.name "Your Name"

to set your account's default identity.
Omit --global to set the identity only in this repository.

fatal:********@asf928.gq1.ygridcore.net>) not allowed



FAILED:  org.apache.maven.wagon.providers.scm.ScmGitExeWagonTest.testWagonPutDirectory

Error Message:
Error checking out: command failed: Cloning into 'F:\jenkins\jenkins-slave\workspace\aven-box_maven-wagon_master-XZVDTOWPBGAU5B2ZTHNA6F4MQMMNHGQARGBUDFHBYYQHQ7B4WPHA\m\wagon-providers\wagon-scm\target\test-output\checkout-org.apache.maven.scm.provider.git.gitexe.GitExeScmProvider'...
fatal: cannot stat 'F:/jenkins/jenkins-slave/workspace/aven-box_maven-wagon_master-XZVDTOWPBGAU5B2ZTHNA6F4MQMMNHGQARGBUDFHBYYQHQ7B4WPHA/m/wagon-providers/wagon-scm/target/test-output/checkout-org.apache.maven.scm.provider.git.gitexe.GitExeScmProvider/.git/hooks/applypatch-msg.sample': Filename too long

Stack Trace:
org.apache.maven.wagon.TransferFailedException: 
Error checking out: command failed: Cloning into 'F:\jenkins\jenkins-slave\workspace\aven-box_maven-wagon_master-XZVDTOWPBGAU5B2ZTHNA6F4MQMMNHGQARGBUDFHBYYQHQ7B4WPHA\m\wagon-providers\wagon-scm\target\test-output\checkout-org.apache.maven.scm.provider.git.gitexe.GitExeScmProvider'...
fatal: cannot stat 'F:/jenkins/jenkins-slave/workspace/aven-box_maven-wagon_master-XZVDTOWPBGAU5B2ZTHNA6F4MQMMNHGQARGBUDFHBYYQHQ7B4WPHA/m/wagon-providers/wagon-scm/target/test-output/checkout-org.apache.maven.scm.provider.git.gitexe.GitExeScmProvider/.git/hooks/applypatch-msg.sample': Filename too long
Caused by: org.apache.maven.scm.ScmException: 
command failed: Cloning into 'F:\jenkins\jenkins-slave\workspace\aven-box_maven-wagon_master-XZVDTOWPBGAU5B2ZTHNA6F4MQMMNHGQARGBUDFHBYYQHQ7B4WPHA\m\wagon-providers\wagon-scm\target\test-output\checkout-org.apache.maven.scm.provider.git.gitexe.GitExeScmProvider'...
fatal: cannot stat 'F:/jenkins/jenkins-slave/workspace/aven-box_maven-wagon_master-XZVDTOWPBGAU5B2ZTHNA6F4MQMMNHGQARGBUDFHBYYQHQ7B4WPHA/m/wagon-providers/wagon-scm/target/test-output/checkout-org.apache.maven.scm.provider.git.gitexe.GitExeScmProvider/.git/hooks/applypatch-msg.sample': Filename too long


FAILED:  org.apache.maven.wagon.providers.scm.ScmGitExeWagonTest.testWagonPutDirectoryDeepDestination

Error Message:
Error checking out: command failed: Cloning into 'F:\jenkins\jenkins-slave\workspace\aven-box_maven-wagon_master-XZVDTOWPBGAU5B2ZTHNA6F4MQMMNHGQARGBUDFHBYYQHQ7B4WPHA\m\wagon-providers\wagon-scm\target\test-output\checkout-org.apache.maven.scm.provider.git.gitexe.GitExeScmProvider'...
fatal: cannot stat 'F:/jenkins/jenkins-slave/workspace/aven-box_maven-wagon_master-XZVDTOWPBGAU5B2ZTHNA6F4MQMMNHGQARGBUDFHBYYQHQ7B4WPHA/m/wagon-providers/wagon-scm/target/test-output/checkout-org.apache.maven.scm.provider.git.gitexe.GitExeScmProvider/.git/hooks/applypatch-msg.sample': Filename too long

Stack Trace:
org.apache.maven.wagon.TransferFailedException: 
Error checking out: command failed: Cloning into 'F:\jenkins\jenkins-slave\workspace\aven-box_maven-wagon_master-XZVDTOWPBGAU5B2ZTHNA6F4MQMMNHGQARGBUDFHBYYQHQ7B4WPHA\m\wagon-providers\wagon-scm\target\test-output\checkout-org.apache.maven.scm.provider.git.gitexe.GitExeScmProvider'...
fatal: cannot stat 'F:/jenkins/jenkins-slave/workspace/aven-box_maven-wagon_master-XZVDTOWPBGAU5B2ZTHNA6F4MQMMNHGQARGBUDFHBYYQHQ7B4WPHA/m/wagon-providers/wagon-scm/target/test-output/checkout-org.apache.maven.scm.provider.git.gitexe.GitExeScmProvider/.git/hooks/applypatch-msg.sample': Filename too long
Caused by: org.apache.maven.scm.ScmException: 
command failed: Cloning into 'F:\jenkins\jenkins-slave\workspace\aven-box_maven-wagon_master-XZVDTOWPBGAU5B2ZTHNA6F4MQMMNHGQARGBUDFHBYYQHQ7B4WPHA\m\wagon-providers\wagon-scm\target\test-output\checkout-org.apache.maven.scm.provider.git.gitexe.GitExeScmProvider'...
fatal: cannot stat 'F:/jenkins/jenkins-slave/workspace/aven-box_maven-wagon_master-XZVDTOWPBGAU5B2ZTHNA6F4MQMMNHGQARGBUDFHBYYQHQ7B4WPHA/m/wagon-providers/wagon-scm/target/test-output/checkout-org.apache.maven.scm.provider.git.gitexe.GitExeScmProvider/.git/hooks/applypatch-msg.sample': Filename too long


FAILED:  org.apache.maven.wagon.providers.scm.ScmGitExeWagonTest.testWagon

Error Message:

  Unexpected method call TransferListener.transferError(TransferEvent[GET|ERROR|Repository[scm:git:file:///F:/jenkins/jenkins-slave/workspace/aven-box_maven-wagon_master-XZVDTOWPBGAU5B2ZTHNA6F4MQMMNHGQARGBUDFHBYYQHQ7B4WPHA/m/wagon-providers/wagon-scm/target/test-classes/test-repo-git-test/]|null|test-resource[len = 18; mod = 1536405731185]]):
    TransferListener.transferCompleted(TransferEvent[PUT|COMPLETED|Repository[scm:git:file:///F:/jenkins/jenkins-slave/workspace/aven-box_maven-wagon_master-XZVDTOWPBGAU5B2ZTHNA6F4MQMMNHGQARGBUDFHBYYQHQ7B4WPHA/m/wagon-providers/wagon-scm/target/test-classes/test-repo-git-test/]|F:\jenkins\jenkins-slave\workspace\aven-box_maven-wagon_master-XZVDTOWPBGAU5B2ZTHNA6F4MQMMNHGQARGBUDFHBYYQHQ7B4WPHA\m\wagon-providers\wagon-scm\target\test-output\test-resource|test-resource[len = 18; mod = 1536405731185]]): expected: 1, actual: 0

Stack Trace:
java.lang.AssertionError: 

  Unexpected method call TransferListener.transferError(TransferEvent[GET|ERROR|Repository[scm:git:file:///F:/jenkins/jenkins-slave/workspace/aven-box_maven-wagon_master-XZVDTOWPBGAU5B2ZTHNA6F4MQMMNHGQARGBUDFHBYYQHQ7B4WPHA/m/wagon-providers/wagon-scm/target/test-classes/test-repo-git-test/]|null|test-resource[len = 18; mod = 1536405731185]]):
    TransferListener.transferCompleted(TransferEvent[PUT|COMPLETED|Repository[scm:git:file:///F:/jenkins/jenkins-slave/workspace/aven-box_maven-wagon_master-XZVDTOWPBGAU5B2ZTHNA6F4MQMMNHGQARGBUDFHBYYQHQ7B4WPHA/m/wagon-providers/wagon-scm/target/test-classes/test-repo-git-test/]|F:\jenkins\jenkins-slave\workspace\aven-box_maven-wagon_master-XZVDTOWPBGAU5B2ZTHNA6F4MQMMNHGQARGBUDFHBYYQHQ7B4WPHA\m\wagon-providers\wagon-scm\target\test-output\test-resource|test-resource[len = 18; mod = 1536405731185]]): expected: 1, actual: 0


FAILED:  org.apache.maven.wagon.providers.scm.ScmGitExeWagonTest.testWagonPutDirectoryForDot

Error Message:
Error checking out: command failed: Cloning into 'F:\jenkins\jenkins-slave\workspace\aven-box_maven-wagon_master-XZVDTOWPBGAU5B2ZTHNA6F4MQMMNHGQARGBUDFHBYYQHQ7B4WPHA\m\wagon-providers\wagon-scm\target\test-output\checkout-org.apache.maven.scm.provider.git.gitexe.GitExeScmProvider'...
fatal: cannot stat 'F:/jenkins/jenkins-slave/workspace/aven-box_maven-wagon_master-XZVDTOWPBGAU5B2ZTHNA6F4MQMMNHGQARGBUDFHBYYQHQ7B4WPHA/m/wagon-providers/wagon-scm/target/test-output/checkout-org.apache.maven.scm.provider.git.gitexe.GitExeScmProvider/.git/hooks/applypatch-msg.sample': Filename too long

Stack Trace:
org.apache.maven.wagon.TransferFailedException: 
Error checking out: command failed: Cloning into 'F:\jenkins\jenkins-slave\workspace\aven-box_maven-wagon_master-XZVDTOWPBGAU5B2ZTHNA6F4MQMMNHGQARGBUDFHBYYQHQ7B4WPHA\m\wagon-providers\wagon-scm\target\test-output\checkout-org.apache.maven.scm.provider.git.gitexe.GitExeScmProvider'...
fatal: cannot stat 'F:/jenkins/jenkins-slave/workspace/aven-box_maven-wagon_master-XZVDTOWPBGAU5B2ZTHNA6F4MQMMNHGQARGBUDFHBYYQHQ7B4WPHA/m/wagon-providers/wagon-scm/target/test-output/checkout-org.apache.maven.scm.provider.git.gitexe.GitExeScmProvider/.git/hooks/applypatch-msg.sample': Filename too long
Caused by: org.apache.maven.scm.ScmException: 
command failed: Cloning into 'F:\jenkins\jenkins-slave\workspace\aven-box_maven-wagon_master-XZVDTOWPBGAU5B2ZTHNA6F4MQMMNHGQARGBUDFHBYYQHQ7B4WPHA\m\wagon-providers\wagon-scm\target\test-output\checkout-org.apache.maven.scm.provider.git.gitexe.GitExeScmProvider'...
fatal: cannot stat 'F:/jenkins/jenkins-slave/workspace/aven-box_maven-wagon_master-XZVDTOWPBGAU5B2ZTHNA6F4MQMMNHGQARGBUDFHBYYQHQ7B4WPHA/m/wagon-providers/wagon-scm/target/test-output/checkout-org.apache.maven.scm.provider.git.gitexe.GitExeScmProvider/.git/hooks/applypatch-msg.sample': Filename too long


FAILED:  org.apache.maven.wagon.providers.scm.ScmGitExeWagonTest.testFailedGet

Error Message:
Error getting file from SCM

Stack Trace:
org.apache.maven.wagon.TransferFailedException: Error getting file from SCM
Caused by: org.apache.maven.scm.ScmException: 
command failed: Cloning into 'F:\jenkins\jenkins-slave\workspace\aven-box_maven-wagon_master-XZVDTOWPBGAU5B2ZTHNA6F4MQMMNHGQARGBUDFHBYYQHQ7B4WPHA\m\wagon-providers\wagon-scm\target\test-output\checkout-org.apache.maven.scm.provider.git.gitexe.GitExeScmProvider'...
fatal: cannot stat 'F:/jenkins/jenkins-slave/workspace/aven-box_maven-wagon_master-XZVDTOWPBGAU5B2ZTHNA6F4MQMMNHGQARGBUDFHBYYQHQ7B4WPHA/m/wagon-providers/wagon-scm/target/test-output/checkout-org.apache.maven.scm.provider.git.gitexe.GitExeScmProvider/.git/hooks/applypatch-msg.sample': Filename too long


FAILED:  org.apache.maven.wagon.providers.scm.ScmGitExeWagonTest.testWagonPutDirectoryWhenDirectoryAlreadyExists

Error Message:
Error checking out: command failed: Cloning into 'F:\jenkins\jenkins-slave\workspace\aven-box_maven-wagon_master-XZVDTOWPBGAU5B2ZTHNA6F4MQMMNHGQARGBUDFHBYYQHQ7B4WPHA\m\wagon-providers\wagon-scm\target\test-output\checkout-org.apache.maven.scm.provider.git.gitexe.GitExeScmProvider'...
fatal: cannot stat 'F:/jenkins/jenkins-slave/workspace/aven-box_maven-wagon_master-XZVDTOWPBGAU5B2ZTHNA6F4MQMMNHGQARGBUDFHBYYQHQ7B4WPHA/m/wagon-providers/wagon-scm/target/test-output/checkout-org.apache.maven.scm.provider.git.gitexe.GitExeScmProvider/.git/hooks/applypatch-msg.sample': Filename too long

Stack Trace:
org.apache.maven.wagon.TransferFailedException: 
Error checking out: command failed: Cloning into 'F:\jenkins\jenkins-slave\workspace\aven-box_maven-wagon_master-XZVDTOWPBGAU5B2ZTHNA6F4MQMMNHGQARGBUDFHBYYQHQ7B4WPHA\m\wagon-providers\wagon-scm\target\test-output\checkout-org.apache.maven.scm.provider.git.gitexe.GitExeScmProvider'...
fatal: cannot stat 'F:/jenkins/jenkins-slave/workspace/aven-box_maven-wagon_master-XZVDTOWPBGAU5B2ZTHNA6F4MQMMNHGQARGBUDFHBYYQHQ7B4WPHA/m/wagon-providers/wagon-scm/target/test-output/checkout-org.apache.maven.scm.provider.git.gitexe.GitExeScmProvider/.git/hooks/applypatch-msg.sample': Filename too long
Caused by: org.apache.maven.scm.ScmException: 
command failed: Cloning into 'F:\jenkins\jenkins-slave\workspace\aven-box_maven-wagon_master-XZVDTOWPBGAU5B2ZTHNA6F4MQMMNHGQARGBUDFHBYYQHQ7B4WPHA\m\wagon-providers\wagon-scm\target\test-output\checkout-org.apache.maven.scm.provider.git.gitexe.GitExeScmProvider'...
fatal: cannot stat 'F:/jenkins/jenkins-slave/workspace/aven-box_maven-wagon_master-XZVDTOWPBGAU5B2ZTHNA6F4MQMMNHGQARGBUDFHBYYQHQ7B4WPHA/m/wagon-providers/wagon-scm/target/test-output/checkout-org.apache.maven.scm.provider.git.gitexe.GitExeScmProvider/.git/hooks/applypatch-msg.sample': Filename too long


FAILED:  org.apache.maven.wagon.providers.scm.ScmGitExeWagonTest.testWagonPutDirectory

Error Message:
Error interacting with SCM: Unable to commit file. The git-commit command failed. 
*** Please tell me who you are.

Run

  git config --global user.email "you@example.com"
  git config --global user.name "Your Name"

to set your account's default identity.
Omit --global to set the identity only in this repository.

fatal:********@asf934.gq1.ygridcore.net>) not allowed


Stack Trace:
org.apache.maven.wagon.TransferFailedException: 
Error interacting with SCM: Unable to commit file. The git-commit command failed. 
*** Please tell me who you are.

Run

  git config --global user.email "you@example.com"
  git config --global user.name "Your Name"

to set your account's default identity.
Omit --global to set the identity only in this repository.

fatal:********@asf934.gq1.ygridcore.net>) not allowed

Caused by: org.apache.maven.scm.ScmException: 
Unable to commit file. The git-commit command failed. 
*** Please tell me who you are.

Run

  git config --global user.email "you@example.com"
  git config --global user.name "Your Name"

to set your account's default identity.
Omit --global to set the identity only in this repository.

fatal:********@asf934.gq1.ygridcore.net>) not allowed



FAILED:  org.apache.maven.wagon.providers.scm.ScmGitExeWagonTest.testWagonPutDirectoryDeepDestination

Error Message:
Error interacting with SCM: Unable to commit file. The git-commit command failed. 
*** Please tell me who you are.

Run

  git config --global user.email "you@example.com"
  git config --global user.name "Your Name"

to set your account's default identity.
Omit --global to set the identity only in this repository.

fatal:********@asf934.gq1.ygridcore.net>) not allowed


Stack Trace:
org.apache.maven.wagon.TransferFailedException: 
Error interacting with SCM: Unable to commit file. The git-commit command failed. 
*** Please tell me who you are.

Run

  git config --global user.email "you@example.com"
  git config --global user.name "Your Name"

to set your account's default identity.
Omit --global to set the identity only in this repository.

fatal:********@asf934.gq1.ygridcore.net>) not allowed

Caused by: org.apache.maven.scm.ScmException: 
Unable to commit file. The git-commit command failed. 
*** Please tell me who you are.

Run

  git config --global user.email "you@example.com"
  git config --global user.name "Your Name"

to set your account's default identity.
Omit --global to set the identity only in this repository.

fatal:********@asf934.gq1.ygridcore.net>) not allowed



FAILED:  org.apache.maven.wagon.providers.scm.ScmGitExeWagonTest.testWagon

Error Message:

  Unexpected method call TransferListener.transferError(TransferEvent[PUT|ERROR|Repository[scm:git:file:///home/jenkins/jenkins-slave/workspace/aven-box_maven-wagon_master-XZVDTOWPBGAU5B2ZTHNA6F4MQMMNHGQARGBUDFHBYYQHQ7B4WPHA/m/wagon-providers/wagon-scm/target/test-classes/test-repo-git-test/]|null|test-resource[len = 18; mod = 1536405776000]]):
    TransferListener.transferCompleted(TransferEvent[PUT|COMPLETED|Repository[scm:git:file:///home/jenkins/jenkins-slave/workspace/aven-box_maven-wagon_master-XZVDTOWPBGAU5B2ZTHNA6F4MQMMNHGQARGBUDFHBYYQHQ7B4WPHA/m/wagon-providers/wagon-scm/target/test-classes/test-repo-git-test/]|/home/jenkins/jenkins-slave/workspace/aven-box_maven-wagon_master-XZVDTOWPBGAU5B2ZTHNA6F4MQMMNHGQARGBUDFHBYYQHQ7B4WPHA/m/wagon-providers/wagon-scm/target/test-output/test-resource|test-resource[len = 18; mod = 1536405776000]]): expected: 1, actual: 0

Stack Trace:
java.lang.AssertionError: 

  Unexpected method call TransferListener.transferError(TransferEvent[PUT|ERROR|Repository[scm:git:file:///home/jenkins/jenkins-slave/workspace/aven-box_maven-wagon_master-XZVDTOWPBGAU5B2ZTHNA6F4MQMMNHGQARGBUDFHBYYQHQ7B4WPHA/m/wagon-providers/wagon-scm/target/test-classes/test-repo-git-test/]|null|test-resource[len = 18; mod = 1536405776000]]):
    TransferListener.transferCompleted(TransferEvent[PUT|COMPLETED|Repository[scm:git:file:///home/jenkins/jenkins-slave/workspace/aven-box_maven-wagon_master-XZVDTOWPBGAU5B2ZTHNA6F4MQMMNHGQARGBUDFHBYYQHQ7B4WPHA/m/wagon-providers/wagon-scm/target/test-classes/test-repo-git-test/]|/home/jenkins/jenkins-slave/workspace/aven-box_maven-wagon_master-XZVDTOWPBGAU5B2ZTHNA6F4MQMMNHGQARGBUDFHBYYQHQ7B4WPHA/m/wagon-providers/wagon-scm/target/test-output/test-resource|test-resource[len = 18; mod = 1536405776000]]): expected: 1, actual: 0


FAILED:  org.apache.maven.wagon.providers.scm.ScmGitExeWagonTest.testWagonPutDirectoryForDot

Error Message:
Error interacting with SCM: Unable to commit file. The git-commit command failed. 
*** Please tell me who you are.

Run

  git config --global user.email "you@example.com"
  git config --global user.name "Your Name"

to set your account's default identity.
Omit --global to set the identity only in this repository.

fatal:********@asf934.gq1.ygridcore.net>) not allowed


Stack Trace:
org.apache.maven.wagon.TransferFailedException: 
Error interacting with SCM: Unable to commit file. The git-commit command failed. 
*** Please tell me who you are.

Run

  git config --global user.email "you@example.com"
  git config --global user.name "Your Name"

to set your account's default identity.
Omit --global to set the identity only in this repository.

fatal:********@asf934.gq1.ygridcore.net>) not allowed

Caused by: org.apache.maven.scm.ScmException: 
Unable to commit file. The git-commit command failed. 
*** Please tell me who you are.

Run

  git config --global user.email "you@example.com"
  git config --global user.name "Your Name"

to set your account's default identity.
Omit --global to set the identity only in this repository.

fatal:********@asf934.gq1.ygridcore.net>) not allowed



FAILED:  org.apache.maven.wagon.providers.scm.ScmGitExeWagonTest.testWagonPutDirectoryWhenDirectoryAlreadyExists

Error Message:
Error interacting with SCM: Unable to commit file. The git-commit command failed. 
*** Please tell me who you are.

Run

  git config --global user.email "you@example.com"
  git config --global user.name "Your Name"

to set your account's default identity.
Omit --global to set the identity only in this repository.

fatal:********@asf934.gq1.ygridcore.net>) not allowed


Stack Trace:
org.apache.maven.wagon.TransferFailedException: 
Error interacting with SCM: Unable to commit file. The git-commit command failed. 
*** Please tell me who you are.

Run

  git config --global user.email "you@example.com"
  git config --global user.name "Your Name"

to set your account's default identity.
Omit --global to set the identity only in this repository.

fatal:********@asf934.gq1.ygridcore.net>) not allowed

Caused by: org.apache.maven.scm.ScmException: 
Unable to commit file. The git-commit command failed. 
*** Please tell me who you are.

Run

  git config --global user.email "you@example.com"
  git config --global user.name "Your Name"

to set your account's default identity.
Omit --global to set the identity only in this repository.

fatal:********@asf934.gq1.ygridcore.net>) not allowed



FAILED:  org.apache.maven.wagon.providers.scm.ScmGitExeWagonTest.testWagonPutDirectory

Error Message:
Error checking out: command failed: 'git' is not recognized as an internal or external command,
operable program or batch file.

Stack Trace:
org.apache.maven.wagon.TransferFailedException: 
Error checking out: command failed: 'git' is not recognized as an internal or external command,
operable program or batch file.
Caused by: org.apache.maven.scm.ScmException: 
command failed: 'git' is not recognized as an internal or external command,
operable program or batch file.


FAILED:  org.apache.maven.wagon.providers.scm.ScmGitExeWagonTest.testWagonPutDirectoryDeepDestination

Error Message:
Error checking out: command failed: 'git' is not recognized as an internal or external command,
operable program or batch file.

Stack Trace:
org.apache.maven.wagon.TransferFailedException: 
Error checking out: command failed: 'git' is not recognized as an internal or external command,
operable program or batch file.
Caused by: org.apache.maven.scm.ScmException: 
command failed: 'git' is not recognized as an internal or external command,
operable program or batch file.


FAILED:  org.apache.maven.wagon.providers.scm.ScmGitExeWagonTest.testWagon

Error Message:

  Unexpected method call TransferListener.transferError(TransferEvent[GET|ERROR|Repository[scm:git:file:///F:/jenkins/jenkins-slave/workspace/aven-box_maven-wagon_master-XZVDTOWPBGAU5B2ZTHNA6F4MQMMNHGQARGBUDFHBYYQHQ7B4WPHA/m/wagon-providers/wagon-scm/target/test-classes/test-repo-git-test/]|null|test-resource[len = 18; mod = 1536405766820]]):
    TransferListener.transferCompleted(TransferEvent[PUT|COMPLETED|Repository[scm:git:file:///F:/jenkins/jenkins-slave/workspace/aven-box_maven-wagon_master-XZVDTOWPBGAU5B2ZTHNA6F4MQMMNHGQARGBUDFHBYYQHQ7B4WPHA/m/wagon-providers/wagon-scm/target/test-classes/test-repo-git-test/]|F:\jenkins\jenkins-slave\workspace\aven-box_maven-wagon_master-XZVDTOWPBGAU5B2ZTHNA6F4MQMMNHGQARGBUDFHBYYQHQ7B4WPHA\m\wagon-providers\wagon-scm\target\test-output\test-resource|test-resource[len = 18; mod = 1536405766820]]): expected: 1, actual: 0

Stack Trace:
java.lang.AssertionError: 

  Unexpected method call TransferListener.transferError(TransferEvent[GET|ERROR|Repository[scm:git:file:///F:/jenkins/jenkins-slave/workspace/aven-box_maven-wagon_master-XZVDTOWPBGAU5B2ZTHNA6F4MQMMNHGQARGBUDFHBYYQHQ7B4WPHA/m/wagon-providers/wagon-scm/target/test-classes/test-repo-git-test/]|null|test-resource[len = 18; mod = 1536405766820]]):
    TransferListener.transferCompleted(TransferEvent[PUT|COMPLETED|Repository[scm:git:file:///F:/jenkins/jenkins-slave/workspace/aven-box_maven-wagon_master-XZVDTOWPBGAU5B2ZTHNA6F4MQMMNHGQARGBUDFHBYYQHQ7B4WPHA/m/wagon-providers/wagon-scm/target/test-classes/test-repo-git-test/]|F:\jenkins\jenkins-slave\workspace\aven-box_maven-wagon_master-XZVDTOWPBGAU5B2ZTHNA6F4MQMMNHGQARGBUDFHBYYQHQ7B4WPHA\m\wagon-providers\wagon-scm\target\test-output\test-resource|test-resource[len = 18; mod = 1536405766820]]): expected: 1, actual: 0


FAILED:  org.apache.maven.wagon.providers.scm.ScmGitExeWagonTest.testWagonPutDirectoryForDot

Error Message:
Error checking out: command failed: 'git' is not recognized as an internal or external command,
operable program or batch file.

Stack Trace:
org.apache.maven.wagon.TransferFailedException: 
Error checking out: command failed: 'git' is not recognized as an internal or external command,
operable program or batch file.
Caused by: org.apache.maven.scm.ScmException: 
command failed: 'git' is not recognized as an internal or external command,
operable program or batch file.


FAILED:  org.apache.maven.wagon.providers.scm.ScmGitExeWagonTest.testFailedGet

Error Message:
Error getting file from SCM

Stack Trace:
org.apache.maven.wagon.TransferFailedException: Error getting file from SCM
Caused by: org.apache.maven.scm.ScmException: 
command failed: 'git' is not recognized as an internal or external command,
operable program or batch file.


FAILED:  org.apache.maven.wagon.providers.scm.ScmGitExeWagonTest.testWagonPutDirectoryWhenDirectoryAlreadyExists

Error Message:
Error checking out: command failed: 'git' is not recognized as an internal or external command,
operable program or batch file.

Stack Trace:
org.apache.maven.wagon.TransferFailedException: 
Error checking out: command failed: 'git' is not recognized as an internal or external command,
operable program or batch file.
Caused by: org.apache.maven.scm.ScmException: 
command failed: 'git' is not recognized as an internal or external command,
operable program or batch file.


FAILED:  org.apache.maven.wagon.providers.scm.ScmGitExeWagonTest.testWagonPutDirectory

Error Message:
Error checking out: command failed: 'git' is not recognized as an internal or external command,
operable program or batch file.

Stack Trace:
org.apache.maven.wagon.TransferFailedException: 
Error checking out: command failed: 'git' is not recognized as an internal or external command,
operable program or batch file.
Caused by: org.apache.maven.scm.ScmException: 
command failed: 'git' is not recognized as an internal or external command,
operable program or batch file.


FAILED:  org.apache.maven.wagon.providers.scm.ScmGitExeWagonTest.testWagonPutDirectoryDeepDestination

Error Message:
Error checking out: command failed: 'git' is not recognized as an internal or external command,
operable program or batch file.

Stack Trace:
org.apache.maven.wagon.TransferFailedException: 
Error checking out: command failed: 'git' is not recognized as an internal or external command,
operable program or batch file.
Caused by: org.apache.maven.scm.ScmException: 
command failed: 'git' is not recognized as an internal or external command,
operable program or batch file.


FAILED:  org.apache.maven.wagon.providers.scm.ScmGitExeWagonTest.testWagon

Error Message:

  Unexpected method call TransferListener.transferError(TransferEvent[GET|ERROR|Repository[scm:git:file:///F:/jenkins/jenkins-slave/workspace/aven-box_maven-wagon_master-XZVDTOWPBGAU5B2ZTHNA6F4MQMMNHGQARGBUDFHBYYQHQ7B4WPHA/m/wagon-providers/wagon-scm/target/test-classes/test-repo-git-test/]|null|test-resource[len = 18; mod = 1536405823475]]):
    TransferListener.transferCompleted(TransferEvent[PUT|COMPLETED|Repository[scm:git:file:///F:/jenkins/jenkins-slave/workspace/aven-box_maven-wagon_master-XZVDTOWPBGAU5B2ZTHNA6F4MQMMNHGQARGBUDFHBYYQHQ7B4WPHA/m/wagon-providers/wagon-scm/target/test-classes/test-repo-git-test/]|F:\jenkins\jenkins-slave\workspace\aven-box_maven-wagon_master-XZVDTOWPBGAU5B2ZTHNA6F4MQMMNHGQARGBUDFHBYYQHQ7B4WPHA\m\wagon-providers\wagon-scm\target\test-output\test-resource|test-resource[len = 18; mod = 1536405823475]]): expected: 1, actual: 0

Stack Trace:
java.lang.AssertionError: 

  Unexpected method call TransferListener.transferError(TransferEvent[GET|ERROR|Repository[scm:git:file:///F:/jenkins/jenkins-slave/workspace/aven-box_maven-wagon_master-XZVDTOWPBGAU5B2ZTHNA6F4MQMMNHGQARGBUDFHBYYQHQ7B4WPHA/m/wagon-providers/wagon-scm/target/test-classes/test-repo-git-test/]|null|test-resource[len = 18; mod = 1536405823475]]):
    TransferListener.transferCompleted(TransferEvent[PUT|COMPLETED|Repository[scm:git:file:///F:/jenkins/jenkins-slave/workspace/aven-box_maven-wagon_master-XZVDTOWPBGAU5B2ZTHNA6F4MQMMNHGQARGBUDFHBYYQHQ7B4WPHA/m/wagon-providers/wagon-scm/target/test-classes/test-repo-git-test/]|F:\jenkins\jenkins-slave\workspace\aven-box_maven-wagon_master-XZVDTOWPBGAU5B2ZTHNA6F4MQMMNHGQARGBUDFHBYYQHQ7B4WPHA\m\wagon-providers\wagon-scm\target\test-output\test-resource|test-resource[len = 18; mod = 1536405823475]]): expected: 1, actual: 0


FAILED:  org.apache.maven.wagon.providers.scm.ScmGitExeWagonTest.testWagonPutDirectoryForDot

Error Message:
Error checking out: command failed: 'git' is not recognized as an internal or external command,
operable program or batch file.

Stack Trace:
org.apache.maven.wagon.TransferFailedException: 
Error checking out: command failed: 'git' is not recognized as an internal or external command,
operable program or batch file.
Caused by: org.apache.maven.scm.ScmException: 
command failed: 'git' is not recognized as an internal or external command,
operable program or batch file.


FAILED:  org.apache.maven.wagon.providers.scm.ScmGitExeWagonTest.testFailedGet

Error Message:
Error getting file from SCM

Stack Trace:
org.apache.maven.wagon.TransferFailedException: Error getting file from SCM
Caused by: org.apache.maven.scm.ScmException: 
command failed: 'git' is not recognized as an internal or external command,
operable program or batch file.


FAILED:  org.apache.maven.wagon.providers.scm.ScmGitExeWagonTest.testWagonPutDirectoryWhenDirectoryAlreadyExists

Error Message:
Error checking out: command failed: 'git' is not recognized as an internal or external command,
operable program or batch file.

Stack Trace:
org.apache.maven.wagon.TransferFailedException: 
Error checking out: command failed: 'git' is not recognized as an internal or external command,
operable program or batch file.
Caused by: org.apache.maven.scm.ScmException: 
command failed: 'git' is not recognized as an internal or external command,
operable program or batch file.




Build log:
[...truncated 3.36 MB...]
[Pipeline] [linux-jdk9] }
[Pipeline] [linux-jdk8] cleanWs
[Pipeline] [linux-jdk10] cleanWs
[Pipeline] [windows-jdk7] cleanWs
[Pipeline] [linux-jdk7] }
[Pipeline] [windows-jdk9] }
[Pipeline] [linux-jdk9] // stage
[Pipeline] [linux-jdk7] // dir
[Pipeline] [windows-jdk9] // dir
[windows-jdk7] [WS-CLEANUP] Deleting project workspace...[WS-CLEANUP] done
[windows-jdk8] [INFO] ------------------------------------------------------------------------
[windows-jdk8] [INFO] Reactor Summary:
[windows-jdk8] [INFO] 
[windows-jdk8] [INFO] Apache Maven Wagon ................................. SUCCESS [ 45.465 s]
[windows-jdk8] [INFO] Apache Maven Wagon :: API .......................... SUCCESS [ 14.460 s]
[windows-jdk8] [INFO] Apache Maven Wagon :: Provider Test ................ SUCCESS [  5.261 s]
[windows-jdk8] [INFO] Apache Maven Wagon :: Providers .................... SUCCESS [  1.809 s]
[windows-jdk8] [INFO] Apache Maven Wagon :: Providers :: File Provider ... SUCCESS [  4.824 s]
[windows-jdk8] [INFO] Apache Maven Wagon :: Providers :: FTP Provider .... SUCCESS [  8.646 s]
[windows-jdk8] [INFO] Apache Maven Wagon :: Providers :: HTTP Shared Library SUCCESS [  6.598 s]
[windows-jdk8] [INFO] Apache Maven Wagon :: Test Compatibility Kits ...... SUCCESS [  1.717 s]
[windows-jdk8] [INFO] Apache Maven Wagon :: HTTP Test Compatibility Kit .. SUCCESS [  5.103 s]
[windows-jdk8] [INFO] Apache Maven Wagon :: Providers :: HTTP Provider ... SUCCESS [05:11 min]
[windows-jdk8] [INFO] Apache Maven Wagon :: Providers :: Lightweight HTTP Provider SUCCESS [02:12 min]
[windows-jdk8] [INFO] Apache Maven Wagon :: Providers :: SCM Provider .... SUCCESS [ 39.511 s]
[windows-jdk8] [INFO] Apache Maven Wagon :: Providers :: SSH Common Library SUCCESS [  4.591 s]
[windows-jdk8] [INFO] Apache Maven Wagon :: Providers :: SSH Common Tests  SUCCESS [  3.518 s]
[windows-jdk8] [INFO] Apache Maven Wagon :: Providers :: SSH External Provider SUCCESS [  2.633 s]
[windows-jdk8] [INFO] Apache Maven Wagon :: Providers :: SSH Provider .... SUCCESS [  5.225 s]
[windows-jdk8] [INFO] Apache Maven Wagon :: Providers :: WebDAV Provider . SUCCESS [01:06 min]
[windows-jdk8] [INFO] ------------------------------------------------------------------------
[windows-jdk8] [INFO] BUILD SUCCESS
[windows-jdk8] [INFO] ------------------------------------------------------------------------
[windows-jdk8] [INFO] Total time: 11:02 min
[windows-jdk8] [INFO] Finished at: 2018-09-08T04:25:38-07:00
[linux-jdk8] [WS-CLEANUP] Deleting project workspace...[WS-CLEANUP] done
[linux-jdk10] [WS-CLEANUP] Deleting project workspace...[WS-CLEANUP] done
[windows-jdk8] [INFO] Final Memory: 63M/853M
[windows-jdk8] [INFO] ------------------------------------------------------------------------
[windows-jdk8] [WARNING] The requested profile "run-its" could not be activated because it does not exist.
[windows-jdk8] [INFO] [jenkins-event-spy] Generated F:\jenkins\jenkins-slave\workspace\aven-box_maven-wagon_master-XZVDTOWPBGAU5B2ZTHNA6F4MQMMNHGQARGBUDFHBYYQHQ7B4WPHA@tmp\withMavend3ab53b8\maven-spy-20180908-041435-8645629978038714923285.log
[windows-jdk8] Picked up JAVA_TOOL_OPTIONS: -Dmaven.ext.class.path="f:\jenkins\jenkins-slave\workspace\aven-box_maven-wagon_master-XZVDTOWPBGAU5B2ZTHNA6F4MQMMNHGQARGBUDFHBYYQHQ7B4WPHA@tmp\withMavend3ab53b8\pipeline-maven-spy.jar" -Dorg.jenkinsci.plugins.pipeline.maven.reportsFolder="f:\jenkins\jenkins-slave\workspace\aven-box_maven-wagon_master-XZVDTOWPBGAU5B2ZTHNA6F4MQMMNHGQARGBUDFHBYYQHQ7B4WPHA@tmp\withMavend3ab53b8" 
[Pipeline] [linux-jdk9] }
[Pipeline] [linux-jdk7] }
[linux-jdk7] [withMaven] artifactsPublisher - Archive artifact m/pom.xml under org/apache/maven/wagon/wagon/3.1.1-SNAPSHOT/wagon-3.1.1-SNAPSHOT.pom
[linux-jdk7] [withMaven] artifactsPublisher - Archive artifact m/target/wagon-3.1.1-SNAPSHOT-site.xml under org/apache/maven/wagon/wagon/3.1.1-SNAPSHOT/wagon-3.1.1-SNAPSHOT-site.xml
[linux-jdk7] [withMaven] artifactsPublisher - Archive artifact m/wagon-provider-api/pom.xml under org/apache/maven/wagon/wagon-provider-api/3.1.1-SNAPSHOT/wagon-provider-api-3.1.1-SNAPSHOT.pom
[linux-jdk7] [withMaven] artifactsPublisher - Archive artifact m/wagon-provider-api/target/wagon-provider-api-3.1.1-SNAPSHOT.jar under org/apache/maven/wagon/wagon-provider-api/3.1.1-SNAPSHOT/wagon-provider-api-3.1.1-SNAPSHOT.jar
[linux-jdk7] [withMaven] artifactsPublisher - Archive artifact m/wagon-provider-test/pom.xml under org/apache/maven/wagon/wagon-provider-test/3.1.1-SNAPSHOT/wagon-provider-test-3.1.1-SNAPSHOT.pom
[linux-jdk7] [withMaven] artifactsPublisher - Archive artifact m/wagon-provider-test/target/wagon-provider-test-3.1.1-SNAPSHOT.jar under org/apache/maven/wagon/wagon-provider-test/3.1.1-SNAPSHOT/wagon-provider-test-3.1.1-SNAPSHOT.jar
[linux-jdk7] [withMaven] artifactsPublisher - Archive artifact m/wagon-providers/pom.xml under org/apache/maven/wagon/wagon-providers/3.1.1-SNAPSHOT/wagon-providers-3.1.1-SNAPSHOT.pom
[linux-jdk7] [withMaven] artifactsPublisher - Archive artifact m/wagon-providers/target/wagon-providers-3.1.1-SNAPSHOT-site.xml under org/apache/maven/wagon/wagon-providers/3.1.1-SNAPSHOT/wagon-providers-3.1.1-SNAPSHOT-site.xml
[linux-jdk7] [withMaven] artifactsPublisher - Archive artifact m/wagon-providers/wagon-file/pom.xml under org/apache/maven/wagon/wagon-file/3.1.1-SNAPSHOT/wagon-file-3.1.1-SNAPSHOT.pom
[linux-jdk7] [withMaven] artifactsPublisher - Archive artifact m/wagon-providers/wagon-file/target/wagon-file-3.1.1-SNAPSHOT.jar under org/apache/maven/wagon/wagon-file/3.1.1-SNAPSHOT/wagon-file-3.1.1-SNAPSHOT.jar
[linux-jdk7] [withMaven] artifactsPublisher - Archive artifact m/wagon-providers/wagon-ftp/pom.xml under org/apache/maven/wagon/wagon-ftp/3.1.1-SNAPSHOT/wagon-ftp-3.1.1-SNAPSHOT.pom
[linux-jdk7] [withMaven] artifactsPublisher - Archive artifact m/wagon-providers/wagon-ftp/target/wagon-ftp-3.1.1-SNAPSHOT.jar under org/apache/maven/wagon/wagon-ftp/3.1.1-SNAPSHOT/wagon-ftp-3.1.1-SNAPSHOT.jar
[linux-jdk7] [withMaven] artifactsPublisher - Archive artifact m/wagon-providers/wagon-http-shared/pom.xml under org/apache/maven/wagon/wagon-http-shared/3.1.1-SNAPSHOT/wagon-http-shared-3.1.1-SNAPSHOT.pom
[linux-jdk7] [withMaven] artifactsPublisher - Archive artifact m/wagon-providers/wagon-http-shared/target/wagon-http-shared-3.1.1-SNAPSHOT.jar under org/apache/maven/wagon/wagon-http-shared/3.1.1-SNAPSHOT/wagon-http-shared-3.1.1-SNAPSHOT.jar
[linux-jdk7] [withMaven] artifactsPublisher - Archive artifact m/wagon-tcks/pom.xml under org/apache/maven/wagon/wagon-tcks/3.1.1-SNAPSHOT/wagon-tcks-3.1.1-SNAPSHOT.pom
[linux-jdk7] [withMaven] artifactsPublisher - Archive artifact m/wagon-tcks/target/wagon-tcks-3.1.1-SNAPSHOT-site.xml under org/apache/maven/wagon/wagon-tcks/3.1.1-SNAPSHOT/wagon-tcks-3.1.1-SNAPSHOT-site.xml
[linux-jdk7] [withMaven] artifactsPublisher - Archive artifact m/wagon-tcks/wagon-tck-http/pom.xml under org/apache/maven/wagon/wagon-tck-http/3.1.1-SNAPSHOT/wagon-tck-http-3.1.1-SNAPSHOT.pom
[linux-jdk7] [withMaven] artifactsPublisher - Archive artifact m/wagon-tcks/wagon-tck-http/target/wagon-tck-http-3.1.1-SNAPSHOT.jar under org/apache/maven/wagon/wagon-tck-http/3.1.1-SNAPSHOT/wagon-tck-http-3.1.1-SNAPSHOT.jar
[linux-jdk7] [withMaven] artifactsPublisher - Archive artifact m/wagon-providers/wagon-http/pom.xml under org/apache/maven/wagon/wagon-http/3.1.1-SNAPSHOT/wagon-http-3.1.1-SNAPSHOT.pom
[linux-jdk7] [withMaven] artifactsPublisher - Archive artifact m/wagon-providers/wagon-http/target/wagon-http-3.1.1-SNAPSHOT.jar under org/apache/maven/wagon/wagon-http/3.1.1-SNAPSHOT/wagon-http-3.1.1-SNAPSHOT.jar
[linux-jdk7] [withMaven] artifactsPublisher - Archive artifact m/wagon-providers/wagon-http/target/wagon-http-3.1.1-SNAPSHOT-shaded.jar under org/apache/maven/wagon/wagon-http/3.1.1-SNAPSHOT/wagon-http-3.1.1-SNAPSHOT-shaded.jar
[linux-jdk7] [withMaven] artifactsPublisher - Archive artifact m/wagon-providers/wagon-http-lightweight/pom.xml under org/apache/maven/wagon/wagon-http-lightweight/3.1.1-SNAPSHOT/wagon-http-lightweight-3.1.1-SNAPSHOT.pom
[linux-jdk7] [withMaven] artifactsPublisher - Archive artifact m/wagon-providers/wagon-http-lightweight/target/wagon-http-lightweight-3.1.1-SNAPSHOT.jar under org/apache/maven/wagon/wagon-http-lightweight/3.1.1-SNAPSHOT/wagon-http-lightweight-3.1.1-SNAPSHOT.jar
[linux-jdk7] [withMaven] artifactsPublisher - Archive artifact m/wagon-providers/wagon-scm/pom.xml under org/apache/maven/wagon/wagon-scm/3.1.1-SNAPSHOT/wagon-scm-3.1.1-SNAPSHOT.pom
[linux-jdk7] [withMaven] artifactsPublisher - Archive artifact m/wagon-providers/wagon-scm/target/wagon-scm-3.1.1-SNAPSHOT.jar under org/apache/maven/wagon/wagon-scm/3.1.1-SNAPSHOT/wagon-scm-3.1.1-SNAPSHOT.jar
[linux-jdk7] [withMaven] artifactsPublisher - Archive artifact m/wagon-providers/wagon-ssh-common/pom.xml under org/apache/maven/wagon/wagon-ssh-common/3.1.1-SNAPSHOT/wagon-ssh-common-3.1.1-SNAPSHOT.pom
[linux-jdk7] [withMaven] artifactsPublisher - Archive artifact m/wagon-providers/wagon-ssh-common/target/wagon-ssh-common-3.1.1-SNAPSHOT.jar under org/apache/maven/wagon/wagon-ssh-common/3.1.1-SNAPSHOT/wagon-ssh-common-3.1.1-SNAPSHOT.jar
[linux-jdk7] [withMaven] artifactsPublisher - Archive artifact m/wagon-providers/wagon-ssh-common-test/pom.xml under org/apache/maven/wagon/wagon-ssh-common-test/3.1.1-SNAPSHOT/wagon-ssh-common-test-3.1.1-SNAPSHOT.pom
[linux-jdk7] [withMaven] artifactsPublisher - Archive artifact m/wagon-providers/wagon-ssh-common-test/target/wagon-ssh-common-test-3.1.1-SNAPSHOT.jar under org/apache/maven/wagon/wagon-ssh-common-test/3.1.1-SNAPSHOT/wagon-ssh-common-test-3.1.1-SNAPSHOT.jar
[linux-jdk7] [withMaven] artifactsPublisher - Archive artifact m/wagon-providers/wagon-ssh-external/pom.xml under org/apache/maven/wagon/wagon-ssh-external/3.1.1-SNAPSHOT/wagon-ssh-external-3.1.1-SNAPSHOT.pom
[linux-jdk7] [withMaven] artifactsPublisher - Archive artifact m/wagon-providers/wagon-ssh-external/target/wagon-ssh-external-3.1.1-SNAPSHOT.jar under org/apache/maven/wagon/wagon-ssh-external/3.1.1-SNAPSHOT/wagon-ssh-external-3.1.1-SNAPSHOT.jar
[linux-jdk7] [withMaven] artifactsPublisher - Archive artifact m/wagon-providers/wagon-ssh/pom.xml under org/apache/maven/wagon/wagon-ssh/3.1.1-SNAPSHOT/wagon-ssh-3.1.1-SNAPSHOT.pom
[linux-jdk7] [withMaven] artifactsPublisher - Archive artifact m/wagon-providers/wagon-ssh/target/wagon-ssh-3.1.1-SNAPSHOT.jar under org/apache/maven/wagon/wagon-ssh/3.1.1-SNAPSHOT/wagon-ssh-3.1.1-SNAPSHOT.jar
[linux-jdk7] [withMaven] artifactsPublisher - Archive artifact m/wagon-providers/wagon-webdav-jackrabbit/pom.xml under org/apache/maven/wagon/wagon-webdav-jackrabbit/3.1.1-SNAPSHOT/wagon-webdav-jackrabbit-3.1.1-SNAPSHOT.pom
[linux-jdk7] [withMaven] artifactsPublisher - Archive artifact m/wagon-providers/wagon-webdav-jackrabbit/target/wagon-webdav-jackrabbit-3.1.1-SNAPSHOT.jar under org/apache/maven/wagon/wagon-webdav-jackrabbit/3.1.1-SNAPSHOT/wagon-webdav-jackrabbit-3.1.1-SNAPSHOT.jar
[linux-jdk7] [withMaven] junitPublisher - Archive test results for Maven artifact org.apache.maven.wagon:wagon-provider-api:3.1.1-SNAPSHOT generated by maven-surefire-plugin:test (default-test): m/wagon-provider-api/target/surefire-reports/*.xml
[linux-jdk7] Recording test results
[linux-jdk7] [withMaven] junitPublisher - Archive test results for Maven artifact org.apache.maven.wagon:wagon-provider-test:3.1.1-SNAPSHOT generated by maven-surefire-plugin:test (default-test): m/wagon-provider-test/target/surefire-reports/*.xml
[linux-jdk7] Recording test results
[linux-jdk7] None of the test reports contained any result
[linux-jdk7] [withMaven] junitPublisher - Archive test results for Maven artifact org.apache.maven.wagon:wagon-file:3.1.1-SNAPSHOT generated by maven-surefire-plugin:test (default-test): m/wagon-providers/wagon-file/target/surefire-reports/*.xml
[linux-jdk7] Recording test results
[linux-jdk7] [withMaven] junitPublisher - Archive test results for Maven artifact org.apache.maven.wagon:wagon-ftp:3.1.1-SNAPSHOT generated by maven-surefire-plugin:test (default-test): m/wagon-providers/wagon-ftp/target/surefire-reports/*.xml
[linux-jdk7] Recording test results
[linux-jdk7] [withMaven] junitPublisher - Archive test results for Maven artifact org.apache.maven.wagon:wagon-http-shared:3.1.1-SNAPSHOT generated by maven-surefire-plugin:test (default-test): m/wagon-providers/wagon-http-shared/target/surefire-reports/*.xml
[linux-jdk7] Recording test results
[linux-jdk7] [withMaven] junitPublisher - Archive test results for Maven artifact org.apache.maven.wagon:wagon-tck-http:3.1.1-SNAPSHOT generated by maven-surefire-plugin:test (default-test): m/wagon-tcks/wagon-tck-http/target/surefire-reports/*.xml
[linux-jdk7] Recording test results
[linux-jdk7] None of the test reports contained any result
[linux-jdk7] [withMaven] junitPublisher - Archive test results for Maven artifact org.apache.maven.wagon:wagon-http:3.1.1-SNAPSHOT generated by maven-surefire-plugin:test (default-test): m/wagon-providers/wagon-http/target/surefire-reports/*.xml
[linux-jdk7] Recording test results
[linux-jdk7] [withMaven] junitPublisher - Archive test results for Maven artifact org.apache.maven.wagon:wagon-http-lightweight:3.1.1-SNAPSHOT generated by maven-surefire-plugin:test (default-test): m/wagon-providers/wagon-http-lightweight/target/surefire-reports/*.xml
[linux-jdk7] Recording test results
[linux-jdk7] [withMaven] junitPublisher - Archive test results for Maven artifact org.apache.maven.wagon:wagon-scm:3.1.1-SNAPSHOT generated by maven-surefire-plugin:test (default-test): m/wagon-providers/wagon-scm/target/surefire-reports/*.xml
[linux-jdk7] Recording test results
[linux-jdk7] [withMaven] junitPublisher - Archive test results for Maven artifact org.apache.maven.wagon:wagon-ssh-common:3.1.1-SNAPSHOT generated by maven-surefire-plugin:test (default-test): m/wagon-providers/wagon-ssh-common/target/surefire-reports/*.xml
[linux-jdk7] Recording test results
[linux-jdk7] [withMaven] junitPublisher - Archive test results for Maven artifact org.apache.maven.wagon:wagon-ssh-common-test:3.1.1-SNAPSHOT generated by maven-surefire-plugin:test (default-test): m/wagon-providers/wagon-ssh-common-test/target/surefire-reports/*.xml
[linux-jdk7] Recording test results
[linux-jdk7] None of the test reports contained any result
[linux-jdk7] [withMaven] junitPublisher - Archive test results for Maven artifact org.apache.maven.wagon:wagon-ssh-external:3.1.1-SNAPSHOT generated by maven-surefire-plugin:test (default-test): m/wagon-providers/wagon-ssh-external/target/surefire-reports/*.xml
[linux-jdk7] Recording test results
[linux-jdk7] None of the test reports contained any result
[linux-jdk7] [withMaven] junitPublisher - Archive test results for Maven artifact org.apache.maven.wagon:wagon-ssh:3.1.1-SNAPSHOT generated by maven-surefire-plugin:test (default-test): m/wagon-providers/wagon-ssh/target/surefire-reports/*.xml
[linux-jdk7] Recording test results
[linux-jdk7] None of the test reports contained any result
[linux-jdk7] [withMaven] junitPublisher - Archive test results for Maven artifact org.apache.maven.wagon:wagon-webdav-jackrabbit:3.1.1-SNAPSHOT generated by maven-surefire-plugin:test (default-test): m/wagon-providers/wagon-webdav-jackrabbit/target/surefire-reports/*.xml
[linux-jdk7] Recording test results
[linux-jdk7] [withMaven] openTasksPublisher - Scan Tasks for Maven artifact org.apache.maven.wagon:wagon-provider-api:3.1.1-SNAPSHOT in source directory m/wagon-provider-api/src/main/java
[linux-jdk7] [withMaven] openTasksPublisher - Scan Tasks for Maven artifact org.apache.maven.wagon:wagon-provider-test:3.1.1-SNAPSHOT in source directory m/wagon-provider-test/src/main/java
[linux-jdk7] [withMaven] openTasksPublisher - Scan Tasks for Maven artifact org.apache.maven.wagon:wagon-file:3.1.1-SNAPSHOT in source directory m/wagon-providers/wagon-file/src/main/java
[linux-jdk7] [withMaven] openTasksPublisher - Scan Tasks for Maven artifact org.apache.maven.wagon:wagon-ftp:3.1.1-SNAPSHOT in source directory m/wagon-providers/wagon-ftp/src/main/java
[linux-jdk7] [withMaven] openTasksPublisher - Scan Tasks for Maven artifact org.apache.maven.wagon:wagon-http-shared:3.1.1-SNAPSHOT in source directory m/wagon-providers/wagon-http-shared/src/main/java
[linux-jdk7] [withMaven] openTasksPublisher - Scan Tasks for Maven artifact org.apache.maven.wagon:wagon-tck-http:3.1.1-SNAPSHOT in source directory m/wagon-tcks/wagon-tck-http/src/main/java
[linux-jdk7] [withMaven] openTasksPublisher - Scan Tasks for Maven artifact org.apache.maven.wagon:wagon-http:3.1.1-SNAPSHOT in source directory m/wagon-providers/wagon-http/src/main/java
[linux-jdk7] [withMaven] openTasksPublisher - Scan Tasks for Maven artifact org.apache.maven.wagon:wagon-http-lightweight:3.1.1-SNAPSHOT in source directory m/wagon-providers/wagon-http-lightweight/src/main/java
[linux-jdk7] [withMaven] openTasksPublisher - Scan Tasks for Maven artifact org.apache.maven.wagon:wagon-scm:3.1.1-SNAPSHOT in source directory m/wagon-providers/wagon-scm/src/main/java
[linux-jdk7] [withMaven] openTasksPublisher - Scan Tasks for Maven artifact org.apache.maven.wagon:wagon-ssh-common:3.1.1-SNAPSHOT in source directory m/wagon-providers/wagon-ssh-common/src/main/java
[linux-jdk7] [withMaven] openTasksPublisher - Scan Tasks for Maven artifact org.apache.maven.wagon:wagon-ssh-common-test:3.1.1-SNAPSHOT in source directory m/wagon-providers/wagon-ssh-common-test/src/main/java
[linux-jdk7] [withMaven] openTasksPublisher - Scan Tasks for Maven artifact org.apache.maven.wagon:wagon-ssh-external:3.1.1-SNAPSHOT in source directory m/wagon-providers/wagon-ssh-external/src/main/java
[linux-jdk7] [withMaven] openTasksPublisher - Scan Tasks for Maven artifact org.apache.maven.wagon:wagon-ssh:3.1.1-SNAPSHOT in source directory m/wagon-providers/wagon-ssh/src/main/java
[linux-jdk7] [withMaven] openTasksPublisher - Scan Tasks for Maven artifact org.apache.maven.wagon:wagon-webdav-jackrabbit:3.1.1-SNAPSHOT in source directory m/wagon-providers/wagon-webdav-jackrabbit/src/main/java
[linux-jdk7] [TASKS] Scanning folder '/home/jenkins/jenkins-slave/workspace/aven-box_maven-wagon_master-XZVDTOWPBGAU5B2ZTHNA6F4MQMMNHGQARGBUDFHBYYQHQ7B4WPHA' for files matching the pattern 'm/wagon-provider-api/src/main/java/**/*,m/wagon-provider-test/src/main/java/**/*,m/wagon-providers/wagon-file/src/main/java/**/*,m/wagon-providers/wagon-ftp/src/main/java/**/*,m/wagon-providers/wagon-http-shared/src/main/java/**/*,m/wagon-tcks/wagon-tck-http/src/main/java/**/*,m/wagon-providers/wagon-http/src/main/java/**/*,m/wagon-providers/wagon-http-lightweight/src/main/java/**/*,m/wagon-providers/wagon-scm/src/main/java/**/*,m/wagon-providers/wagon-ssh-common/src/main/java/**/*,m/wagon-providers/wagon-ssh-common-test/src/main/java/**/*,m/wagon-providers/wagon-ssh-external/src/main/java/**/*,m/wagon-providers/wagon-ssh/src/main/java/**/*,m/wagon-providers/wagon-webdav-jackrabbit/src/main/java/**/*' - excludes: null
[linux-jdk7] [TASKS] Found 114 files to scan for tasks
[linux-jdk7] [TASKS] Found 31 open tasks.
[linux-jdk7] Skipping warnings blame since pipelines do not have an SCM link.%n
[linux-jdk7] [TASKS] Computing warning deltas based on reference build #4
[Pipeline] [windows-jdk9] }
[windows-jdk9] [withMaven] junitPublisher - Archive test results for Maven artifact org.apache.maven.wagon:wagon-provider-api:3.1.1-SNAPSHOT generated by maven-surefire-plugin:test (default-test): m\wagon-provider-api\target\surefire-reports\*.xml
[windows-jdk9] Recording test results
[windows-jdk9] [withMaven] junitPublisher - Archive test results for Maven artifact org.apache.maven.wagon:wagon-provider-test:3.1.1-SNAPSHOT generated by maven-surefire-plugin:test (default-test): m\wagon-provider-test\target\surefire-reports\*.xml
[windows-jdk9] Recording test results
[windows-jdk9] None of the test reports contained any result
[windows-jdk9] [withMaven] junitPublisher - Archive test results for Maven artifact org.apache.maven.wagon:wagon-file:3.1.1-SNAPSHOT generated by maven-surefire-plugin:test (default-test): m\wagon-providers\wagon-file\target\surefire-reports\*.xml
[windows-jdk9] Recording test results
[windows-jdk9] [withMaven] junitPublisher - Archive test results for Maven artifact org.apache.maven.wagon:wagon-ftp:3.1.1-SNAPSHOT generated by maven-surefire-plugin:test (default-test): m\wagon-providers\wagon-ftp\target\surefire-reports\*.xml
[windows-jdk9] Recording test results
[windows-jdk9] [withMaven] junitPublisher - Archive test results for Maven artifact org.apache.maven.wagon:wagon-http-shared:3.1.1-SNAPSHOT generated by maven-surefire-plugin:test (default-test): m\wagon-providers\wagon-http-shared\target\surefire-reports\*.xml
[windows-jdk9] Recording test results
[windows-jdk9] [withMaven] junitPublisher - Archive test results for Maven artifact org.apache.maven.wagon:wagon-tck-http:3.1.1-SNAPSHOT generated by maven-surefire-plugin:test (default-test): m\wagon-tcks\wagon-tck-http\target\surefire-reports\*.xml
[windows-jdk9] Recording test results
[windows-jdk9] None of the test reports contained any result
[windows-jdk9] [withMaven] junitPublisher - Archive test results for Maven artifact org.apache.maven.wagon:wagon-http:3.1.1-SNAPSHOT generated by maven-surefire-plugin:test (default-test): m\wagon-providers\wagon-http\target\surefire-reports\*.xml
[windows-jdk9] Recording test results
[windows-jdk9] [withMaven] junitPublisher - Archive test results for Maven artifact org.apache.maven.wagon:wagon-http-lightweight:3.1.1-SNAPSHOT generated by maven-surefire-plugin:test (default-test): m\wagon-providers\wagon-http-lightweight\target\surefire-reports\*.xml
[windows-jdk9] Recording test results
[windows-jdk9] [withMaven] junitPublisher - Archive test results for Maven artifact org.apache.maven.wagon:wagon-scm:3.1.1-SNAPSHOT generated by maven-surefire-plugin:test (default-test): m\wagon-providers\wagon-scm\target\surefire-reports\*.xml
[windows-jdk9] Recording test results
[windows-jdk9] [withMaven] junitPublisher - Archive test results for Maven artifact org.apache.maven.wagon:wagon-ssh-common:3.1.1-SNAPSHOT generated by maven-surefire-plugin:test (default-test): m\wagon-providers\wagon-ssh-common\target\surefire-reports\*.xml
[windows-jdk9] Recording test results
[windows-jdk9] [withMaven] junitPublisher - Archive test results for Maven artifact org.apache.maven.wagon:wagon-ssh-common-test:3.1.1-SNAPSHOT generated by maven-surefire-plugin:test (default-test): m\wagon-providers\wagon-ssh-common-test\target\surefire-reports\*.xml
[windows-jdk9] Recording test results
[windows-jdk9] None of the test reports contained any result
[windows-jdk9] [withMaven] junitPublisher - Archive test results for Maven artifact org.apache.maven.wagon:wagon-ssh-external:3.1.1-SNAPSHOT generated by maven-surefire-plugin:test (default-test): m\wagon-providers\wagon-ssh-external\target\surefire-reports\*.xml
[windows-jdk9] Recording test results
[windows-jdk9] None of the test reports contained any result
[windows-jdk9] [withMaven] junitPublisher - Archive test results for Maven artifact org.apache.maven.wagon:wagon-ssh:3.1.1-SNAPSHOT generated by maven-surefire-plugin:test (default-test): m\wagon-providers\wagon-ssh\target\surefire-reports\*.xml
[windows-jdk9] Recording test results
[windows-jdk9] None of the test reports contained any result
[windows-jdk9] [withMaven] junitPublisher - Archive test results for Maven artifact org.apache.maven.wagon:wagon-webdav-jackrabbit:3.1.1-SNAPSHOT generated by maven-surefire-plugin:test (default-test): m\wagon-providers\wagon-webdav-jackrabbit\target\surefire-reports\*.xml
[windows-jdk9] Recording test results
[Pipeline] [linux-jdk9] // node
[Pipeline] [linux-jdk7] // withMaven
[Pipeline] [windows-jdk9] // withMaven
[Pipeline] [linux-jdk9] }
[Pipeline] [linux-jdk8] }
[Pipeline] [linux-jdk7] cleanWs
[Pipeline] [linux-jdk10] }
[Pipeline] [windows-jdk7] }
[Pipeline] [windows-jdk9] cleanWs
[Pipeline] [windows-jdk8] }
[Pipeline] [linux-jdk8] // stage
[Pipeline] [linux-jdk10] // stage
[Pipeline] [windows-jdk7] // stage
[Pipeline] [windows-jdk8] // dir
[windows-jdk9] [WS-CLEANUP] Deleting project workspace...[WS-CLEANUP] done
[linux-jdk7] [WS-CLEANUP] Deleting project workspace...[WS-CLEANUP] done
[Pipeline] [linux-jdk8] }
[Pipeline] [linux-jdk10] }
[Pipeline] [windows-jdk7] }
[Pipeline] [windows-jdk8] }
[windows-jdk8] [withMaven] junitPublisher - Archive test results for Maven artifact org.apache.maven.wagon:wagon-provider-api:3.1.1-SNAPSHOT generated by maven-surefire-plugin:test (default-test): m\wagon-provider-api\target\surefire-reports\*.xml
[windows-jdk8] Recording test results
[windows-jdk8] [withMaven] junitPublisher - Archive test results for Maven artifact org.apache.maven.wagon:wagon-provider-test:3.1.1-SNAPSHOT generated by maven-surefire-plugin:test (default-test): m\wagon-provider-test\target\surefire-reports\*.xml
[windows-jdk8] Recording test results
[windows-jdk8] None of the test reports contained any result
[windows-jdk8] [withMaven] junitPublisher - Archive test results for Maven artifact org.apache.maven.wagon:wagon-file:3.1.1-SNAPSHOT generated by maven-surefire-plugin:test (default-test): m\wagon-providers\wagon-file\target\surefire-reports\*.xml
[windows-jdk8] Recording test results
[windows-jdk8] [withMaven] junitPublisher - Archive test results for Maven artifact org.apache.maven.wagon:wagon-ftp:3.1.1-SNAPSHOT generated by maven-surefire-plugin:test (default-test): m\wagon-providers\wagon-ftp\target\surefire-reports\*.xml
[windows-jdk8] Recording test results
[windows-jdk8] [withMaven] junitPublisher - Archive test results for Maven artifact org.apache.maven.wagon:wagon-http-shared:3.1.1-SNAPSHOT generated by maven-surefire-plugin:test (default-test): m\wagon-providers\wagon-http-shared\target\surefire-reports\*.xml
[windows-jdk8] Recording test results
[windows-jdk8] [withMaven] junitPublisher - Archive test results for Maven artifact org.apache.maven.wagon:wagon-tck-http:3.1.1-SNAPSHOT generated by maven-surefire-plugin:test (default-test): m\wagon-tcks\wagon-tck-http\target\surefire-reports\*.xml
[windows-jdk8] Recording test results
[windows-jdk8] None of the test reports contained any result
[windows-jdk8] [withMaven] junitPublisher - Archive test results for Maven artifact org.apache.maven.wagon:wagon-http:3.1.1-SNAPSHOT generated by maven-surefire-plugin:test (default-test): m\wagon-providers\wagon-http\target\surefire-reports\*.xml
[windows-jdk8] Recording test results
[windows-jdk8] [withMaven] junitPublisher - Archive test results for Maven artifact org.apache.maven.wagon:wagon-http-lightweight:3.1.1-SNAPSHOT generated by maven-surefire-plugin:test (default-test): m\wagon-providers\wagon-http-lightweight\target\surefire-reports\*.xml
[windows-jdk8] Recording test results
[windows-jdk8] [withMaven] junitPublisher - Archive test results for Maven artifact org.apache.maven.wagon:wagon-scm:3.1.1-SNAPSHOT generated by maven-surefire-plugin:test (default-test): m\wagon-providers\wagon-scm\target\surefire-reports\*.xml
[windows-jdk8] Recording test results
[windows-jdk8] [withMaven] junitPublisher - Archive test results for Maven artifact org.apache.maven.wagon:wagon-ssh-common:3.1.1-SNAPSHOT generated by maven-surefire-plugin:test (default-test): m\wagon-providers\wagon-ssh-common\target\surefire-reports\*.xml
[windows-jdk8] Recording test results
[windows-jdk8] [withMaven] junitPublisher - Archive test results for Maven artifact org.apache.maven.wagon:wagon-ssh-common-test:3.1.1-SNAPSHOT generated by maven-surefire-plugin:test (default-test): m\wagon-providers\wagon-ssh-common-test\target\surefire-reports\*.xml
[windows-jdk8] Recording test results
[windows-jdk8] None of the test reports contained any result
[windows-jdk8] [withMaven] junitPublisher - Archive test results for Maven artifact org.apache.maven.wagon:wagon-ssh-external:3.1.1-SNAPSHOT generated by maven-surefire-plugin:test (default-test): m\wagon-providers\wagon-ssh-external\target\surefire-reports\*.xml
[windows-jdk8] Recording test results
[windows-jdk8] None of the test reports contained any result
[windows-jdk8] [withMaven] junitPublisher - Archive test results for Maven artifact org.apache.maven.wagon:wagon-ssh:3.1.1-SNAPSHOT generated by maven-surefire-plugin:test (default-test): m\wagon-providers\wagon-ssh\target\surefire-reports\*.xml
[windows-jdk8] Recording test results
[windows-jdk8] None of the test reports contained any result
[windows-jdk8] [withMaven] junitPublisher - Archive test results for Maven artifact org.apache.maven.wagon:wagon-webdav-jackrabbit:3.1.1-SNAPSHOT generated by maven-surefire-plugin:test (default-test): m\wagon-providers\wagon-webdav-jackrabbit\target\surefire-reports\*.xml
[windows-jdk8] Recording test results
[Pipeline] [linux-jdk8] // node
[Pipeline] [linux-jdk10] // node
[Pipeline] [windows-jdk7] // node
[Pipeline] [windows-jdk8] // withMaven
[Pipeline] [linux-jdk8] }
[Pipeline] [linux-jdk10] }
[Pipeline] [windows-jdk7] }
[Pipeline] [linux-jdk7] }
[Pipeline] [windows-jdk9] }
[Pipeline] [windows-jdk8] cleanWs
[Pipeline] [linux-jdk7] // stage
[Pipeline] [windows-jdk9] // stage
[Pipeline] [linux-jdk7] }
[Pipeline] [windows-jdk9] }
[Pipeline] [linux-jdk7] // node
[windows-jdk8] [WS-CLEANUP] Deleting project workspace...[WS-CLEANUP] done
[Pipeline] [windows-jdk9] // node
[Pipeline] [linux-jdk7] }
[Pipeline] [windows-jdk9] }
[Pipeline] [windows-jdk8] }
[Pipeline] [windows-jdk8] // stage
[Pipeline] [windows-jdk8] }
[Pipeline] [windows-jdk8] // node
[Pipeline] [windows-jdk8] }
[Pipeline] // parallel
[Pipeline] stage
[Pipeline] { (Notifications)
[Pipeline] echo
Build result: FAILURE
[Pipeline] jiraIssueSelector
[Pipeline] emailext
Mime
  • Unnamed multipart/mixed (inline, None, 0 bytes)
View raw message