maven-notifications mailing list archives

Site index · List index
Message view « Date » · « Thread »
Top « Date » · « Thread »
From Apache Jenkins Server <jenk...@builds.apache.org>
Subject Build failed in Jenkins: Maven TLP » maven-jlink-plugin » CLEANUP #2
Date Wed, 12 Sep 2018 10:41:53 GMT
See https://builds.apache.org/job/maven-box/job/maven-jlink-plugin/job/CLEANUP/2/

No changes.

All tests passed

Build log:
[...truncated 4.55 MB...]
[linux-jdk9-m3.5.x_build] [INFO] Downloading from central: https://repo.maven.apache.org/maven2/com/google/guava/guava/19.0/guava-19.0.pom
[linux-jdk9-m3.5.x_build] [INFO] Downloaded from central: https://repo.maven.apache.org/maven2/com/google/guava/guava/19.0/guava-19.0.pom
(6.8 kB at 566 kB/s)
[linux-jdk9-m3.5.x_build] [INFO] Downloading from central: https://repo.maven.apache.org/maven2/com/google/guava/guava-parent/19.0/guava-parent-19.0.pom
[linux-jdk9-m3.5.x_build] [INFO] Downloaded from central: https://repo.maven.apache.org/maven2/com/google/guava/guava-parent/19.0/guava-parent-19.0.pom
(9.9 kB at 823 kB/s)
[linux-jdk9-m3.5.x_build] [INFO] Downloading from central: https://repo.maven.apache.org/maven2/org/sonatype/oss/oss-parent/7/oss-parent-7.pom
[linux-jdk9-m3.5.x_build] [INFO] Downloaded from central: https://repo.maven.apache.org/maven2/org/sonatype/oss/oss-parent/7/oss-parent-7.pom
(4.8 kB at 402 kB/s)
[linux-jdk9-m3.5.x_build] [INFO] Downloading from central: https://repo.maven.apache.org/maven2/javax/xml/bind/jaxb-api/2.3.0/jaxb-api-2.3.0.pom
[linux-jdk9-m3.5.x_build] [INFO] Downloaded from central: https://repo.maven.apache.org/maven2/javax/xml/bind/jaxb-api/2.3.0/jaxb-api-2.3.0.pom
(23 kB at 1.8 MB/s)
[linux-jdk9-m3.5.x_build] [INFO] Downloading from central: https://repo.maven.apache.org/maven2/javax/xml/bind/jaxb-api-parent/2.3.0/jaxb-api-parent-2.3.0.pom
[linux-jdk9-m3.5.x_build] [INFO] Downloaded from central: https://repo.maven.apache.org/maven2/javax/xml/bind/jaxb-api-parent/2.3.0/jaxb-api-parent-2.3.0.pom
(5.6 kB at 470 kB/s)
[linux-jdk9-m3.5.x_build] [INFO] Downloading from central: https://repo.maven.apache.org/maven2/net/java/jvnet-parent/5/jvnet-parent-5.pom
[linux-jdk9-m3.5.x_build] [INFO] Downloaded from central: https://repo.maven.apache.org/maven2/net/java/jvnet-parent/5/jvnet-parent-5.pom
(8.9 kB at 806 kB/s)
[linux-jdk9-m3.5.x_build] [INFO] Downloading from central: https://repo.maven.apache.org/maven2/org/apache/maven/shared/maven-shared-resources/2/maven-shared-resources-2.jar
[linux-jdk9-m3.5.x_build] [INFO] Downloading from central: https://repo.maven.apache.org/maven2/commons-logging/commons-logging/1.0.4/commons-logging-1.0.4.jar
[linux-jdk9-m3.5.x_build] [INFO] Downloading from central: https://repo.maven.apache.org/maven2/commons-digester/commons-digester/1.6/commons-digester-1.6.jar
[linux-jdk9-m3.5.x_build] [INFO] Downloading from central: https://repo.maven.apache.org/maven2/org/apache/maven/doxia/doxia-core/1.2/doxia-core-1.2.jar
[linux-jdk9-m3.5.x_build] [INFO] Downloading from central: https://repo.maven.apache.org/maven2/org/apache/maven/doxia/doxia-integration-tools/1.6/doxia-integration-tools-1.6.jar
[linux-jdk9-m3.5.x_build] [INFO] Downloaded from central: https://repo.maven.apache.org/maven2/commons-logging/commons-logging/1.0.4/commons-logging-1.0.4.jar
(38 kB at 2.1 MB/s)
[linux-jdk9-m3.5.x_build] [INFO] Downloading from central: https://repo.maven.apache.org/maven2/commons-io/commons-io/1.4/commons-io-1.4.jar
[linux-jdk9-m3.5.x_build] [INFO] Downloaded from central: https://repo.maven.apache.org/maven2/org/apache/maven/shared/maven-shared-resources/2/maven-shared-resources-2.jar
(13 kB at 396 kB/s)
[linux-jdk9-m3.5.x_build] [INFO] Downloading from central: https://repo.maven.apache.org/maven2/org/codehaus/plexus/plexus-resources/1.1.0/plexus-resources-1.1.0.jar
[linux-jdk9-m3.5.x_build] [INFO] Downloaded from central: https://repo.maven.apache.org/maven2/org/apache/maven/doxia/doxia-integration-tools/1.6/doxia-integration-tools-1.6.jar
(45 kB at 1.2 MB/s)
[linux-jdk9-m3.5.x_build] [INFO] Downloading from central: https://repo.maven.apache.org/maven2/com/puppycrawl/tools/checkstyle/6.18/checkstyle-6.18.jar
[linux-jdk9-m3.5.x_build] [INFO] Downloaded from central: https://repo.maven.apache.org/maven2/commons-io/commons-io/1.4/commons-io-1.4.jar
(109 kB at 2.9 MB/s)
[linux-jdk9-m3.5.x_build] [INFO] Downloading from central: https://repo.maven.apache.org/maven2/antlr/antlr/2.7.7/antlr-2.7.7.jar
[linux-jdk9-m3.5.x_build] [INFO] Downloaded from central: https://repo.maven.apache.org/maven2/org/codehaus/plexus/plexus-resources/1.1.0/plexus-resources-1.1.0.jar
(23 kB at 516 kB/s)
[linux-jdk9-m3.5.x_build] [INFO] Downloading from central: https://repo.maven.apache.org/maven2/org/antlr/antlr4-runtime/4.5.3/antlr4-runtime-4.5.3.jar
[linux-jdk9-m3.5.x_build] [INFO] Downloaded from central: https://repo.maven.apache.org/maven2/org/apache/maven/doxia/doxia-core/1.2/doxia-core-1.2.jar
(154 kB at 3.3 MB/s)
[linux-jdk9-m3.5.x_build] [INFO] Downloading from central: https://repo.maven.apache.org/maven2/commons-beanutils/commons-beanutils/1.9.2/commons-beanutils-1.9.2.jar
[linux-jdk9-m3.5.x_build] [INFO] Downloaded from central: https://repo.maven.apache.org/maven2/commons-digester/commons-digester/1.6/commons-digester-1.6.jar
(168 kB at 3.4 MB/s)
[linux-jdk9-m3.5.x_build] [INFO] Downloading from central: https://repo.maven.apache.org/maven2/commons-cli/commons-cli/1.3.1/commons-cli-1.3.1.jar
[linux-jdk9-m3.5.x_build] [INFO] Downloaded from central: https://repo.maven.apache.org/maven2/commons-cli/commons-cli/1.3.1/commons-cli-1.3.1.jar
(53 kB at 815 kB/s)
[linux-jdk9-m3.5.x_build] [INFO] Downloading from central: https://repo.maven.apache.org/maven2/com/google/guava/guava/19.0/guava-19.0.jar
[linux-jdk9-m3.5.x_build] [INFO] Downloaded from central: https://repo.maven.apache.org/maven2/commons-beanutils/commons-beanutils/1.9.2/commons-beanutils-1.9.2.jar
(234 kB at 3.0 MB/s)
[linux-jdk9-m3.5.x_build] [INFO] Downloading from central: https://repo.maven.apache.org/maven2/javax/xml/bind/jaxb-api/2.3.0/jaxb-api-2.3.0.jar
[linux-jdk9-m3.5.x_build] [INFO] Downloaded from central: https://repo.maven.apache.org/maven2/org/antlr/antlr4-runtime/4.5.3/antlr4-runtime-4.5.3.jar
(302 kB at 3.8 MB/s)
[linux-jdk9-m3.5.x_build] [INFO] Downloaded from central: https://repo.maven.apache.org/maven2/antlr/antlr/2.7.7/antlr-2.7.7.jar
(445 kB at 5.2 MB/s)
[linux-jdk9-m3.5.x_build] [INFO] Downloaded from central: https://repo.maven.apache.org/maven2/javax/xml/bind/jaxb-api/2.3.0/jaxb-api-2.3.0.jar
(126 kB at 1.3 MB/s)
[linux-jdk9-m3.5.x_build] [INFO] Downloaded from central: https://repo.maven.apache.org/maven2/com/puppycrawl/tools/checkstyle/6.18/checkstyle-6.18.jar
(1.2 MB at 10 MB/s)
[linux-jdk9-m3.5.x_build] [INFO] Downloaded from central: https://repo.maven.apache.org/maven2/com/google/guava/guava/19.0/guava-19.0.jar
(2.3 MB at 15 MB/s)
[linux-jdk9-m3.5.x_build] [INFO] 
[linux-jdk9-m3.5.x_build] [INFO] --- maven-invoker-plugin:3.1.0:verify (integration-test)
@ maven-jlink-plugin ---
[linux-jdk9-m3.5.x_build] [INFO] -------------------------------------------------
[linux-jdk9-m3.5.x_build] [INFO] Build Summary:
[linux-jdk9-m3.5.x_build] [INFO]   Passed: 3, Failed: 12, Errors: 0, Skipped: 0
[linux-jdk9-m3.5.x_build] [INFO] -------------------------------------------------
[linux-jdk9-m3.5.x_build] [ERROR] The following builds failed:
[linux-jdk9-m3.5.x_build] [ERROR] *  cli-options/no-header-files/pom.xml
[linux-jdk9-m3.5.x_build] [ERROR] *  cli-options/no-man-pages/pom.xml
[linux-jdk9-m3.5.x_build] [ERROR] *  cli-options/compress-2/pom.xml
[linux-jdk9-m3.5.x_build] [ERROR] *  cli-options/bind-services/pom.xml
[linux-jdk9-m3.5.x_build] [ERROR] *  setup-jar-module-info/pom.xml
[linux-jdk9-m3.5.x_build] [ERROR] *  cli-options/compress-0/pom.xml
[linux-jdk9-m3.5.x_build] [ERROR] *  cli-options/ignore-signing-information/pom.xml
[linux-jdk9-m3.5.x_build] [ERROR] *  cli-options/endian/pom.xml
[linux-jdk9-m3.5.x_build] [ERROR] *  cli-options/endian-big/pom.xml
[linux-jdk9-m3.5.x_build] [ERROR] *  cli-options/strip-debug/pom.xml
[linux-jdk9-m3.5.x_build] [ERROR] *  cli-options/compress-1/pom.xml
[linux-jdk9-m3.5.x_build] [ERROR] *  cli-options/disable-plugin/pom.xml
[linux-jdk9-m3.5.x_build] [INFO] -------------------------------------------------
[linux-jdk9-m3.5.x_build] [INFO] ------------------------------------------------------------------------
[linux-jdk9-m3.5.x_build] [INFO] BUILD FAILURE
[linux-jdk9-m3.5.x_build] [INFO] ------------------------------------------------------------------------
[linux-jdk9-m3.5.x_build] [INFO] Total time: 01:26 min
[linux-jdk9-m3.5.x_build] [INFO] Finished at: 2018-09-12T10:41:27Z
[linux-jdk9-m3.5.x_build] [INFO] ------------------------------------------------------------------------
[linux-jdk9-m3.5.x_build] [INFO] [jenkins-event-spy] Generated /home/jenkins/jenkins-slave/workspace/_maven-jlink-plugin_CLEANUP-YYRC5VLF7HAIAIEICXGYPF25BOQW6NXDQRTJOEZNHEUF2NVU67EA@tmp/withMaven89c8d90b/maven-spy-20180912-104000-9386467575125721062288.log
[linux-jdk9-m3.5.x_build] [ERROR] Failed to execute goal org.apache.maven.plugins:maven-invoker-plugin:3.1.0:verify
(integration-test) on project maven-jlink-plugin: 12 builds failed. See console output above
for details. -> [Help 1]
[linux-jdk9-m3.5.x_build] [ERROR] 
[linux-jdk9-m3.5.x_build] [ERROR] To see the full stack trace of the errors, re-run Maven
with the -e switch.
[linux-jdk9-m3.5.x_build] [ERROR] Re-run Maven using the -X switch to enable full debug logging.
[linux-jdk9-m3.5.x_build] [ERROR] 
[linux-jdk9-m3.5.x_build] [ERROR] For more information about the errors and possible solutions,
please read the following articles:
[linux-jdk9-m3.5.x_build] [ERROR] [Help 1] http://cwiki.apache.org/confluence/display/MAVEN/MojoFailureException
[linux-jdk10-m3.5.x_build] [INFO] run post-build script verify.groovy
[linux-jdk10-m3.5.x_build] [INFO]           cli-options/compress-0/pom.xml ...................
FAILED (3.0 s)
[linux-jdk10-m3.5.x_build] [INFO]   The post-build script returned false.
[linux-jdk10-m3.5.x_build] [INFO] Building: cli-options/compress-1/pom.xml
[Pipeline] [linux-jdk9-m3.5.x_build] }
[Pipeline] [linux-jdk9-m3.5.x_build] // dir
[linux-jdk10-m3.5.x_build] [INFO] run post-build script verify.groovy
[linux-jdk10-m3.5.x_build] [INFO]           cli-options/compress-1/pom.xml ...................
FAILED (3.1 s)
[linux-jdk10-m3.5.x_build] [INFO]   The post-build script returned false.
[linux-jdk10-m3.5.x_build] [INFO] 
[linux-jdk10-m3.5.x_build] [INFO] --- mrm-maven-plugin:1.1.0:stop (default) @ maven-jlink-plugin
---
[linux-jdk10-m3.5.x_build] [INFO] Stopping Mock Repository Manager on http://localhost:36226
[linux-jdk10-m3.5.x_build] [INFO] Stopped SocketConnector@0.0.0.0:36226
[linux-jdk10-m3.5.x_build] [INFO] Mock Repository Manager http://localhost:36226 is stopped.
[linux-jdk10-m3.5.x_build] [INFO] 
[linux-jdk10-m3.5.x_build] [INFO] --- maven-checkstyle-plugin:3.0.0:check (checkstyle-check)
@ maven-jlink-plugin ---
[linux-jdk10-m3.5.x_build] [INFO] Downloading from central: https://repo.maven.apache.org/maven2/org/apache/maven/shared/maven-shared-resources/2/maven-shared-resources-2.pom
[linux-jdk10-m3.5.x_build] [INFO] Downloaded from central: https://repo.maven.apache.org/maven2/org/apache/maven/shared/maven-shared-resources/2/maven-shared-resources-2.pom
(3.0 kB at 36 kB/s)
[linux-jdk10-m3.5.x_build] [INFO] Downloading from central: https://repo.maven.apache.org/maven2/org/codehaus/plexus/plexus-utils/3.0.10/plexus-utils-3.0.10.pom
[linux-jdk10-m3.5.x_build] [INFO] Downloaded from central: https://repo.maven.apache.org/maven2/org/codehaus/plexus/plexus-utils/3.0.10/plexus-utils-3.0.10.pom
(3.1 kB at 262 kB/s)
[linux-jdk10-m3.5.x_build] [INFO] Downloading from central: https://repo.maven.apache.org/maven2/org/codehaus/plexus/plexus/3.3/plexus-3.3.pom
[linux-jdk10-m3.5.x_build] [INFO] Downloaded from central: https://repo.maven.apache.org/maven2/org/codehaus/plexus/plexus/3.3/plexus-3.3.pom
(20 kB at 1.2 MB/s)
[linux-jdk10-m3.5.x_build] [INFO] Downloading from central: https://repo.maven.apache.org/maven2/org/apache/maven/doxia/doxia-integration-tools/1.6/doxia-integration-tools-1.6.pom
[linux-jdk10-m3.5.x_build] [INFO] Downloaded from central: https://repo.maven.apache.org/maven2/org/apache/maven/doxia/doxia-integration-tools/1.6/doxia-integration-tools-1.6.pom
(7.0 kB at 290 kB/s)
[linux-jdk10-m3.5.x_build] [INFO] Downloading from central: https://repo.maven.apache.org/maven2/org/apache/maven/doxia/doxia-tools/3/doxia-tools-3.pom
[linux-jdk10-m3.5.x_build] [INFO] Downloaded from central: https://repo.maven.apache.org/maven2/org/apache/maven/doxia/doxia-tools/3/doxia-tools-3.pom
(9.9 kB at 709 kB/s)
[linux-jdk10-m3.5.x_build] [INFO] Downloading from central: https://repo.maven.apache.org/maven2/org/codehaus/plexus/plexus-resources/1.1.0/plexus-resources-1.1.0.pom
[linux-jdk10-m3.5.x_build] [INFO] Downloaded from central: https://repo.maven.apache.org/maven2/org/codehaus/plexus/plexus-resources/1.1.0/plexus-resources-1.1.0.pom
(3.2 kB at 244 kB/s)
[linux-jdk10-m3.5.x_build] [INFO] Downloading from central: https://repo.maven.apache.org/maven2/com/puppycrawl/tools/checkstyle/6.18/checkstyle-6.18.pom
[linux-jdk10-m3.5.x_build] [INFO] Downloaded from central: https://repo.maven.apache.org/maven2/com/puppycrawl/tools/checkstyle/6.18/checkstyle-6.18.pom
(71 kB at 2.5 MB/s)
[linux-jdk10-m3.5.x_build] [INFO] Downloading from central: https://repo.maven.apache.org/maven2/antlr/antlr/2.7.7/antlr-2.7.7.pom
[linux-jdk10-m3.5.x_build] [INFO] Downloaded from central: https://repo.maven.apache.org/maven2/antlr/antlr/2.7.7/antlr-2.7.7.pom
(632 B at 57 kB/s)
[linux-jdk10-m3.5.x_build] [INFO] Downloading from central: https://repo.maven.apache.org/maven2/org/antlr/antlr4-runtime/4.5.3/antlr4-runtime-4.5.3.pom
[linux-jdk10-m3.5.x_build] [INFO] Downloaded from central: https://repo.maven.apache.org/maven2/org/antlr/antlr4-runtime/4.5.3/antlr4-runtime-4.5.3.pom
(2.3 kB at 192 kB/s)
[linux-jdk10-m3.5.x_build] [INFO] Downloading from central: https://repo.maven.apache.org/maven2/org/antlr/antlr4-master/4.5.3/antlr4-master-4.5.3.pom
[linux-jdk10-m3.5.x_build] [INFO] Downloaded from central: https://repo.maven.apache.org/maven2/org/antlr/antlr4-master/4.5.3/antlr4-master-4.5.3.pom
(3.7 kB at 307 kB/s)
[linux-jdk10-m3.5.x_build] [INFO] Downloading from central: https://repo.maven.apache.org/maven2/commons-beanutils/commons-beanutils/1.9.2/commons-beanutils-1.9.2.pom
[linux-jdk10-m3.5.x_build] [INFO] Downloaded from central: https://repo.maven.apache.org/maven2/commons-beanutils/commons-beanutils/1.9.2/commons-beanutils-1.9.2.pom
(14 kB at 1.1 MB/s)
[linux-jdk10-m3.5.x_build] [INFO] Downloading from central: https://repo.maven.apache.org/maven2/org/apache/commons/commons-parent/33/commons-parent-33.pom
[linux-jdk10-m3.5.x_build] [INFO] Downloaded from central: https://repo.maven.apache.org/maven2/org/apache/commons/commons-parent/33/commons-parent-33.pom
(53 kB at 2.7 MB/s)
[linux-jdk10-m3.5.x_build] [INFO] Downloading from central: https://repo.maven.apache.org/maven2/commons-cli/commons-cli/1.3.1/commons-cli-1.3.1.pom
[linux-jdk10-m3.5.x_build] [INFO] Downloaded from central: https://repo.maven.apache.org/maven2/commons-cli/commons-cli/1.3.1/commons-cli-1.3.1.pom
(10 kB at 799 kB/s)
[linux-jdk10-m3.5.x_build] [INFO] Downloading from central: https://repo.maven.apache.org/maven2/com/google/guava/guava/19.0/guava-19.0.pom
[linux-jdk10-m3.5.x_build] [INFO] Downloaded from central: https://repo.maven.apache.org/maven2/com/google/guava/guava/19.0/guava-19.0.pom
(6.8 kB at 522 kB/s)
[linux-jdk10-m3.5.x_build] [INFO] Downloading from central: https://repo.maven.apache.org/maven2/com/google/guava/guava-parent/19.0/guava-parent-19.0.pom
[linux-jdk10-m3.5.x_build] [INFO] Downloaded from central: https://repo.maven.apache.org/maven2/com/google/guava/guava-parent/19.0/guava-parent-19.0.pom
(9.9 kB at 760 kB/s)
[linux-jdk10-m3.5.x_build] [INFO] Downloading from central: https://repo.maven.apache.org/maven2/org/sonatype/oss/oss-parent/7/oss-parent-7.pom
[linux-jdk10-m3.5.x_build] [INFO] Downloaded from central: https://repo.maven.apache.org/maven2/org/sonatype/oss/oss-parent/7/oss-parent-7.pom
(4.8 kB at 402 kB/s)
[linux-jdk10-m3.5.x_build] [INFO] Downloading from central: https://repo.maven.apache.org/maven2/javax/xml/bind/jaxb-api/2.3.0/jaxb-api-2.3.0.pom
[linux-jdk10-m3.5.x_build] [INFO] Downloaded from central: https://repo.maven.apache.org/maven2/javax/xml/bind/jaxb-api/2.3.0/jaxb-api-2.3.0.pom
(23 kB at 1.4 MB/s)
[linux-jdk10-m3.5.x_build] [INFO] Downloading from central: https://repo.maven.apache.org/maven2/javax/xml/bind/jaxb-api-parent/2.3.0/jaxb-api-parent-2.3.0.pom
[linux-jdk10-m3.5.x_build] [INFO] Downloaded from central: https://repo.maven.apache.org/maven2/javax/xml/bind/jaxb-api-parent/2.3.0/jaxb-api-parent-2.3.0.pom
(5.6 kB at 470 kB/s)
[linux-jdk10-m3.5.x_build] [INFO] Downloading from central: https://repo.maven.apache.org/maven2/net/java/jvnet-parent/5/jvnet-parent-5.pom
[linux-jdk10-m3.5.x_build] [INFO] Downloaded from central: https://repo.maven.apache.org/maven2/net/java/jvnet-parent/5/jvnet-parent-5.pom
(8.9 kB at 682 kB/s)
[linux-jdk10-m3.5.x_build] [INFO] Downloading from central: https://repo.maven.apache.org/maven2/org/apache/maven/shared/maven-shared-resources/2/maven-shared-resources-2.jar
[linux-jdk10-m3.5.x_build] [INFO] Downloading from central: https://repo.maven.apache.org/maven2/org/apache/maven/doxia/doxia-core/1.2/doxia-core-1.2.jar
[linux-jdk10-m3.5.x_build] [INFO] Downloading from central: https://repo.maven.apache.org/maven2/commons-logging/commons-logging/1.0.4/commons-logging-1.0.4.jar
[linux-jdk10-m3.5.x_build] [INFO] Downloading from central: https://repo.maven.apache.org/maven2/commons-digester/commons-digester/1.6/commons-digester-1.6.jar
[linux-jdk10-m3.5.x_build] [INFO] Downloading from central: https://repo.maven.apache.org/maven2/org/apache/maven/doxia/doxia-integration-tools/1.6/doxia-integration-tools-1.6.jar
[linux-jdk10-m3.5.x_build] [INFO] Downloaded from central: https://repo.maven.apache.org/maven2/org/apache/maven/shared/maven-shared-resources/2/maven-shared-resources-2.jar
(13 kB at 568 kB/s)
[linux-jdk10-m3.5.x_build] [INFO] Downloading from central: https://repo.maven.apache.org/maven2/commons-io/commons-io/1.4/commons-io-1.4.jar
[linux-jdk10-m3.5.x_build] [INFO] Downloaded from central: https://repo.maven.apache.org/maven2/commons-logging/commons-logging/1.0.4/commons-logging-1.0.4.jar
(38 kB at 1.1 MB/s)
[linux-jdk10-m3.5.x_build] [INFO] Downloading from central: https://repo.maven.apache.org/maven2/org/codehaus/plexus/plexus-resources/1.1.0/plexus-resources-1.1.0.jar
[linux-jdk10-m3.5.x_build] [INFO] Downloaded from central: https://repo.maven.apache.org/maven2/org/apache/maven/doxia/doxia-integration-tools/1.6/doxia-integration-tools-1.6.jar
(45 kB at 1.2 MB/s)
[linux-jdk10-m3.5.x_build] [INFO] Downloading from central: https://repo.maven.apache.org/maven2/com/puppycrawl/tools/checkstyle/6.18/checkstyle-6.18.jar
[linux-jdk10-m3.5.x_build] [INFO] Downloaded from central: https://repo.maven.apache.org/maven2/commons-digester/commons-digester/1.6/commons-digester-1.6.jar
(168 kB at 3.5 MB/s)
[linux-jdk10-m3.5.x_build] [INFO] Downloading from central: https://repo.maven.apache.org/maven2/antlr/antlr/2.7.7/antlr-2.7.7.jar
[linux-jdk10-m3.5.x_build] [INFO] Downloaded from central: https://repo.maven.apache.org/maven2/org/apache/maven/doxia/doxia-core/1.2/doxia-core-1.2.jar
(154 kB at 3.0 MB/s)
[linux-jdk10-m3.5.x_build] [INFO] Downloading from central: https://repo.maven.apache.org/maven2/org/antlr/antlr4-runtime/4.5.3/antlr4-runtime-4.5.3.jar
[linux-jdk10-m3.5.x_build] [INFO] Downloaded from central: https://repo.maven.apache.org/maven2/org/codehaus/plexus/plexus-resources/1.1.0/plexus-resources-1.1.0.jar
(23 kB at 494 kB/s)
[linux-jdk10-m3.5.x_build] [INFO] Downloading from central: https://repo.maven.apache.org/maven2/commons-beanutils/commons-beanutils/1.9.2/commons-beanutils-1.9.2.jar
[linux-jdk10-m3.5.x_build] [INFO] Downloaded from central: https://repo.maven.apache.org/maven2/commons-io/commons-io/1.4/commons-io-1.4.jar
(109 kB at 2.3 MB/s)
[linux-jdk10-m3.5.x_build] [INFO] Downloading from central: https://repo.maven.apache.org/maven2/commons-cli/commons-cli/1.3.1/commons-cli-1.3.1.jar
[linux-jdk10-m3.5.x_build] [INFO] Downloaded from central: https://repo.maven.apache.org/maven2/commons-cli/commons-cli/1.3.1/commons-cli-1.3.1.jar
(53 kB at 815 kB/s)
[linux-jdk10-m3.5.x_build] [INFO] Downloading from central: https://repo.maven.apache.org/maven2/com/google/guava/guava/19.0/guava-19.0.jar
[linux-jdk10-m3.5.x_build] [INFO] Downloaded from central: https://repo.maven.apache.org/maven2/commons-beanutils/commons-beanutils/1.9.2/commons-beanutils-1.9.2.jar
(234 kB at 3.3 MB/s)
[linux-jdk10-m3.5.x_build] [INFO] Downloading from central: https://repo.maven.apache.org/maven2/javax/xml/bind/jaxb-api/2.3.0/jaxb-api-2.3.0.jar
[linux-jdk10-m3.5.x_build] [INFO] Downloaded from central: https://repo.maven.apache.org/maven2/org/antlr/antlr4-runtime/4.5.3/antlr4-runtime-4.5.3.jar
(302 kB at 3.9 MB/s)
[linux-jdk10-m3.5.x_build] [INFO] Downloaded from central: https://repo.maven.apache.org/maven2/antlr/antlr/2.7.7/antlr-2.7.7.jar
(445 kB at 5.2 MB/s)
[linux-jdk10-m3.5.x_build] [INFO] Downloaded from central: https://repo.maven.apache.org/maven2/javax/xml/bind/jaxb-api/2.3.0/jaxb-api-2.3.0.jar
(126 kB at 1.4 MB/s)
[linux-jdk10-m3.5.x_build] [INFO] Downloaded from central: https://repo.maven.apache.org/maven2/com/puppycrawl/tools/checkstyle/6.18/checkstyle-6.18.jar
(1.2 MB at 9.5 MB/s)
[linux-jdk10-m3.5.x_build] [INFO] Downloaded from central: https://repo.maven.apache.org/maven2/com/google/guava/guava/19.0/guava-19.0.jar
(2.3 MB at 11 MB/s)
[linux-jdk10-m3.5.x_build] [INFO] 
[linux-jdk10-m3.5.x_build] [INFO] --- maven-invoker-plugin:3.1.0:verify (integration-test)
@ maven-jlink-plugin ---
[linux-jdk10-m3.5.x_build] [INFO] -------------------------------------------------
[linux-jdk10-m3.5.x_build] [INFO] Build Summary:
[linux-jdk10-m3.5.x_build] [INFO]   Passed: 3, Failed: 12, Errors: 0, Skipped: 0
[linux-jdk10-m3.5.x_build] [INFO] -------------------------------------------------
[linux-jdk10-m3.5.x_build] [ERROR] The following builds failed:
[linux-jdk10-m3.5.x_build] [ERROR] *  cli-options/no-header-files/pom.xml
[linux-jdk10-m3.5.x_build] [ERROR] *  cli-options/no-man-pages/pom.xml
[linux-jdk10-m3.5.x_build] [ERROR] *  cli-options/compress-2/pom.xml
[linux-jdk10-m3.5.x_build] [ERROR] *  cli-options/bind-services/pom.xml
[linux-jdk10-m3.5.x_build] [ERROR] *  setup-jar-module-info/pom.xml
[linux-jdk10-m3.5.x_build] [ERROR] *  cli-options/compress-0/pom.xml
[linux-jdk10-m3.5.x_build] [ERROR] *  cli-options/ignore-signing-information/pom.xml
[linux-jdk10-m3.5.x_build] [ERROR] *  cli-options/endian/pom.xml
[linux-jdk10-m3.5.x_build] [ERROR] *  cli-options/endian-big/pom.xml
[linux-jdk10-m3.5.x_build] [ERROR] *  cli-options/strip-debug/pom.xml
[linux-jdk10-m3.5.x_build] [ERROR] *  cli-options/compress-1/pom.xml
[linux-jdk10-m3.5.x_build] [ERROR] *  cli-options/disable-plugin/pom.xml
[linux-jdk10-m3.5.x_build] [INFO] -------------------------------------------------
[linux-jdk10-m3.5.x_build] [INFO] ------------------------------------------------------------------------
[linux-jdk10-m3.5.x_build] [INFO] BUILD FAILURE
[linux-jdk10-m3.5.x_build] [INFO] ------------------------------------------------------------------------
[linux-jdk10-m3.5.x_build] [INFO] Total time: 01:25 min
[linux-jdk10-m3.5.x_build] [INFO] Finished at: 2018-09-12T10:41:32Z
[linux-jdk10-m3.5.x_build] [INFO] ------------------------------------------------------------------------
[linux-jdk10-m3.5.x_build] [INFO] [jenkins-event-spy] Generated /home/jenkins/jenkins-slave/workspace/_maven-jlink-plugin_CLEANUP-YYRC5VLF7HAIAIEICXGYPF25BOQW6NXDQRTJOEZNHEUF2NVU67EA@2@tmp/withMaven569089b8/maven-spy-20180912-104007-11316665418773526631390.log
[linux-jdk10-m3.5.x_build] [ERROR] Failed to execute goal org.apache.maven.plugins:maven-invoker-plugin:3.1.0:verify
(integration-test) on project maven-jlink-plugin: 12 builds failed. See console output above
for details. -> [Help 1]
[linux-jdk10-m3.5.x_build] [ERROR] 
[linux-jdk10-m3.5.x_build] [ERROR] To see the full stack trace of the errors, re-run Maven
with the -e switch.
[linux-jdk10-m3.5.x_build] [ERROR] Re-run Maven using the -X switch to enable full debug logging.
[linux-jdk10-m3.5.x_build] [ERROR] 
[linux-jdk10-m3.5.x_build] [ERROR] For more information about the errors and possible solutions,
please read the following articles:
[linux-jdk10-m3.5.x_build] [ERROR] [Help 1] http://cwiki.apache.org/confluence/display/MAVEN/MojoFailureException
[Pipeline] [linux-jdk9-m3.5.x_build] }
[linux-jdk9-m3.5.x_build] [Fast Archiver] No prior successful build to compare, so performing
full copy of artifacts
[linux-jdk9-m3.5.x_build] [withMaven] invokerPublisher - Archive invoker results for Maven
artifact MavenArtifact{org.apache.maven.plugins:maven-jlink-plugin::3.0.0-alpha-2-SNAPSHOT(version:
3.0.0-alpha-2-SNAPSHOT, snapshot:false) } generated by PluginInvocation{org.apache.maven.plugins:maven-invoker-plugin:3.1.0@integration-test
 integration-test}: linux-jdk9-m3.5.x_build/target/invoker-reports/*.xml
[linux-jdk9-m3.5.x_build] performing MavenInvokerRecorder, reportsFilenamePattern:'**/linux-jdk9-m3.5.x_build/target/invoker-reports/BUILD*.xml',
invokerBuildDir:'**/linux-jdk9-m3.5.x_build/target/it'
[linux-jdk9-m3.5.x_build] Found reports:[/home/jenkins/jenkins-slave/workspace/_maven-jlink-plugin_CLEANUP-YYRC5VLF7HAIAIEICXGYPF25BOQW6NXDQRTJOEZNHEUF2NVU67EA/linux-jdk9-m3.5.x_build/target/invoker-reports/BUILD-MJLINK-3_improveVerboseOutput.xml,
/home/jenkins/jenkins-slave/workspace/_maven-jlink-plugin_CLEANUP-YYRC5VLF7HAIAIEICXGYPF25BOQW6NXDQRTJOEZNHEUF2NVU67EA/linux-jdk9-m3.5.x_build/target/invoker-reports/BUILD-MJLINK-4_dependencyResolution.xml,
/home/jenkins/jenkins-slave/workspace/_maven-jlink-plugin_CLEANUP-YYRC5VLF7HAIAIEICXGYPF25BOQW6NXDQRTJOEZNHEUF2NVU67EA/linux-jdk9-m3.5.x_build/target/invoker-reports/BUILD-cli-options_bind-services.xml,
/home/jenkins/jenkins-slave/workspace/_maven-jlink-plugin_CLEANUP-YYRC5VLF7HAIAIEICXGYPF25BOQW6NXDQRTJOEZNHEUF2NVU67EA/linux-jdk9-m3.5.x_build/target/invoker-reports/BUILD-cli-options_compress-0.xml,
/home/jenkins/jenkins-slave/workspace/_maven-jlink-plugin_CLEANUP-YYRC5VLF7HAIAIEICXGYPF25BOQW6NXDQRTJOEZNHEUF2NVU67EA/linux-jdk9-m3.5.x_build/target/invoker-reports/BUILD-cli-options_compress-1.xml,
/home/jenkins/jenkins-slave/workspace/_maven-jlink-plugin_CLEANUP-YYRC5VLF7HAIAIEICXGYPF25BOQW6NXDQRTJOEZNHEUF2NVU67EA/linux-jdk9-m3.5.x_build/target/invoker-reports/BUILD-cli-options_compress-2.xml,
/home/jenkins/jenkins-slave/workspace/_maven-jlink-plugin_CLEANUP-YYRC5VLF7HAIAIEICXGYPF25BOQW6NXDQRTJOEZNHEUF2NVU67EA/linux-jdk9-m3.5.x_build/target/invoker-reports/BUILD-cli-options_disable-plugin.xml,
/home/jenkins/jenkins-slave/workspace/_maven-jlink-plugin_CLEANUP-YYRC5VLF7HAIAIEICXGYPF25BOQW6NXDQRTJOEZNHEUF2NVU67EA/linux-jdk9-m3.5.x_build/target/invoker-reports/BUILD-cli-options_endian-big.xml,
/home/jenkins/jenkins-slave/workspace/_maven-jlink-plugin_CLEANUP-YYRC5VLF7HAIAIEICXGYPF25BOQW6NXDQRTJOEZNHEUF2NVU67EA/linux-jdk9-m3.5.x_build/target/invoker-reports/BUILD-cli-options_endian.xml,
/home/jenkins/jenkins-slave/workspace/_maven-jlink-plugin_CLEANUP-YYRC5VLF7HAIAIEICXGYPF25BOQW6NXDQRTJOEZNHEUF2NVU67EA/linux-jdk9-m3.5.x_build/target/invoker-reports/BUILD-cli-options_ignore-signing-information.xml,
/home/jenkins/jenkins-slave/workspace/_maven-jlink-plugin_CLEANUP-YYRC5VLF7HAIAIEICXGYPF25BOQW6NXDQRTJOEZNHEUF2NVU67EA/linux-jdk9-m3.5.x_build/target/invoker-reports/BUILD-cli-options_no-header-files.xml,
/home/jenkins/jenkins-slave/workspace/_maven-jlink-plugin_CLEANUP-YYRC5VLF7HAIAIEICXGYPF25BOQW6NXDQRTJOEZNHEUF2NVU67EA/linux-jdk9-m3.5.x_build/target/invoker-reports/BUILD-cli-options_no-man-pages.xml,
/home/jenkins/jenkins-slave/workspace/_maven-jlink-plugin_CLEANUP-YYRC5VLF7HAIAIEICXGYPF25BOQW6NXDQRTJOEZNHEUF2NVU67EA/linux-jdk9-m3.5.x_build/target/invoker-reports/BUILD-cli-options_strip-debug.xml,
/home/jenkins/jenkins-slave/workspace/_maven-jlink-plugin_CLEANUP-YYRC5VLF7HAIAIEICXGYPF25BOQW6NXDQRTJOEZNHEUF2NVU67EA/linux-jdk9-m3.5.x_build/target/invoker-reports/BUILD-setup-jar-module-info.xml,
/home/jenkins/jenkins-slave/workspace/_maven-jlink-plugin_CLEANUP-YYRC5VLF7HAIAIEICXGYPF25BOQW6NXDQRTJOEZNHEUF2NVU67EA/linux-jdk9-m3.5.x_build/target/invoker-reports/BUILD-setup-jar.xml]
[linux-jdk9-m3.5.x_build] Found logs:[/home/jenkins/jenkins-slave/workspace/_maven-jlink-plugin_CLEANUP-YYRC5VLF7HAIAIEICXGYPF25BOQW6NXDQRTJOEZNHEUF2NVU67EA/linux-jdk9-m3.5.x_build/target/it/MJLINK-3_improveVerboseOutput/build.log,
/home/jenkins/jenkins-slave/workspace/_maven-jlink-plugin_CLEANUP-YYRC5VLF7HAIAIEICXGYPF25BOQW6NXDQRTJOEZNHEUF2NVU67EA/linux-jdk9-m3.5.x_build/target/it/MJLINK-4_dependencyResolution/build.log,
/home/jenkins/jenkins-slave/workspace/_maven-jlink-plugin_CLEANUP-YYRC5VLF7HAIAIEICXGYPF25BOQW6NXDQRTJOEZNHEUF2NVU67EA/linux-jdk9-m3.5.x_build/target/it/cli-options/bind-services/build.log,
/home/jenkins/jenkins-slave/workspace/_maven-jlink-plugin_CLEANUP-YYRC5VLF7HAIAIEICXGYPF25BOQW6NXDQRTJOEZNHEUF2NVU67EA/linux-jdk9-m3.5.x_build/target/it/cli-options/compress-0/build.log,
/home/jenkins/jenkins-slave/workspace/_maven-jlink-plugin_CLEANUP-YYRC5VLF7HAIAIEICXGYPF25BOQW6NXDQRTJOEZNHEUF2NVU67EA/linux-jdk9-m3.5.x_build/target/it/cli-options/compress-1/build.log,
/home/jenkins/jenkins-slave/workspace/_maven-jlink-plugin_CLEANUP-YYRC5VLF7HAIAIEICXGYPF25BOQW6NXDQRTJOEZNHEUF2NVU67EA/linux-jdk9-m3.5.x_build/target/it/cli-options/compress-2/build.log,
/home/jenkins/jenkins-slave/workspace/_maven-jlink-plugin_CLEANUP-YYRC5VLF7HAIAIEICXGYPF25BOQW6NXDQRTJOEZNHEUF2NVU67EA/linux-jdk9-m3.5.x_build/target/it/cli-options/disable-plugin/build.log,
/home/jenkins/jenkins-slave/workspace/_maven-jlink-plugin_CLEANUP-YYRC5VLF7HAIAIEICXGYPF25BOQW6NXDQRTJOEZNHEUF2NVU67EA/linux-jdk9-m3.5.x_build/target/it/cli-options/endian-big/build.log,
/home/jenkins/jenkins-slave/workspace/_maven-jlink-plugin_CLEANUP-YYRC5VLF7HAIAIEICXGYPF25BOQW6NXDQRTJOEZNHEUF2NVU67EA/linux-jdk9-m3.5.x_build/target/it/cli-options/endian/build.log,
/home/jenkins/jenkins-slave/workspace/_maven-jlink-plugin_CLEANUP-YYRC5VLF7HAIAIEICXGYPF25BOQW6NXDQRTJOEZNHEUF2NVU67EA/linux-jdk9-m3.5.x_build/target/it/cli-options/ignore-signing-information/build.log,
/home/jenkins/jenkins-slave/workspace/_maven-jlink-plugin_CLEANUP-YYRC5VLF7HAIAIEICXGYPF25BOQW6NXDQRTJOEZNHEUF2NVU67EA/linux-jdk9-m3.5.x_build/target/it/cli-options/no-header-files/build.log,
/home/jenkins/jenkins-slave/workspace/_maven-jlink-plugin_CLEANUP-YYRC5VLF7HAIAIEICXGYPF25BOQW6NXDQRTJOEZNHEUF2NVU67EA/linux-jdk9-m3.5.x_build/target/it/cli-options/no-man-pages/build.log,
/home/jenkins/jenkins-slave/workspace/_maven-jlink-plugin_CLEANUP-YYRC5VLF7HAIAIEICXGYPF25BOQW6NXDQRTJOEZNHEUF2NVU67EA/linux-jdk9-m3.5.x_build/target/it/cli-options/strip-debug/build.log,
/home/jenkins/jenkins-slave/workspace/_maven-jlink-plugin_CLEANUP-YYRC5VLF7HAIAIEICXGYPF25BOQW6NXDQRTJOEZNHEUF2NVU67EA/linux-jdk9-m3.5.x_build/target/it/setup-jar-module-info/build.log,
/home/jenkins/jenkins-slave/workspace/_maven-jlink-plugin_CLEANUP-YYRC5VLF7HAIAIEICXGYPF25BOQW6NXDQRTJOEZNHEUF2NVU67EA/linux-jdk9-m3.5.x_build/target/it/setup-jar/build.log]
[linux-jdk9-m3.5.x_build] Finished parsing Maven Invoker results (found 15)
[linux-jdk9-m3.5.x_build] [withMaven] junitPublisher - Archive test results for Maven artifact
org.apache.maven.plugins:maven-jlink-plugin:3.0.0-alpha-2-SNAPSHOT generated by maven-surefire-plugin:test
(default-test): linux-jdk9-m3.5.x_build/target/surefire-reports/*.xml
[linux-jdk9-m3.5.x_build] Recording test results
[linux-jdk9-m3.5.x_build] [withMaven] openTasksPublisher - Scan Tasks for Maven artifact org.apache.maven.plugins:maven-jlink-plugin:3.0.0-alpha-2-SNAPSHOT
in source directory linux-jdk9-m3.5.x_build/src/main/java
[linux-jdk9-m3.5.x_build] [TASKS] Scanning folder '/home/jenkins/jenkins-slave/workspace/_maven-jlink-plugin_CLEANUP-YYRC5VLF7HAIAIEICXGYPF25BOQW6NXDQRTJOEZNHEUF2NVU67EA'
for files matching the pattern 'linux-jdk9-m3.5.x_build/src/main/java/**/*' - excludes: null
[linux-jdk9-m3.5.x_build] [TASKS] Found 2 files to scan for tasks
[linux-jdk9-m3.5.x_build] [TASKS] Found 5 open tasks.
[linux-jdk9-m3.5.x_build] Skipping warnings blame since pipelines do not have an SCM link.%n
[Pipeline] [linux-jdk9-m3.5.x_build] // withMaven
[Pipeline] [linux-jdk9-m3.5.x_build] cleanWs
[Pipeline] [linux-jdk10-m3.5.x_build] }
[Pipeline] [linux-jdk10-m3.5.x_build] // dir
[linux-jdk9-m3.5.x_build] [WS-CLEANUP] Deleting project workspace...[WS-CLEANUP] done
[Pipeline] [linux-jdk10-m3.5.x_build] }
[linux-jdk10-m3.5.x_build] [Fast Archiver] No prior successful build to compare, so performing
full copy of artifacts
[linux-jdk10-m3.5.x_build] [withMaven] invokerPublisher - Archive invoker results for Maven
artifact MavenArtifact{org.apache.maven.plugins:maven-jlink-plugin::3.0.0-alpha-2-SNAPSHOT(version:
3.0.0-alpha-2-SNAPSHOT, snapshot:false) } generated by PluginInvocation{org.apache.maven.plugins:maven-invoker-plugin:3.1.0@integration-test
 integration-test}: linux-jdk10-m3.5.x_build/target/invoker-reports/*.xml
[linux-jdk10-m3.5.x_build] performing MavenInvokerRecorder, reportsFilenamePattern:'**/linux-jdk10-m3.5.x_build/target/invoker-reports/BUILD*.xml',
invokerBuildDir:'**/linux-jdk10-m3.5.x_build/target/it'
[linux-jdk10-m3.5.x_build] Found reports:[/home/jenkins/jenkins-slave/workspace/_maven-jlink-plugin_CLEANUP-YYRC5VLF7HAIAIEICXGYPF25BOQW6NXDQRTJOEZNHEUF2NVU67EA@2/linux-jdk10-m3.5.x_build/target/invoker-reports/BUILD-MJLINK-3_improveVerboseOutput.xml,
/home/jenkins/jenkins-slave/workspace/_maven-jlink-plugin_CLEANUP-YYRC5VLF7HAIAIEICXGYPF25BOQW6NXDQRTJOEZNHEUF2NVU67EA@2/linux-jdk10-m3.5.x_build/target/invoker-reports/BUILD-MJLINK-4_dependencyResolution.xml,
/home/jenkins/jenkins-slave/workspace/_maven-jlink-plugin_CLEANUP-YYRC5VLF7HAIAIEICXGYPF25BOQW6NXDQRTJOEZNHEUF2NVU67EA@2/linux-jdk10-m3.5.x_build/target/invoker-reports/BUILD-cli-options_bind-services.xml,
/home/jenkins/jenkins-slave/workspace/_maven-jlink-plugin_CLEANUP-YYRC5VLF7HAIAIEICXGYPF25BOQW6NXDQRTJOEZNHEUF2NVU67EA@2/linux-jdk10-m3.5.x_build/target/invoker-reports/BUILD-cli-options_compress-0.xml,
/home/jenkins/jenkins-slave/workspace/_maven-jlink-plugin_CLEANUP-YYRC5VLF7HAIAIEICXGYPF25BOQW6NXDQRTJOEZNHEUF2NVU67EA@2/linux-jdk10-m3.5.x_build/target/invoker-reports/BUILD-cli-options_compress-1.xml,
/home/jenkins/jenkins-slave/workspace/_maven-jlink-plugin_CLEANUP-YYRC5VLF7HAIAIEICXGYPF25BOQW6NXDQRTJOEZNHEUF2NVU67EA@2/linux-jdk10-m3.5.x_build/target/invoker-reports/BUILD-cli-options_compress-2.xml,
/home/jenkins/jenkins-slave/workspace/_maven-jlink-plugin_CLEANUP-YYRC5VLF7HAIAIEICXGYPF25BOQW6NXDQRTJOEZNHEUF2NVU67EA@2/linux-jdk10-m3.5.x_build/target/invoker-reports/BUILD-cli-options_disable-plugin.xml,
/home/jenkins/jenkins-slave/workspace/_maven-jlink-plugin_CLEANUP-YYRC5VLF7HAIAIEICXGYPF25BOQW6NXDQRTJOEZNHEUF2NVU67EA@2/linux-jdk10-m3.5.x_build/target/invoker-reports/BUILD-cli-options_endian-big.xml,
/home/jenkins/jenkins-slave/workspace/_maven-jlink-plugin_CLEANUP-YYRC5VLF7HAIAIEICXGYPF25BOQW6NXDQRTJOEZNHEUF2NVU67EA@2/linux-jdk10-m3.5.x_build/target/invoker-reports/BUILD-cli-options_endian.xml,
/home/jenkins/jenkins-slave/workspace/_maven-jlink-plugin_CLEANUP-YYRC5VLF7HAIAIEICXGYPF25BOQW6NXDQRTJOEZNHEUF2NVU67EA@2/linux-jdk10-m3.5.x_build/target/invoker-reports/BUILD-cli-options_ignore-signing-information.xml,
/home/jenkins/jenkins-slave/workspace/_maven-jlink-plugin_CLEANUP-YYRC5VLF7HAIAIEICXGYPF25BOQW6NXDQRTJOEZNHEUF2NVU67EA@2/linux-jdk10-m3.5.x_build/target/invoker-reports/BUILD-cli-options_no-header-files.xml,
/home/jenkins/jenkins-slave/workspace/_maven-jlink-plugin_CLEANUP-YYRC5VLF7HAIAIEICXGYPF25BOQW6NXDQRTJOEZNHEUF2NVU67EA@2/linux-jdk10-m3.5.x_build/target/invoker-reports/BUILD-cli-options_no-man-pages.xml,
/home/jenkins/jenkins-slave/workspace/_maven-jlink-plugin_CLEANUP-YYRC5VLF7HAIAIEICXGYPF25BOQW6NXDQRTJOEZNHEUF2NVU67EA@2/linux-jdk10-m3.5.x_build/target/invoker-reports/BUILD-cli-options_strip-debug.xml,
/home/jenkins/jenkins-slave/workspace/_maven-jlink-plugin_CLEANUP-YYRC5VLF7HAIAIEICXGYPF25BOQW6NXDQRTJOEZNHEUF2NVU67EA@2/linux-jdk10-m3.5.x_build/target/invoker-reports/BUILD-setup-jar-module-info.xml,
/home/jenkins/jenkins-slave/workspace/_maven-jlink-plugin_CLEANUP-YYRC5VLF7HAIAIEICXGYPF25BOQW6NXDQRTJOEZNHEUF2NVU67EA@2/linux-jdk10-m3.5.x_build/target/invoker-reports/BUILD-setup-jar.xml]
[linux-jdk10-m3.5.x_build] Found logs:[/home/jenkins/jenkins-slave/workspace/_maven-jlink-plugin_CLEANUP-YYRC5VLF7HAIAIEICXGYPF25BOQW6NXDQRTJOEZNHEUF2NVU67EA@2/linux-jdk10-m3.5.x_build/target/it/MJLINK-3_improveVerboseOutput/build.log,
/home/jenkins/jenkins-slave/workspace/_maven-jlink-plugin_CLEANUP-YYRC5VLF7HAIAIEICXGYPF25BOQW6NXDQRTJOEZNHEUF2NVU67EA@2/linux-jdk10-m3.5.x_build/target/it/MJLINK-4_dependencyResolution/build.log,
/home/jenkins/jenkins-slave/workspace/_maven-jlink-plugin_CLEANUP-YYRC5VLF7HAIAIEICXGYPF25BOQW6NXDQRTJOEZNHEUF2NVU67EA@2/linux-jdk10-m3.5.x_build/target/it/cli-options/bind-services/build.log,
/home/jenkins/jenkins-slave/workspace/_maven-jlink-plugin_CLEANUP-YYRC5VLF7HAIAIEICXGYPF25BOQW6NXDQRTJOEZNHEUF2NVU67EA@2/linux-jdk10-m3.5.x_build/target/it/cli-options/compress-0/build.log,
/home/jenkins/jenkins-slave/workspace/_maven-jlink-plugin_CLEANUP-YYRC5VLF7HAIAIEICXGYPF25BOQW6NXDQRTJOEZNHEUF2NVU67EA@2/linux-jdk10-m3.5.x_build/target/it/cli-options/compress-1/build.log,
/home/jenkins/jenkins-slave/workspace/_maven-jlink-plugin_CLEANUP-YYRC5VLF7HAIAIEICXGYPF25BOQW6NXDQRTJOEZNHEUF2NVU67EA@2/linux-jdk10-m3.5.x_build/target/it/cli-options/compress-2/build.log,
/home/jenkins/jenkins-slave/workspace/_maven-jlink-plugin_CLEANUP-YYRC5VLF7HAIAIEICXGYPF25BOQW6NXDQRTJOEZNHEUF2NVU67EA@2/linux-jdk10-m3.5.x_build/target/it/cli-options/disable-plugin/build.log,
/home/jenkins/jenkins-slave/workspace/_maven-jlink-plugin_CLEANUP-YYRC5VLF7HAIAIEICXGYPF25BOQW6NXDQRTJOEZNHEUF2NVU67EA@2/linux-jdk10-m3.5.x_build/target/it/cli-options/endian-big/build.log,
/home/jenkins/jenkins-slave/workspace/_maven-jlink-plugin_CLEANUP-YYRC5VLF7HAIAIEICXGYPF25BOQW6NXDQRTJOEZNHEUF2NVU67EA@2/linux-jdk10-m3.5.x_build/target/it/cli-options/endian/build.log,
/home/jenkins/jenkins-slave/workspace/_maven-jlink-plugin_CLEANUP-YYRC5VLF7HAIAIEICXGYPF25BOQW6NXDQRTJOEZNHEUF2NVU67EA@2/linux-jdk10-m3.5.x_build/target/it/cli-options/ignore-signing-information/build.log,
/home/jenkins/jenkins-slave/workspace/_maven-jlink-plugin_CLEANUP-YYRC5VLF7HAIAIEICXGYPF25BOQW6NXDQRTJOEZNHEUF2NVU67EA@2/linux-jdk10-m3.5.x_build/target/it/cli-options/no-header-files/build.log,
/home/jenkins/jenkins-slave/workspace/_maven-jlink-plugin_CLEANUP-YYRC5VLF7HAIAIEICXGYPF25BOQW6NXDQRTJOEZNHEUF2NVU67EA@2/linux-jdk10-m3.5.x_build/target/it/cli-options/no-man-pages/build.log,
/home/jenkins/jenkins-slave/workspace/_maven-jlink-plugin_CLEANUP-YYRC5VLF7HAIAIEICXGYPF25BOQW6NXDQRTJOEZNHEUF2NVU67EA@2/linux-jdk10-m3.5.x_build/target/it/cli-options/strip-debug/build.log,
/home/jenkins/jenkins-slave/workspace/_maven-jlink-plugin_CLEANUP-YYRC5VLF7HAIAIEICXGYPF25BOQW6NXDQRTJOEZNHEUF2NVU67EA@2/linux-jdk10-m3.5.x_build/target/it/setup-jar-module-info/build.log,
/home/jenkins/jenkins-slave/workspace/_maven-jlink-plugin_CLEANUP-YYRC5VLF7HAIAIEICXGYPF25BOQW6NXDQRTJOEZNHEUF2NVU67EA@2/linux-jdk10-m3.5.x_build/target/it/setup-jar/build.log]
[linux-jdk10-m3.5.x_build] Finished parsing Maven Invoker results (found 15)
[linux-jdk10-m3.5.x_build] [withMaven] junitPublisher - Archive test results for Maven artifact
org.apache.maven.plugins:maven-jlink-plugin:3.0.0-alpha-2-SNAPSHOT generated by maven-surefire-plugin:test
(default-test): linux-jdk10-m3.5.x_build/target/surefire-reports/*.xml
[linux-jdk10-m3.5.x_build] Recording test results
[linux-jdk10-m3.5.x_build] [withMaven] openTasksPublisher - Scan Tasks for Maven artifact
org.apache.maven.plugins:maven-jlink-plugin:3.0.0-alpha-2-SNAPSHOT in source directory linux-jdk10-m3.5.x_build/src/main/java
[linux-jdk10-m3.5.x_build] [TASKS] Scanning folder '/home/jenkins/jenkins-slave/workspace/_maven-jlink-plugin_CLEANUP-YYRC5VLF7HAIAIEICXGYPF25BOQW6NXDQRTJOEZNHEUF2NVU67EA@2'
for files matching the pattern 'linux-jdk10-m3.5.x_build/src/main/java/**/*' - excludes: null
[linux-jdk10-m3.5.x_build] [TASKS] Found 2 files to scan for tasks
[linux-jdk10-m3.5.x_build] [TASKS] Found 5 open tasks.
[linux-jdk10-m3.5.x_build] Skipping warnings blame since pipelines do not have an SCM link.%n
[Pipeline] [linux-jdk10-m3.5.x_build] // withMaven
[Pipeline] [linux-jdk9-m3.5.x_build] cleanWs
[Pipeline] [linux-jdk10-m3.5.x_build] cleanWs
[linux-jdk9-m3.5.x_build] [WS-CLEANUP] Deleting project workspace...[WS-CLEANUP] done
[linux-jdk10-m3.5.x_build] [WS-CLEANUP] Deleting project workspace...[WS-CLEANUP] done
[Pipeline] [linux-jdk9-m3.5.x_build] }
[Pipeline] [linux-jdk9-m3.5.x_build] // stage
[Pipeline] [linux-jdk9-m3.5.x_build] }
[Pipeline] [linux-jdk10-m3.5.x_build] cleanWs
[Pipeline] [linux-jdk9-m3.5.x_build] // node
[Pipeline] [linux-jdk9-m3.5.x_build] }
[linux-jdk9-m3.5.x_build] Failed in branch linux-jdk9-m3.5.x_build
[linux-jdk10-m3.5.x_build] [WS-CLEANUP] Deleting project workspace...[WS-CLEANUP] done
[Pipeline] [linux-jdk10-m3.5.x_build] }
[Pipeline] [linux-jdk10-m3.5.x_build] // stage
[Pipeline] [linux-jdk10-m3.5.x_build] }
[Pipeline] [linux-jdk10-m3.5.x_build] // node
[Pipeline] [linux-jdk10-m3.5.x_build] }
[linux-jdk10-m3.5.x_build] Failed in branch linux-jdk10-m3.5.x_build
[Pipeline] // parallel
[Pipeline] stage
[Pipeline] { (Notifications)
[Pipeline] echo
Build result: FAILURE
[Pipeline] jiraIssueSelector
[Pipeline] emailext
Mime
  • Unnamed multipart/mixed (inline, None, 0 bytes)
View raw message