maven-notifications mailing list archives

Site index · List index
Message view « Date » · « Thread »
Top « Date » · « Thread »
From Apache Jenkins Server <jenk...@builds.apache.org>
Subject Build failed in Jenkins: Maven TLP » maven-wagon » WAGON-482 #12
Date Thu, 13 Sep 2018 18:12:14 GMT
See https://builds.apache.org/job/maven-box/job/maven-wagon/job/WAGON-482/12/

No changes.

6 tests failed.
FAILED:  org.apache.maven.wagon.providers.scm.ScmSvnExeWagonTest.testWagonPutDirectoryDeepDestination

Error Message:
Error checking out: Unable to commit file. The svn command failed. svn: E180001: Unable to
connect to a repository at URL 'file://2/m/wagon-providers/wagon-scm/target/test-classes/test-repo-svn-test'
svn: E180001: Unable to open an ra_local session to URL
svn: E180001: Unable to open repository 'file://2/m/wagon-providers/wagon-scm/target/test-classes/test-repo-svn-test'


Stack Trace:
org.apache.maven.wagon.TransferFailedException: 
Error checking out: Unable to commit file. The svn command failed. svn: E180001: Unable to
connect to a repository at URL 'file://2/m/wagon-providers/wagon-scm/target/test-classes/test-repo-svn-test'
svn: E180001: Unable to open an ra_local session to URL
svn: E180001: Unable to open repository 'file://2/m/wagon-providers/wagon-scm/target/test-classes/test-repo-svn-test'

Caused by: org.apache.maven.scm.ScmException: 
Unable to commit file. The svn command failed. svn: E180001: Unable to connect to a repository
at URL 'file://2/m/wagon-providers/wagon-scm/target/test-classes/test-repo-svn-test'
svn: E180001: Unable to open an ra_local session to URL
svn: E180001: Unable to open repository 'file://2/m/wagon-providers/wagon-scm/target/test-classes/test-repo-svn-test'



FAILED:  org.apache.maven.wagon.providers.scm.ScmSvnExeWagonTest.testWagonPutDirectoryForDot

Error Message:
Error checking out: Unable to commit file. The svn command failed. svn: E180001: Unable to
connect to a repository at URL 'file://2/m/wagon-providers/wagon-scm/target/test-classes/test-repo-svn-test'
svn: E180001: Unable to open an ra_local session to URL
svn: E180001: Unable to open repository 'file://2/m/wagon-providers/wagon-scm/target/test-classes/test-repo-svn-test'


Stack Trace:
org.apache.maven.wagon.TransferFailedException: 
Error checking out: Unable to commit file. The svn command failed. svn: E180001: Unable to
connect to a repository at URL 'file://2/m/wagon-providers/wagon-scm/target/test-classes/test-repo-svn-test'
svn: E180001: Unable to open an ra_local session to URL
svn: E180001: Unable to open repository 'file://2/m/wagon-providers/wagon-scm/target/test-classes/test-repo-svn-test'

Caused by: org.apache.maven.scm.ScmException: 
Unable to commit file. The svn command failed. svn: E180001: Unable to connect to a repository
at URL 'file://2/m/wagon-providers/wagon-scm/target/test-classes/test-repo-svn-test'
svn: E180001: Unable to open an ra_local session to URL
svn: E180001: Unable to open repository 'file://2/m/wagon-providers/wagon-scm/target/test-classes/test-repo-svn-test'



FAILED:  org.apache.maven.wagon.providers.scm.ScmSvnExeWagonTest.testWagonGetFileList

Error Message:

  Unexpected method call TransferListener.transferError(TransferEvent[GET|ERROR|Repository[scm:svn:file://2/m/wagon-providers/wagon-scm/target/test-classes/test-repo-svn-test]|null|file-list/test-resource.txt[len
= 18; mod = 1536862239411]]):
    TransferListener.transferCompleted(TransferEvent[PUT|COMPLETED|Repository[scm:svn:file://2/m/wagon-providers/wagon-scm/target/test-classes/test-repo-svn-test]|F:\jenkins\jenkins-slave\workspace\n-box_maven-wagon_WAGON-482-U5UQDLHLBEYZ6YKA2XFN2FQ74OK76EBRADZ4AK62MZWPJOQW2HDQ@2\m\wagon-providers\wagon-scm\target\test-output\file-list\test-resource.txt|file-list/test-resource.txt[len
= 18; mod = 1536862239411]]): expected: 1, actual: 0

Stack Trace:
java.lang.AssertionError: 

  Unexpected method call TransferListener.transferError(TransferEvent[GET|ERROR|Repository[scm:svn:file://2/m/wagon-providers/wagon-scm/target/test-classes/test-repo-svn-test]|null|file-list/test-resource.txt[len
= 18; mod = 1536862239411]]):
    TransferListener.transferCompleted(TransferEvent[PUT|COMPLETED|Repository[scm:svn:file://2/m/wagon-providers/wagon-scm/target/test-classes/test-repo-svn-test]|F:\jenkins\jenkins-slave\workspace\n-box_maven-wagon_WAGON-482-U5UQDLHLBEYZ6YKA2XFN2FQ74OK76EBRADZ4AK62MZWPJOQW2HDQ@2\m\wagon-providers\wagon-scm\target\test-output\file-list\test-resource.txt|file-list/test-resource.txt[len
= 18; mod = 1536862239411]]): expected: 1, actual: 0


FAILED:  org.apache.maven.wagon.providers.scm.ScmSvnExeWagonTest.testWagonPutDirectoryWhenDirectoryAlreadyExists

Error Message:
Error checking out: Unable to commit file. The svn command failed. svn: E180001: Unable to
connect to a repository at URL 'file://2/m/wagon-providers/wagon-scm/target/test-classes/test-repo-svn-test'
svn: E180001: Unable to open an ra_local session to URL
svn: E180001: Unable to open repository 'file://2/m/wagon-providers/wagon-scm/target/test-classes/test-repo-svn-test'


Stack Trace:
org.apache.maven.wagon.TransferFailedException: 
Error checking out: Unable to commit file. The svn command failed. svn: E180001: Unable to
connect to a repository at URL 'file://2/m/wagon-providers/wagon-scm/target/test-classes/test-repo-svn-test'
svn: E180001: Unable to open an ra_local session to URL
svn: E180001: Unable to open repository 'file://2/m/wagon-providers/wagon-scm/target/test-classes/test-repo-svn-test'

Caused by: org.apache.maven.scm.ScmException: 
Unable to commit file. The svn command failed. svn: E180001: Unable to connect to a repository
at URL 'file://2/m/wagon-providers/wagon-scm/target/test-classes/test-repo-svn-test'
svn: E180001: Unable to open an ra_local session to URL
svn: E180001: Unable to open repository 'file://2/m/wagon-providers/wagon-scm/target/test-classes/test-repo-svn-test'



FAILED:  org.apache.maven.wagon.providers.scm.ScmSvnExeWagonTest.testWagonResourceExists

Error Message:

  Unexpected method call TransferListener.transferError(TransferEvent[GET|ERROR|Repository[scm:svn:file://2/m/wagon-providers/wagon-scm/target/test-classes/test-repo-svn-test]|null|test-resource[len
= 18; mod = 1536862240267]]):
    TransferListener.transferCompleted(TransferEvent[PUT|COMPLETED|Repository[scm:svn:file://2/m/wagon-providers/wagon-scm/target/test-classes/test-repo-svn-test]|F:\jenkins\jenkins-slave\workspace\n-box_maven-wagon_WAGON-482-U5UQDLHLBEYZ6YKA2XFN2FQ74OK76EBRADZ4AK62MZWPJOQW2HDQ@2\m\wagon-providers\wagon-scm\target\test-output\test-resource|test-resource[len
= 18; mod = 1536862240267]]): expected: 1, actual: 0

Stack Trace:
java.lang.AssertionError: 

  Unexpected method call TransferListener.transferError(TransferEvent[GET|ERROR|Repository[scm:svn:file://2/m/wagon-providers/wagon-scm/target/test-classes/test-repo-svn-test]|null|test-resource[len
= 18; mod = 1536862240267]]):
    TransferListener.transferCompleted(TransferEvent[PUT|COMPLETED|Repository[scm:svn:file://2/m/wagon-providers/wagon-scm/target/test-classes/test-repo-svn-test]|F:\jenkins\jenkins-slave\workspace\n-box_maven-wagon_WAGON-482-U5UQDLHLBEYZ6YKA2XFN2FQ74OK76EBRADZ4AK62MZWPJOQW2HDQ@2\m\wagon-providers\wagon-scm\target\test-output\test-resource|test-resource[len
= 18; mod = 1536862240267]]): expected: 1, actual: 0


FAILED:  org.apache.maven.wagon.providers.scm.ScmSvnExeWagonTest.testWagonPutDirectory

Error Message:
Error checking out: Unable to commit file. The svn command failed. svn: E180001: Unable to
connect to a repository at URL 'file://2/m/wagon-providers/wagon-scm/target/test-classes/test-repo-svn-test'
svn: E180001: Unable to open an ra_local session to URL
svn: E180001: Unable to open repository 'file://2/m/wagon-providers/wagon-scm/target/test-classes/test-repo-svn-test'


Stack Trace:
org.apache.maven.wagon.TransferFailedException: 
Error checking out: Unable to commit file. The svn command failed. svn: E180001: Unable to
connect to a repository at URL 'file://2/m/wagon-providers/wagon-scm/target/test-classes/test-repo-svn-test'
svn: E180001: Unable to open an ra_local session to URL
svn: E180001: Unable to open repository 'file://2/m/wagon-providers/wagon-scm/target/test-classes/test-repo-svn-test'

Caused by: org.apache.maven.scm.ScmException: 
Unable to commit file. The svn command failed. svn: E180001: Unable to connect to a repository
at URL 'file://2/m/wagon-providers/wagon-scm/target/test-classes/test-repo-svn-test'
svn: E180001: Unable to open an ra_local session to URL
svn: E180001: Unable to open repository 'file://2/m/wagon-providers/wagon-scm/target/test-classes/test-repo-svn-test'





Build log:
[...truncated 2.98 MB...]
[windows-jdk9] [INFO] Downloaded from central: https://repo.maven.apache.org/maven2/it/could/webdav/0.4/webdav-0.4.jar
(103 kB at 2.1 MB/s)
[windows-jdk9] [INFO] Downloaded from central: https://repo.maven.apache.org/maven2/org/apache/jackrabbit/jackrabbit-webdav/2.14.1/jackrabbit-webdav-2.14.1.jar
(364 kB at 6.5 MB/s)
[windows-jdk9] [INFO] Downloaded from central: https://repo.maven.apache.org/maven2/javax/servlet/servlet-api/2.3/servlet-api-2.3.jar
(78 kB at 1.3 MB/s)
[windows-jdk9] [INFO] Downloaded from central: https://repo.maven.apache.org/maven2/biz/aQute/bnd/1.50.0/bnd-1.50.0.jar
(828 kB at 12 MB/s)
[windows-jdk9] [INFO] 
[windows-jdk9] [INFO] --- maven-clean-plugin:2.5:clean (default-clean) @ wagon-webdav-jackrabbit
---
[windows-jdk9] [INFO] 
[windows-jdk9] [INFO] --- maven-enforcer-plugin:1.3.1:enforce (enforce-bytecode-version) @
wagon-webdav-jackrabbit ---
[windows-jdk9] [INFO] 
[windows-jdk9] [INFO] --- maven-enforcer-plugin:1.3.1:enforce (ban-known-bad-maven-versions)
@ wagon-webdav-jackrabbit ---
[windows-jdk9] [INFO] 
[windows-jdk9] [INFO] --- maven-enforcer-plugin:1.3.1:enforce (default) @ wagon-webdav-jackrabbit
---
[windows-jdk9] [INFO] 
[windows-jdk9] [INFO] --- apache-rat-plugin:0.11:check (rat-check) @ wagon-webdav-jackrabbit
---
[windows-jdk9] [INFO] 51 implicit excludes (use -debug for more details).
[windows-jdk9] [INFO] Exclude: .checkstyle
[windows-jdk9] [INFO] Exclude: **/*.odg
[windows-jdk9] [INFO] Exclude: src/test/resources/**
[windows-jdk9] [INFO] Exclude: src/main/resources/default-server-root/**
[windows-jdk9] [INFO] Exclude: src/main/resources/ssh-keys/**
[windows-jdk9] [INFO] Exclude: src/test/ssh-keys/**
[windows-jdk9] [INFO] Exclude: .repository/**
[windows-jdk9] [INFO] Exclude: out/**
[windows-jdk9] [INFO] Exclude: DEPENDENCIES
[windows-jdk9] [INFO] 12 resources included (use -debug for more details)
[windows-jdk9] [INFO] Rat check: Summary of files. Unapproved: 0 unknown: 0 generated: 0 approved:
12 licence.
[windows-jdk9] [INFO] 
[windows-jdk9] [INFO] --- maven-remote-resources-plugin:1.5:process (default) @ wagon-webdav-jackrabbit
---
[windows-jdk9] [INFO] 
[windows-jdk9] [INFO] --- maven-resources-plugin:2.7:resources (default-resources) @ wagon-webdav-jackrabbit
---
[windows-jdk9] [INFO] Using 'UTF-8' encoding to copy filtered resources.
[windows-jdk9] [INFO] Copying 1 resource
[windows-jdk9] [INFO] Copying 3 resources
[windows-jdk9] [INFO] 
[windows-jdk9] [INFO] --- maven-compiler-plugin:3.2:compile (default-compile) @ wagon-webdav-jackrabbit
---
[windows-jdk9] [INFO] Changes detected - recompiling the module!
[windows-jdk9] [INFO] Compiling 4 source files to F:\jenkins\jenkins-slave\workspace\n-box_maven-wagon_WAGON-482-U5UQDLHLBEYZ6YKA2XFN2FQ74OK76EBRADZ4AK62MZWPJOQW2HDQ@2\m\wagon-providers\wagon-webdav-jackrabbit\target\classes
[windows-jdk9] [INFO] /F:/jenkins/jenkins-slave/workspace/n-box_maven-wagon_WAGON-482-U5UQDLHLBEYZ6YKA2XFN2FQ74OK76EBRADZ4AK62MZWPJOQW2HDQ@2/m/wagon-providers/wagon-webdav-jackrabbit/src/main/java/org/apache/maven/wagon/providers/webdav/WebDavWagon.java:
F:\jenkins\jenkins-slave\workspace\n-box_maven-wagon_WAGON-482-U5UQDLHLBEYZ6YKA2XFN2FQ74OK76EBRADZ4AK62MZWPJOQW2HDQ@2\m\wagon-providers\wagon-webdav-jackrabbit\src\main\java\org\apache\maven\wagon\providers\webdav\WebDavWagon.java
uses or overrides a deprecated API.
[windows-jdk9] [INFO] /F:/jenkins/jenkins-slave/workspace/n-box_maven-wagon_WAGON-482-U5UQDLHLBEYZ6YKA2XFN2FQ74OK76EBRADZ4AK62MZWPJOQW2HDQ@2/m/wagon-providers/wagon-webdav-jackrabbit/src/main/java/org/apache/maven/wagon/providers/webdav/WebDavWagon.java:
Recompile with -Xlint:deprecation for details.
[windows-jdk9] [INFO] 
[windows-jdk9] [INFO] --- plexus-component-metadata:1.5.5:generate-metadata (generate) @ wagon-webdav-jackrabbit
---
[windows-jdk9] [INFO] Discovered 1 component descriptors(s)
[windows-jdk9] [INFO] 
[windows-jdk9] [INFO] --- animal-sniffer-maven-plugin:1.15:check (check-java-1.7-compat) @
wagon-webdav-jackrabbit ---
[windows-jdk9] [INFO] Checking unresolved references to org.codehaus.mojo.signature:java17:1.0
[windows-jdk9] [INFO] 
[windows-jdk9] [INFO] --- maven-resources-plugin:2.7:testResources (default-testResources)
@ wagon-webdav-jackrabbit ---
[windows-jdk9] [INFO] Using 'UTF-8' encoding to copy filtered resources.
[windows-jdk9] [INFO] Copying 2 resources
[windows-jdk9] [INFO] Copying 3 resources
[windows-jdk9] [INFO] 
[windows-jdk9] [INFO] --- maven-compiler-plugin:3.2:testCompile (default-testCompile) @ wagon-webdav-jackrabbit
---
[windows-jdk9] [INFO] Changes detected - recompiling the module!
[windows-jdk9] [INFO] Compiling 4 source files to F:\jenkins\jenkins-slave\workspace\n-box_maven-wagon_WAGON-482-U5UQDLHLBEYZ6YKA2XFN2FQ74OK76EBRADZ4AK62MZWPJOQW2HDQ@2\m\wagon-providers\wagon-webdav-jackrabbit\target\test-classes
[windows-jdk9] [INFO] /F:/jenkins/jenkins-slave/workspace/n-box_maven-wagon_WAGON-482-U5UQDLHLBEYZ6YKA2XFN2FQ74OK76EBRADZ4AK62MZWPJOQW2HDQ@2/m/wagon-providers/wagon-webdav-jackrabbit/src/test/java/org/apache/maven/wagon/providers/webdav/HttpClientWagonTest.java:
F:\jenkins\jenkins-slave\workspace\n-box_maven-wagon_WAGON-482-U5UQDLHLBEYZ6YKA2XFN2FQ74OK76EBRADZ4AK62MZWPJOQW2HDQ@2\m\wagon-providers\wagon-webdav-jackrabbit\src\test\java\org\apache\maven\wagon\providers\webdav\HttpClientWagonTest.java
uses or overrides a deprecated API.
[windows-jdk9] [INFO] /F:/jenkins/jenkins-slave/workspace/n-box_maven-wagon_WAGON-482-U5UQDLHLBEYZ6YKA2XFN2FQ74OK76EBRADZ4AK62MZWPJOQW2HDQ@2/m/wagon-providers/wagon-webdav-jackrabbit/src/test/java/org/apache/maven/wagon/providers/webdav/HttpClientWagonTest.java:
Recompile with -Xlint:deprecation for details.
[windows-jdk9] [INFO] 
[windows-jdk9] [INFO] --- maven-surefire-plugin:2.20:test (default-test) @ wagon-webdav-jackrabbit
---
[windows-jdk9] [INFO] 
[windows-jdk9] [INFO] -------------------------------------------------------
[windows-jdk9] [INFO]  T E S T S
[windows-jdk9] [INFO] -------------------------------------------------------
[windows-jdk9] [INFO] Running org.apache.maven.wagon.providers.webdav.HttpClientWagonTest
[windows-jdk9] [INFO] Tests run: 6, Failures: 0, Errors: 0, Skipped: 0, Time elapsed: 1.247
s - in org.apache.maven.wagon.providers.webdav.HttpClientWagonTest
[windows-jdk9] [INFO] Running org.apache.maven.wagon.providers.webdav.PathNavigatorTest
[windows-jdk9] [INFO] Tests run: 1, Failures: 0, Errors: 0, Skipped: 0, Time elapsed: 0 s
- in org.apache.maven.wagon.providers.webdav.PathNavigatorTest
[windows-jdk9] [INFO] Running org.apache.maven.wagon.providers.webdav.WebDavsWagonTest
[windows-jdk8] [INFO] Tests run: 69, Failures: 0, Errors: 0, Skipped: 0, Time elapsed: 27.858
s - in org.apache.maven.wagon.providers.webdav.WebDavWagonTest
[windows-jdk8] [INFO] 
[windows-jdk8] [INFO] Results:
[windows-jdk8] [INFO] 
[windows-jdk8] [INFO] Tests run: 145, Failures: 0, Errors: 0, Skipped: 0
[windows-jdk8] [INFO] 
[windows-jdk8] [INFO] 
[windows-jdk8] [INFO] --- maven-jar-plugin:2.5:jar (default-jar) @ wagon-webdav-jackrabbit
---
[windows-jdk8] [INFO] Building jar: F:\jenkins\jenkins-slave\workspace\n-box_maven-wagon_WAGON-482-U5UQDLHLBEYZ6YKA2XFN2FQ74OK76EBRADZ4AK62MZWPJOQW2HDQ\m\wagon-providers\wagon-webdav-jackrabbit\target\wagon-webdav-jackrabbit-3.0.1-SNAPSHOT.jar
[windows-jdk8] [INFO] 
[windows-jdk8] [INFO] --- maven-site-plugin:3.4:attach-descriptor (attach-descriptor) @ wagon-webdav-jackrabbit
---
[windows-jdk8] [INFO] 
[windows-jdk8] [INFO] --- maven-checkstyle-plugin:2.15:check (checkstyle-check) @ wagon-webdav-jackrabbit
---
[windows-jdk8] [INFO] ------------------------------------------------------------------------
[windows-jdk8] [INFO] Reactor Summary:
[windows-jdk8] [INFO] 
[windows-jdk8] [INFO] Apache Maven Wagon ................................. SUCCESS [ 41.263
s]
[windows-jdk8] [INFO] Apache Maven Wagon :: API .......................... SUCCESS [ 18.569
s]
[windows-jdk8] [INFO] Apache Maven Wagon :: Provider Test ................ SUCCESS [  5.999
s]
[windows-jdk8] [INFO] Apache Maven Wagon :: Providers .................... SUCCESS [  1.774
s]
[windows-jdk8] [INFO] Apache Maven Wagon :: Providers :: File Provider ... SUCCESS [  4.800
s]
[windows-jdk8] [INFO] Apache Maven Wagon :: Providers :: FTP Provider .... SUCCESS [ 11.213
s]
[windows-jdk8] [INFO] Apache Maven Wagon :: Providers :: HTTP Shared Library SUCCESS [  6.817
s]
[windows-jdk8] [INFO] Apache Maven Wagon :: Test Compatibility Kits ...... SUCCESS [  1.636
s]
[windows-jdk8] [INFO] Apache Maven Wagon :: HTTP Test Compatibility Kit .. SUCCESS [  3.963
s]
[windows-jdk8] [INFO] Apache Maven Wagon :: Providers :: HTTP Provider ... SUCCESS [05:12
min]
[windows-jdk8] [INFO] Apache Maven Wagon :: Providers :: Lightweight HTTP Provider SUCCESS
[02:18 min]
[windows-jdk8] [INFO] Apache Maven Wagon :: Providers :: SCM Provider .... SUCCESS [ 28.134
s]
[windows-jdk8] [INFO] Apache Maven Wagon :: Providers :: SSH Common Library SUCCESS [  4.367
s]
[windows-jdk8] [INFO] Apache Maven Wagon :: Providers :: SSH Common Tests  SUCCESS [  4.130
s]
[windows-jdk8] [INFO] Apache Maven Wagon :: Providers :: SSH External Provider SUCCESS [ 
2.412 s]
[windows-jdk8] [INFO] Apache Maven Wagon :: Providers :: SSH Provider .... SUCCESS [  5.981
s]
[windows-jdk8] [INFO] Apache Maven Wagon :: Providers :: WebDAV Provider . SUCCESS [01:09
min]
[windows-jdk8] [INFO] ------------------------------------------------------------------------
[windows-jdk8] [INFO] BUILD SUCCESS
[windows-jdk8] [INFO] ------------------------------------------------------------------------
[windows-jdk8] [INFO] Total time: 11:06 min
[windows-jdk8] [INFO] Finished at: 2018-09-13T11:11:14-07:00
[windows-jdk8] [INFO] Final Memory: 64M/518M
[windows-jdk8] [INFO] ------------------------------------------------------------------------
[windows-jdk8] [WARNING] The requested profile "run-its" could not be activated because it
does not exist.
[windows-jdk8] [INFO] [jenkins-event-spy] Generated F:\jenkins\jenkins-slave\workspace\n-box_maven-wagon_WAGON-482-U5UQDLHLBEYZ6YKA2XFN2FQ74OK76EBRADZ4AK62MZWPJOQW2HDQ@tmp\withMaven00bcd6b1\maven-spy-20180913-110007-879701167090828129155.log
[windows-jdk8] Picked up JAVA_TOOL_OPTIONS: -Dmaven.ext.class.path="f:\jenkins\jenkins-slave\workspace\n-box_maven-wagon_WAGON-482-U5UQDLHLBEYZ6YKA2XFN2FQ74OK76EBRADZ4AK62MZWPJOQW2HDQ@tmp\withMaven00bcd6b1\pipeline-maven-spy.jar"
-Dorg.jenkinsci.plugins.pipeline.maven.reportsFolder="f:\jenkins\jenkins-slave\workspace\n-box_maven-wagon_WAGON-482-U5UQDLHLBEYZ6YKA2XFN2FQ74OK76EBRADZ4AK62MZWPJOQW2HDQ@tmp\withMaven00bcd6b1"

[Pipeline] [windows-jdk8] }
[Pipeline] [windows-jdk8] // dir
[Pipeline] [windows-jdk8] }
[windows-jdk8] [withMaven] junitPublisher - Archive test results for Maven artifact org.apache.maven.wagon:wagon-provider-api:3.0.1-SNAPSHOT
generated by maven-surefire-plugin:test (default-test): m\wagon-provider-api\target\surefire-reports\*.xml
[windows-jdk8] Recording test results
[windows-jdk8] [withMaven] junitPublisher - Archive test results for Maven artifact org.apache.maven.wagon:wagon-provider-test:3.0.1-SNAPSHOT
generated by maven-surefire-plugin:test (default-test): m\wagon-provider-test\target\surefire-reports\*.xml
[windows-jdk8] Recording test results
[windows-jdk8] None of the test reports contained any result
[windows-jdk8] [withMaven] junitPublisher - Archive test results for Maven artifact org.apache.maven.wagon:wagon-file:3.0.1-SNAPSHOT
generated by maven-surefire-plugin:test (default-test): m\wagon-providers\wagon-file\target\surefire-reports\*.xml
[windows-jdk8] Recording test results
[windows-jdk8] [withMaven] junitPublisher - Archive test results for Maven artifact org.apache.maven.wagon:wagon-ftp:3.0.1-SNAPSHOT
generated by maven-surefire-plugin:test (default-test): m\wagon-providers\wagon-ftp\target\surefire-reports\*.xml
[windows-jdk8] Recording test results
[windows-jdk8] [withMaven] junitPublisher - Archive test results for Maven artifact org.apache.maven.wagon:wagon-http-shared:3.0.1-SNAPSHOT
generated by maven-surefire-plugin:test (default-test): m\wagon-providers\wagon-http-shared\target\surefire-reports\*.xml
[windows-jdk8] Recording test results
[windows-jdk8] [withMaven] junitPublisher - Archive test results for Maven artifact org.apache.maven.wagon:wagon-tck-http:3.0.1-SNAPSHOT
generated by maven-surefire-plugin:test (default-test): m\wagon-tcks\wagon-tck-http\target\surefire-reports\*.xml
[windows-jdk8] Recording test results
[windows-jdk8] None of the test reports contained any result
[windows-jdk8] [withMaven] junitPublisher - Archive test results for Maven artifact org.apache.maven.wagon:wagon-http:3.0.1-SNAPSHOT
generated by maven-surefire-plugin:test (default-test): m\wagon-providers\wagon-http\target\surefire-reports\*.xml
[windows-jdk8] Recording test results
[windows-jdk8] [withMaven] junitPublisher - Archive test results for Maven artifact org.apache.maven.wagon:wagon-http-lightweight:3.0.1-SNAPSHOT
generated by maven-surefire-plugin:test (default-test): m\wagon-providers\wagon-http-lightweight\target\surefire-reports\*.xml
[windows-jdk8] Recording test results
[windows-jdk8] [withMaven] junitPublisher - Archive test results for Maven artifact org.apache.maven.wagon:wagon-scm:3.0.1-SNAPSHOT
generated by maven-surefire-plugin:test (default-test): m\wagon-providers\wagon-scm\target\surefire-reports\*.xml
[windows-jdk8] Recording test results
[windows-jdk8] [withMaven] junitPublisher - Archive test results for Maven artifact org.apache.maven.wagon:wagon-ssh-common:3.0.1-SNAPSHOT
generated by maven-surefire-plugin:test (default-test): m\wagon-providers\wagon-ssh-common\target\surefire-reports\*.xml
[windows-jdk8] Recording test results
[windows-jdk8] [withMaven] junitPublisher - Archive test results for Maven artifact org.apache.maven.wagon:wagon-ssh-common-test:3.0.1-SNAPSHOT
generated by maven-surefire-plugin:test (default-test): m\wagon-providers\wagon-ssh-common-test\target\surefire-reports\*.xml
[windows-jdk8] Recording test results
[windows-jdk8] None of the test reports contained any result
[windows-jdk8] [withMaven] junitPublisher - Archive test results for Maven artifact org.apache.maven.wagon:wagon-ssh-external:3.0.1-SNAPSHOT
generated by maven-surefire-plugin:test (default-test): m\wagon-providers\wagon-ssh-external\target\surefire-reports\*.xml
[windows-jdk8] Recording test results
[windows-jdk8] None of the test reports contained any result
[windows-jdk8] [withMaven] junitPublisher - Archive test results for Maven artifact org.apache.maven.wagon:wagon-ssh:3.0.1-SNAPSHOT
generated by maven-surefire-plugin:test (default-test): m\wagon-providers\wagon-ssh\target\surefire-reports\*.xml
[windows-jdk8] Recording test results
[windows-jdk8] None of the test reports contained any result
[windows-jdk8] [withMaven] junitPublisher - Archive test results for Maven artifact org.apache.maven.wagon:wagon-webdav-jackrabbit:3.0.1-SNAPSHOT
generated by maven-surefire-plugin:test (default-test): m\wagon-providers\wagon-webdav-jackrabbit\target\surefire-reports\*.xml
[windows-jdk8] Recording test results
[Pipeline] [windows-jdk8] // withMaven
[Pipeline] [windows-jdk8] cleanWs
[windows-jdk8] [WS-CLEANUP] Deleting project workspace...[WS-CLEANUP] done
[Pipeline] [windows-jdk8] }
[Pipeline] [windows-jdk8] // stage
[Pipeline] [windows-jdk8] }
[Pipeline] [windows-jdk8] // node
[Pipeline] [windows-jdk8] }
[windows-jdk9] [INFO] Tests run: 69, Failures: 0, Errors: 0, Skipped: 0, Time elapsed: 33.462
s - in org.apache.maven.wagon.providers.webdav.WebDavsWagonTest
[windows-jdk9] [INFO] Running org.apache.maven.wagon.providers.webdav.WebDavWagonTest
[windows-jdk9] [INFO] Tests run: 69, Failures: 0, Errors: 0, Skipped: 0, Time elapsed: 27.156
s - in org.apache.maven.wagon.providers.webdav.WebDavWagonTest
[windows-jdk9] [INFO] 
[windows-jdk9] [INFO] Results:
[windows-jdk9] [INFO] 
[windows-jdk9] [INFO] Tests run: 145, Failures: 0, Errors: 0, Skipped: 0
[windows-jdk9] [INFO] 
[windows-jdk9] [INFO] 
[windows-jdk9] [INFO] --- maven-jar-plugin:2.5:jar (default-jar) @ wagon-webdav-jackrabbit
---
[windows-jdk9] [INFO] Building jar: F:\jenkins\jenkins-slave\workspace\n-box_maven-wagon_WAGON-482-U5UQDLHLBEYZ6YKA2XFN2FQ74OK76EBRADZ4AK62MZWPJOQW2HDQ@2\m\wagon-providers\wagon-webdav-jackrabbit\target\wagon-webdav-jackrabbit-3.0.1-SNAPSHOT.jar
[windows-jdk9] [INFO] 
[windows-jdk9] [INFO] --- maven-site-plugin:3.4:attach-descriptor (attach-descriptor) @ wagon-webdav-jackrabbit
---
[windows-jdk9] [INFO] 
[windows-jdk9] [INFO] --- maven-checkstyle-plugin:2.15:check (checkstyle-check) @ wagon-webdav-jackrabbit
---
[windows-jdk9] [INFO] ------------------------------------------------------------------------
[windows-jdk9] [INFO] Reactor Summary:
[windows-jdk9] [INFO] 
[windows-jdk9] [INFO] Apache Maven Wagon ................................. SUCCESS [ 43.243
s]
[windows-jdk9] [INFO] Apache Maven Wagon :: API .......................... SUCCESS [ 15.013
s]
[windows-jdk9] [INFO] Apache Maven Wagon :: Provider Test ................ SUCCESS [  4.747
s]
[windows-jdk9] [INFO] Apache Maven Wagon :: Providers .................... SUCCESS [  1.659
s]
[windows-jdk9] [INFO] Apache Maven Wagon :: Providers :: File Provider ... SUCCESS [  4.612
s]
[windows-jdk9] [INFO] Apache Maven Wagon :: Providers :: FTP Provider .... SUCCESS [  9.104
s]
[windows-jdk9] [INFO] Apache Maven Wagon :: Providers :: HTTP Shared Library SUCCESS [  5.459
s]
[windows-jdk9] [INFO] Apache Maven Wagon :: Test Compatibility Kits ...... SUCCESS [  1.141
s]
[windows-jdk9] [INFO] Apache Maven Wagon :: HTTP Test Compatibility Kit .. SUCCESS [  3.022
s]
[windows-jdk9] [INFO] Apache Maven Wagon :: Providers :: HTTP Provider ... SUCCESS [05:11
min]
[windows-jdk9] [INFO] Apache Maven Wagon :: Providers :: Lightweight HTTP Provider SUCCESS
[02:16 min]
[windows-jdk9] [INFO] Apache Maven Wagon :: Providers :: SCM Provider .... SUCCESS [ 14.686
s]
[windows-jdk9] [INFO] Apache Maven Wagon :: Providers :: SSH Common Library SUCCESS [  4.439
s]
[windows-jdk9] [INFO] Apache Maven Wagon :: Providers :: SSH Common Tests  SUCCESS [  4.425
s]
[windows-jdk9] [INFO] Apache Maven Wagon :: Providers :: SSH External Provider SUCCESS [ 
2.792 s]
[windows-jdk9] [INFO] Apache Maven Wagon :: Providers :: SSH Provider .... SUCCESS [  5.527
s]
[windows-jdk9] [INFO] Apache Maven Wagon :: Providers :: WebDAV Provider . SUCCESS [01:06
min]
[windows-jdk9] [INFO] ------------------------------------------------------------------------
[windows-jdk9] [INFO] BUILD SUCCESS
[windows-jdk9] [INFO] ------------------------------------------------------------------------
[windows-jdk9] [INFO] Total time: 10:36 min
[windows-jdk9] [INFO] Finished at: 2018-09-13T11:12:06-07:00
[windows-jdk9] [INFO] Final Memory: 41M/136M
[windows-jdk9] [INFO] ------------------------------------------------------------------------
[windows-jdk9] [WARNING] The requested profile "run-its" could not be activated because it
does not exist.
[windows-jdk9] [INFO] [jenkins-event-spy] Generated F:\jenkins\jenkins-slave\workspace\n-box_maven-wagon_WAGON-482-U5UQDLHLBEYZ6YKA2XFN2FQ74OK76EBRADZ4AK62MZWPJOQW2HDQ@2@tmp\withMaven4ef38b8f\maven-spy-20180913-110129-6479248885043098297397.log
[Pipeline] [windows-jdk9] }
[Pipeline] [windows-jdk9] // dir
[Pipeline] [windows-jdk9] }
[windows-jdk9] [withMaven] junitPublisher - Archive test results for Maven artifact org.apache.maven.wagon:wagon-provider-api:3.0.1-SNAPSHOT
generated by maven-surefire-plugin:test (default-test): m\wagon-provider-api\target\surefire-reports\*.xml
[windows-jdk9] Recording test results
[windows-jdk9] [withMaven] junitPublisher - Archive test results for Maven artifact org.apache.maven.wagon:wagon-provider-test:3.0.1-SNAPSHOT
generated by maven-surefire-plugin:test (default-test): m\wagon-provider-test\target\surefire-reports\*.xml
[windows-jdk9] Recording test results
[windows-jdk9] None of the test reports contained any result
[windows-jdk9] [withMaven] junitPublisher - Archive test results for Maven artifact org.apache.maven.wagon:wagon-file:3.0.1-SNAPSHOT
generated by maven-surefire-plugin:test (default-test): m\wagon-providers\wagon-file\target\surefire-reports\*.xml
[windows-jdk9] Recording test results
[windows-jdk9] [withMaven] junitPublisher - Archive test results for Maven artifact org.apache.maven.wagon:wagon-ftp:3.0.1-SNAPSHOT
generated by maven-surefire-plugin:test (default-test): m\wagon-providers\wagon-ftp\target\surefire-reports\*.xml
[windows-jdk9] Recording test results
[windows-jdk9] [withMaven] junitPublisher - Archive test results for Maven artifact org.apache.maven.wagon:wagon-http-shared:3.0.1-SNAPSHOT
generated by maven-surefire-plugin:test (default-test): m\wagon-providers\wagon-http-shared\target\surefire-reports\*.xml
[windows-jdk9] Recording test results
[windows-jdk9] [withMaven] junitPublisher - Archive test results for Maven artifact org.apache.maven.wagon:wagon-tck-http:3.0.1-SNAPSHOT
generated by maven-surefire-plugin:test (default-test): m\wagon-tcks\wagon-tck-http\target\surefire-reports\*.xml
[windows-jdk9] Recording test results
[windows-jdk9] None of the test reports contained any result
[windows-jdk9] [withMaven] junitPublisher - Archive test results for Maven artifact org.apache.maven.wagon:wagon-http:3.0.1-SNAPSHOT
generated by maven-surefire-plugin:test (default-test): m\wagon-providers\wagon-http\target\surefire-reports\*.xml
[windows-jdk9] Recording test results
[windows-jdk9] [withMaven] junitPublisher - Archive test results for Maven artifact org.apache.maven.wagon:wagon-http-lightweight:3.0.1-SNAPSHOT
generated by maven-surefire-plugin:test (default-test): m\wagon-providers\wagon-http-lightweight\target\surefire-reports\*.xml
[windows-jdk9] Recording test results
[windows-jdk9] [withMaven] junitPublisher - Archive test results for Maven artifact org.apache.maven.wagon:wagon-scm:3.0.1-SNAPSHOT
generated by maven-surefire-plugin:test (default-test): m\wagon-providers\wagon-scm\target\surefire-reports\*.xml
[windows-jdk9] Recording test results
[windows-jdk9] [withMaven] junitPublisher - Archive test results for Maven artifact org.apache.maven.wagon:wagon-ssh-common:3.0.1-SNAPSHOT
generated by maven-surefire-plugin:test (default-test): m\wagon-providers\wagon-ssh-common\target\surefire-reports\*.xml
[windows-jdk9] Recording test results
[windows-jdk9] [withMaven] junitPublisher - Archive test results for Maven artifact org.apache.maven.wagon:wagon-ssh-common-test:3.0.1-SNAPSHOT
generated by maven-surefire-plugin:test (default-test): m\wagon-providers\wagon-ssh-common-test\target\surefire-reports\*.xml
[windows-jdk9] Recording test results
[windows-jdk9] None of the test reports contained any result
[windows-jdk9] [withMaven] junitPublisher - Archive test results for Maven artifact org.apache.maven.wagon:wagon-ssh-external:3.0.1-SNAPSHOT
generated by maven-surefire-plugin:test (default-test): m\wagon-providers\wagon-ssh-external\target\surefire-reports\*.xml
[windows-jdk9] Recording test results
[windows-jdk9] None of the test reports contained any result
[windows-jdk9] [withMaven] junitPublisher - Archive test results for Maven artifact org.apache.maven.wagon:wagon-ssh:3.0.1-SNAPSHOT
generated by maven-surefire-plugin:test (default-test): m\wagon-providers\wagon-ssh\target\surefire-reports\*.xml
[windows-jdk9] Recording test results
[windows-jdk9] None of the test reports contained any result
[windows-jdk9] [withMaven] junitPublisher - Archive test results for Maven artifact org.apache.maven.wagon:wagon-webdav-jackrabbit:3.0.1-SNAPSHOT
generated by maven-surefire-plugin:test (default-test): m\wagon-providers\wagon-webdav-jackrabbit\target\surefire-reports\*.xml
[windows-jdk9] Recording test results
[Pipeline] [windows-jdk9] // withMaven
[Pipeline] [windows-jdk9] cleanWs
[windows-jdk9] [WS-CLEANUP] Deleting project workspace...[WS-CLEANUP] done
[Pipeline] [windows-jdk9] }
[Pipeline] [windows-jdk9] // stage
[Pipeline] [windows-jdk9] }
[Pipeline] [windows-jdk9] // node
[Pipeline] [windows-jdk9] }
[Pipeline] // parallel
[Pipeline] stage
[Pipeline] { (Notifications)
[Pipeline] echo
Build result: FAILURE
[Pipeline] jiraIssueSelector
[Pipeline] emailext
Mime
  • Unnamed multipart/mixed (inline, None, 0 bytes)
View raw message