maven-notifications mailing list archives

Site index · List index
Message view « Date » · « Thread »
Top « Date » · « Thread »
From Apache Jenkins Server <jenk...@builds.apache.org>
Subject Build unstable in Jenkins: Maven TLP » maven-scm » SCM-859 #1
Date Sat, 08 Sep 2018 23:52:03 GMT
See https://builds.apache.org/job/maven-box/job/maven-scm/job/SCM-859/1/

No changes.

262 tests failed.
FAILED:  org.apache.maven.scm.plugin.CheckoutMojoTest.testUseExport

Error Message:
null

Stack Trace:
junit.framework.AssertionFailedError
	at org.apache.maven.scm.plugin.CheckoutMojoTest.testUseExport(CheckoutMojoTest.java:134)


FAILED:  org.apache.maven.scm.plugin.ExportMojoTest.testExcludeInclude

Error Message:
null

Stack Trace:
junit.framework.AssertionFailedError
	at org.apache.maven.scm.plugin.ExportMojoTest.testExcludeInclude(ExportMojoTest.java:92)


FAILED:  org.apache.maven.scm.plugin.ExportMojoTest.testExport

Error Message:
null

Stack Trace:
junit.framework.AssertionFailedError
	at org.apache.maven.scm.plugin.ExportMojoTest.testExport(ExportMojoTest.java:57)


FAILED:  org.apache.maven.scm.plugin.UpdateMojoTest.testSkipCheckoutWithConnectionUrl

Error Message:
Command failed.The svn command failed.

Stack Trace:
org.apache.maven.plugin.MojoExecutionException: Command failed.The svn command failed.
	at org.apache.maven.scm.plugin.UpdateMojoTest.testSkipCheckoutWithConnectionUrl(UpdateMojoTest.java:83)


FAILED:  org.apache.maven.scm.provider.git.gitexe.command.checkin.GitCheckInCommandNoBranchTest.testCheckinNoBranch

Error Message:
The command result success flag was false.

Stack Trace:
junit.framework.AssertionFailedError: The command result success flag was false.
	at org.apache.maven.scm.provider.git.gitexe.command.checkin.GitCheckInCommandNoBranchTest.checkoutRepo(GitCheckInCommandNoBranchTest.java:100)
	at org.apache.maven.scm.provider.git.gitexe.command.checkin.GitCheckInCommandNoBranchTest.testCheckinNoBranch(GitCheckInCommandNoBranchTest.java:86)


FAILED:  org.apache.maven.scm.provider.git.gitexe.command.checkin.GitCheckInCommandNoBranchTest.testCheckinNoBranch

Error Message:
The command result success flag was false.

Stack Trace:
junit.framework.AssertionFailedError: The command result success flag was false.
	at org.apache.maven.scm.provider.git.gitexe.command.checkin.GitCheckInCommandNoBranchTest.checkoutRepo(GitCheckInCommandNoBranchTest.java:100)
	at org.apache.maven.scm.provider.git.gitexe.command.checkin.GitCheckInCommandNoBranchTest.testCheckinNoBranch(GitCheckInCommandNoBranchTest.java:86)


FAILED:  org.apache.maven.scm.provider.git.gitexe.command.checkin.GitCheckInCommandTest.testCheckinWithFileSet

Error Message:
The command result success flag was false.

Stack Trace:
junit.framework.AssertionFailedError: The command result success flag was false.
	at org.apache.maven.scm.provider.git.gitexe.command.checkin.GitCheckInCommandTest.checkoutRepoInto(GitCheckInCommandTest.java:185)
	at org.apache.maven.scm.provider.git.gitexe.command.checkin.GitCheckInCommandTest.testCheckinWithFileSet(GitCheckInCommandTest.java:144)


FAILED:  org.apache.maven.scm.provider.git.gitexe.command.checkin.GitCheckInCommandTest.testCheckinAfterRename

Error Message:
The command result success flag was false.

Stack Trace:
junit.framework.AssertionFailedError: The command result success flag was false.
	at org.apache.maven.scm.provider.git.gitexe.command.checkin.GitCheckInCommandTest.checkoutRepoInto(GitCheckInCommandTest.java:185)
	at org.apache.maven.scm.provider.git.gitexe.command.checkin.GitCheckInCommandTest.testCheckinAfterRename(GitCheckInCommandTest.java:100)


FAILED:  org.apache.maven.scm.provider.git.gitexe.command.checkin.GitCheckInCommandTest.testCheckinWithFileSet

Error Message:
The command result success flag was false.

Stack Trace:
junit.framework.AssertionFailedError: The command result success flag was false.
	at org.apache.maven.scm.provider.git.gitexe.command.checkin.GitCheckInCommandTest.checkoutRepoInto(GitCheckInCommandTest.java:185)
	at org.apache.maven.scm.provider.git.gitexe.command.checkin.GitCheckInCommandTest.testCheckinWithFileSet(GitCheckInCommandTest.java:144)


FAILED:  org.apache.maven.scm.provider.git.gitexe.command.checkin.GitCheckInCommandTest.testCheckinAfterRename

Error Message:
The command result success flag was false.

Stack Trace:
junit.framework.AssertionFailedError: The command result success flag was false.
	at org.apache.maven.scm.provider.git.gitexe.command.checkin.GitCheckInCommandTest.checkoutRepoInto(GitCheckInCommandTest.java:185)
	at org.apache.maven.scm.provider.git.gitexe.command.checkin.GitCheckInCommandTest.testCheckinAfterRename(GitCheckInCommandTest.java:100)


FAILED:  org.apache.maven.scm.provider.git.gitexe.command.checkin.GitCheckInCommandTest.testCheckinWithFileSet

Error Message:
The command result success flag was false.

Stack Trace:
junit.framework.AssertionFailedError: The command result success flag was false.
	at org.apache.maven.scm.provider.git.gitexe.command.checkin.GitCheckInCommandTest.checkoutRepoInto(GitCheckInCommandTest.java:185)
	at org.apache.maven.scm.provider.git.gitexe.command.checkin.GitCheckInCommandTest.testCheckinWithFileSet(GitCheckInCommandTest.java:144)


FAILED:  org.apache.maven.scm.provider.git.gitexe.command.checkin.GitCheckInCommandTest.testCheckinAfterRename

Error Message:
The command result success flag was false.

Stack Trace:
junit.framework.AssertionFailedError: The command result success flag was false.
	at org.apache.maven.scm.provider.git.gitexe.command.checkin.GitCheckInCommandTest.checkoutRepoInto(GitCheckInCommandTest.java:185)
	at org.apache.maven.scm.provider.git.gitexe.command.checkin.GitCheckInCommandTest.testCheckinAfterRename(GitCheckInCommandTest.java:100)


FAILED:  org.apache.maven.scm.provider.git.gitexe.command.checkin.GitCheckInCommandTest.testCheckinWithFileSet

Error Message:
The command result success flag was false.

Stack Trace:
junit.framework.AssertionFailedError: The command result success flag was false.
	at org.apache.maven.scm.provider.git.gitexe.command.checkin.GitCheckInCommandTest.checkoutRepoInto(GitCheckInCommandTest.java:185)
	at org.apache.maven.scm.provider.git.gitexe.command.checkin.GitCheckInCommandTest.testCheckinWithFileSet(GitCheckInCommandTest.java:144)


FAILED:  org.apache.maven.scm.provider.git.gitexe.command.checkin.GitCheckInCommandTest.testCheckinAfterRename

Error Message:
The command result success flag was false.

Stack Trace:
junit.framework.AssertionFailedError: The command result success flag was false.
	at org.apache.maven.scm.provider.git.gitexe.command.checkin.GitCheckInCommandTest.checkoutRepoInto(GitCheckInCommandTest.java:185)
	at org.apache.maven.scm.provider.git.gitexe.command.checkin.GitCheckInCommandTest.testCheckinAfterRename(GitCheckInCommandTest.java:100)


FAILED:  org.apache.maven.scm.provider.svn.svnexe.command.changelog.SvnChangeLogCommandTest.testCommandLineNoDatesLimitedCount

Error Message:
expected:<...://foo.com/svn/trunk[]"> but was:<...://foo.com/svn/trunk[@]">

Stack Trace:
junit.framework.ComparisonFailure: expected:<...://foo.com/svn/trunk[]"> but was:<...://foo.com/svn/trunk[@]">
	at org.apache.maven.scm.provider.svn.svnexe.command.changelog.SvnChangeLogCommandTest.testCommandLine(SvnChangeLogCommandTest.java:180)
	at org.apache.maven.scm.provider.svn.svnexe.command.changelog.SvnChangeLogCommandTest.testCommandLineNoDatesLimitedCount(SvnChangeLogCommandTest.java:51)


FAILED:  org.apache.maven.scm.provider.svn.svnexe.command.changelog.SvnChangeLogCommandTest.testCommandLineWithBranchStartDateOnly

Error Message:
expected:<...nches/my-test-branch[ http://foo.com/svn/trunk]"> but was:<...nches/my-test-branch[@ http://foo.com/svn/trunk@]">

Stack Trace:
junit.framework.ComparisonFailure: expected:<...nches/my-test-branch[ http://foo.com/svn/trunk]"> but was:<...nches/my-test-branch[@ http://foo.com/svn/trunk@]">
	at org.apache.maven.scm.provider.svn.svnexe.command.changelog.SvnChangeLogCommandTest.testCommandLine(SvnChangeLogCommandTest.java:180)
	at org.apache.maven.scm.provider.svn.svnexe.command.changelog.SvnChangeLogCommandTest.testCommandLine(SvnChangeLogCommandTest.java:165)
	at org.apache.maven.scm.provider.svn.svnexe.command.changelog.SvnChangeLogCommandTest.testCommandLineWithBranchStartDateOnly(SvnChangeLogCommandTest.java:106)


FAILED:  org.apache.maven.scm.provider.svn.svnexe.command.changelog.SvnChangeLogCommandTest.testCommandLineDateFormat

Error Message:
expected:<...://foo.com/svn/trunk[]"> but was:<...://foo.com/svn/trunk[@]">

Stack Trace:
junit.framework.ComparisonFailure: expected:<...://foo.com/svn/trunk[]"> but was:<...://foo.com/svn/trunk[@]">
	at org.apache.maven.scm.provider.svn.svnexe.command.changelog.SvnChangeLogCommandTest.testCommandLine(SvnChangeLogCommandTest.java:180)
	at org.apache.maven.scm.provider.svn.svnexe.command.changelog.SvnChangeLogCommandTest.testCommandLine(SvnChangeLogCommandTest.java:165)
	at org.apache.maven.scm.provider.svn.svnexe.command.changelog.SvnChangeLogCommandTest.testCommandLineDateFormat(SvnChangeLogCommandTest.java:80)


FAILED:  org.apache.maven.scm.provider.svn.svnexe.command.changelog.SvnChangeLogCommandTest.testCommandLineWithBranchNoDates

Error Message:
expected:<...nches/my-test-branch[ http://foo.com/svn/trunk]"> but was:<...nches/my-test-branch[@ http://foo.com/svn/trunk@]">

Stack Trace:
junit.framework.ComparisonFailure: expected:<...nches/my-test-branch[ http://foo.com/svn/trunk]"> but was:<...nches/my-test-branch[@ http://foo.com/svn/trunk@]">
	at org.apache.maven.scm.provider.svn.svnexe.command.changelog.SvnChangeLogCommandTest.testCommandLine(SvnChangeLogCommandTest.java:180)
	at org.apache.maven.scm.provider.svn.svnexe.command.changelog.SvnChangeLogCommandTest.testCommandLine(SvnChangeLogCommandTest.java:165)
	at org.apache.maven.scm.provider.svn.svnexe.command.changelog.SvnChangeLogCommandTest.testCommandLineWithBranchNoDates(SvnChangeLogCommandTest.java:97)


FAILED:  org.apache.maven.scm.provider.svn.svnexe.command.changelog.SvnChangeLogCommandTest.testCommandLineWithDates

Error Message:
expected:<...://foo.com/svn/trunk[]"> but was:<...://foo.com/svn/trunk[@]">

Stack Trace:
junit.framework.ComparisonFailure: expected:<...://foo.com/svn/trunk[]"> but was:<...://foo.com/svn/trunk[@]">
	at org.apache.maven.scm.provider.svn.svnexe.command.changelog.SvnChangeLogCommandTest.testCommandLine(SvnChangeLogCommandTest.java:180)
	at org.apache.maven.scm.provider.svn.svnexe.command.changelog.SvnChangeLogCommandTest.testCommandLine(SvnChangeLogCommandTest.java:165)
	at org.apache.maven.scm.provider.svn.svnexe.command.changelog.SvnChangeLogCommandTest.testCommandLineWithDates(SvnChangeLogCommandTest.java:61)


FAILED:  org.apache.maven.scm.provider.svn.svnexe.command.changelog.SvnChangeLogCommandTest.testCommandLineWithStartVersionAndEndVersionEquals

Error Message:
expected:<...://foo.com/svn/trunk[]"> but was:<...://foo.com/svn/trunk[@]">

Stack Trace:
junit.framework.ComparisonFailure: expected:<...://foo.com/svn/trunk[]"> but was:<...://foo.com/svn/trunk[@]">
	at org.apache.maven.scm.provider.svn.svnexe.command.changelog.SvnChangeLogCommandTest.testCommandLine(SvnChangeLogCommandTest.java:194)
	at org.apache.maven.scm.provider.svn.svnexe.command.changelog.SvnChangeLogCommandTest.testCommandLineWithStartVersionAndEndVersionEquals(SvnChangeLogCommandTest.java:147)


FAILED:  org.apache.maven.scm.provider.svn.svnexe.command.changelog.SvnChangeLogCommandTest.testCommandLineWithBranchBothDates

Error Message:
expected:<...nches/my-test-branch[ http://foo.com/svn/trunk]"> but was:<...nches/my-test-branch[@ http://foo.com/svn/trunk@]">

Stack Trace:
junit.framework.ComparisonFailure: expected:<...nches/my-test-branch[ http://foo.com/svn/trunk]"> but was:<...nches/my-test-branch[@ http://foo.com/svn/trunk@]">
	at org.apache.maven.scm.provider.svn.svnexe.command.changelog.SvnChangeLogCommandTest.testCommandLine(SvnChangeLogCommandTest.java:180)
	at org.apache.maven.scm.provider.svn.svnexe.command.changelog.SvnChangeLogCommandTest.testCommandLine(SvnChangeLogCommandTest.java:165)
	at org.apache.maven.scm.provider.svn.svnexe.command.changelog.SvnChangeLogCommandTest.testCommandLineWithBranchBothDates(SvnChangeLogCommandTest.java:126)


FAILED:  org.apache.maven.scm.provider.svn.svnexe.command.changelog.SvnChangeLogCommandTest.testCommandLineWithStartVersion

Error Message:
expected:<...://foo.com/svn/trunk[]"> but was:<...://foo.com/svn/trunk[@]">

Stack Trace:
junit.framework.ComparisonFailure: expected:<...://foo.com/svn/trunk[]"> but was:<...://foo.com/svn/trunk[@]">
	at org.apache.maven.scm.provider.svn.svnexe.command.changelog.SvnChangeLogCommandTest.testCommandLine(SvnChangeLogCommandTest.java:194)
	at org.apache.maven.scm.provider.svn.svnexe.command.changelog.SvnChangeLogCommandTest.testCommandLineWithStartVersion(SvnChangeLogCommandTest.java:133)


FAILED:  org.apache.maven.scm.provider.svn.svnexe.command.changelog.SvnChangeLogCommandTest.testCommandLineNoDates

Error Message:
expected:<...://foo.com/svn/trunk[]"> but was:<...://foo.com/svn/trunk[@]">

Stack Trace:
junit.framework.ComparisonFailure: expected:<...://foo.com/svn/trunk[]"> but was:<...://foo.com/svn/trunk[@]">
	at org.apache.maven.scm.provider.svn.svnexe.command.changelog.SvnChangeLogCommandTest.testCommandLine(SvnChangeLogCommandTest.java:180)
	at org.apache.maven.scm.provider.svn.svnexe.command.changelog.SvnChangeLogCommandTest.testCommandLine(SvnChangeLogCommandTest.java:165)
	at org.apache.maven.scm.provider.svn.svnexe.command.changelog.SvnChangeLogCommandTest.testCommandLineNoDates(SvnChangeLogCommandTest.java:44)


FAILED:  org.apache.maven.scm.provider.svn.svnexe.command.changelog.SvnChangeLogCommandTest.testCommandLineWithBranchEndDateOnly

Error Message:
expected:<...nches/my-test-branch[ http://foo.com/svn/trunk]"> but was:<...nches/my-test-branch[@ http://foo.com/svn/trunk@]">

Stack Trace:
junit.framework.ComparisonFailure: expected:<...nches/my-test-branch[ http://foo.com/svn/trunk]"> but was:<...nches/my-test-branch[@ http://foo.com/svn/trunk@]">
	at org.apache.maven.scm.provider.svn.svnexe.command.changelog.SvnChangeLogCommandTest.testCommandLine(SvnChangeLogCommandTest.java:180)
	at org.apache.maven.scm.provider.svn.svnexe.command.changelog.SvnChangeLogCommandTest.testCommandLine(SvnChangeLogCommandTest.java:165)
	at org.apache.maven.scm.provider.svn.svnexe.command.changelog.SvnChangeLogCommandTest.testCommandLineWithBranchEndDateOnly(SvnChangeLogCommandTest.java:116)


FAILED:  org.apache.maven.scm.provider.svn.svnexe.command.changelog.SvnChangeLogCommandTest.testCommandLineStartDateOnly

Error Message:
expected:<...://foo.com/svn/trunk[]"> but was:<...://foo.com/svn/trunk[@]">

Stack Trace:
junit.framework.ComparisonFailure: expected:<...://foo.com/svn/trunk[]"> but was:<...://foo.com/svn/trunk[@]">
	at org.apache.maven.scm.provider.svn.svnexe.command.changelog.SvnChangeLogCommandTest.testCommandLine(SvnChangeLogCommandTest.java:180)
	at org.apache.maven.scm.provider.svn.svnexe.command.changelog.SvnChangeLogCommandTest.testCommandLine(SvnChangeLogCommandTest.java:165)
	at org.apache.maven.scm.provider.svn.svnexe.command.changelog.SvnChangeLogCommandTest.testCommandLineStartDateOnly(SvnChangeLogCommandTest.java:70)


FAILED:  org.apache.maven.scm.provider.svn.svnexe.command.changelog.SvnChangeLogCommandTest.testCommandLineEndDateOnly

Error Message:
expected:<...://foo.com/svn/trunk[]"> but was:<...://foo.com/svn/trunk[@]">

Stack Trace:
junit.framework.ComparisonFailure: expected:<...://foo.com/svn/trunk[]"> but was:<...://foo.com/svn/trunk[@]">
	at org.apache.maven.scm.provider.svn.svnexe.command.changelog.SvnChangeLogCommandTest.testCommandLine(SvnChangeLogCommandTest.java:180)
	at org.apache.maven.scm.provider.svn.svnexe.command.changelog.SvnChangeLogCommandTest.testCommandLine(SvnChangeLogCommandTest.java:165)
	at org.apache.maven.scm.provider.svn.svnexe.command.changelog.SvnChangeLogCommandTest.testCommandLineEndDateOnly(SvnChangeLogCommandTest.java:90)


FAILED:  org.apache.maven.scm.provider.svn.svnexe.command.changelog.SvnChangeLogCommandTest.testCommandLineWithStartVersionAndEndVersion

Error Message:
expected:<...://foo.com/svn/trunk[]"> but was:<...://foo.com/svn/trunk[@]">

Stack Trace:
junit.framework.ComparisonFailure: expected:<...://foo.com/svn/trunk[]"> but was:<...://foo.com/svn/trunk[@]">
	at org.apache.maven.scm.provider.svn.svnexe.command.changelog.SvnChangeLogCommandTest.testCommandLine(SvnChangeLogCommandTest.java:194)
	at org.apache.maven.scm.provider.svn.svnexe.command.changelog.SvnChangeLogCommandTest.testCommandLineWithStartVersionAndEndVersion(SvnChangeLogCommandTest.java:140)


FAILED:  org.apache.maven.scm.provider.svn.svnexe.command.changelog.SvnChangeLogCommandTest.testCommandLineNoDatesLimitedCount

Error Message:
expected:<...://foo.com/svn/trunk[]'> but was:<...://foo.com/svn/trunk[@]'>

Stack Trace:
junit.framework.ComparisonFailure: expected:<...://foo.com/svn/trunk[]'> but was:<...://foo.com/svn/trunk[@]'>
	at org.apache.maven.scm.provider.svn.svnexe.command.changelog.SvnChangeLogCommandTest.testCommandLine(SvnChangeLogCommandTest.java:180)
	at org.apache.maven.scm.provider.svn.svnexe.command.changelog.SvnChangeLogCommandTest.testCommandLineNoDatesLimitedCount(SvnChangeLogCommandTest.java:51)


FAILED:  org.apache.maven.scm.provider.svn.svnexe.command.changelog.SvnChangeLogCommandTest.testCommandLineWithBranchStartDateOnly

Error Message:
expected:<...nches/my-test-branch[' 'http://foo.com/svn/trunk]'> but was:<...nches/my-test-branch[@' 'http://foo.com/svn/trunk@]'>

Stack Trace:
junit.framework.ComparisonFailure: expected:<...nches/my-test-branch[' 'http://foo.com/svn/trunk]'> but was:<...nches/my-test-branch[@' 'http://foo.com/svn/trunk@]'>
	at org.apache.maven.scm.provider.svn.svnexe.command.changelog.SvnChangeLogCommandTest.testCommandLine(SvnChangeLogCommandTest.java:180)
	at org.apache.maven.scm.provider.svn.svnexe.command.changelog.SvnChangeLogCommandTest.testCommandLine(SvnChangeLogCommandTest.java:165)
	at org.apache.maven.scm.provider.svn.svnexe.command.changelog.SvnChangeLogCommandTest.testCommandLineWithBranchStartDateOnly(SvnChangeLogCommandTest.java:106)


FAILED:  org.apache.maven.scm.provider.svn.svnexe.command.changelog.SvnChangeLogCommandTest.testCommandLineDateFormat

Error Message:
expected:<...://foo.com/svn/trunk[]'> but was:<...://foo.com/svn/trunk[@]'>

Stack Trace:
junit.framework.ComparisonFailure: expected:<...://foo.com/svn/trunk[]'> but was:<...://foo.com/svn/trunk[@]'>
	at org.apache.maven.scm.provider.svn.svnexe.command.changelog.SvnChangeLogCommandTest.testCommandLine(SvnChangeLogCommandTest.java:180)
	at org.apache.maven.scm.provider.svn.svnexe.command.changelog.SvnChangeLogCommandTest.testCommandLine(SvnChangeLogCommandTest.java:165)
	at org.apache.maven.scm.provider.svn.svnexe.command.changelog.SvnChangeLogCommandTest.testCommandLineDateFormat(SvnChangeLogCommandTest.java:80)


FAILED:  org.apache.maven.scm.provider.svn.svnexe.command.changelog.SvnChangeLogCommandTest.testCommandLineWithBranchNoDates

Error Message:
expected:<...nches/my-test-branch[' 'http://foo.com/svn/trunk]'> but was:<...nches/my-test-branch[@' 'http://foo.com/svn/trunk@]'>

Stack Trace:
junit.framework.ComparisonFailure: expected:<...nches/my-test-branch[' 'http://foo.com/svn/trunk]'> but was:<...nches/my-test-branch[@' 'http://foo.com/svn/trunk@]'>
	at org.apache.maven.scm.provider.svn.svnexe.command.changelog.SvnChangeLogCommandTest.testCommandLine(SvnChangeLogCommandTest.java:180)
	at org.apache.maven.scm.provider.svn.svnexe.command.changelog.SvnChangeLogCommandTest.testCommandLine(SvnChangeLogCommandTest.java:165)
	at org.apache.maven.scm.provider.svn.svnexe.command.changelog.SvnChangeLogCommandTest.testCommandLineWithBranchNoDates(SvnChangeLogCommandTest.java:97)


FAILED:  org.apache.maven.scm.provider.svn.svnexe.command.changelog.SvnChangeLogCommandTest.testCommandLineWithDates

Error Message:
expected:<...://foo.com/svn/trunk[]'> but was:<...://foo.com/svn/trunk[@]'>

Stack Trace:
junit.framework.ComparisonFailure: expected:<...://foo.com/svn/trunk[]'> but was:<...://foo.com/svn/trunk[@]'>
	at org.apache.maven.scm.provider.svn.svnexe.command.changelog.SvnChangeLogCommandTest.testCommandLine(SvnChangeLogCommandTest.java:180)
	at org.apache.maven.scm.provider.svn.svnexe.command.changelog.SvnChangeLogCommandTest.testCommandLine(SvnChangeLogCommandTest.java:165)
	at org.apache.maven.scm.provider.svn.svnexe.command.changelog.SvnChangeLogCommandTest.testCommandLineWithDates(SvnChangeLogCommandTest.java:61)


FAILED:  org.apache.maven.scm.provider.svn.svnexe.command.changelog.SvnChangeLogCommandTest.testCommandLineWithStartVersionAndEndVersionEquals

Error Message:
expected:<...://foo.com/svn/trunk[]'> but was:<...://foo.com/svn/trunk[@]'>

Stack Trace:
junit.framework.ComparisonFailure: expected:<...://foo.com/svn/trunk[]'> but was:<...://foo.com/svn/trunk[@]'>
	at org.apache.maven.scm.provider.svn.svnexe.command.changelog.SvnChangeLogCommandTest.testCommandLine(SvnChangeLogCommandTest.java:194)
	at org.apache.maven.scm.provider.svn.svnexe.command.changelog.SvnChangeLogCommandTest.testCommandLineWithStartVersionAndEndVersionEquals(SvnChangeLogCommandTest.java:147)


FAILED:  org.apache.maven.scm.provider.svn.svnexe.command.changelog.SvnChangeLogCommandTest.testCommandLineWithBranchBothDates

Error Message:
expected:<...nches/my-test-branch[' 'http://foo.com/svn/trunk]'> but was:<...nches/my-test-branch[@' 'http://foo.com/svn/trunk@]'>

Stack Trace:
junit.framework.ComparisonFailure: expected:<...nches/my-test-branch[' 'http://foo.com/svn/trunk]'> but was:<...nches/my-test-branch[@' 'http://foo.com/svn/trunk@]'>
	at org.apache.maven.scm.provider.svn.svnexe.command.changelog.SvnChangeLogCommandTest.testCommandLine(SvnChangeLogCommandTest.java:180)
	at org.apache.maven.scm.provider.svn.svnexe.command.changelog.SvnChangeLogCommandTest.testCommandLine(SvnChangeLogCommandTest.java:165)
	at org.apache.maven.scm.provider.svn.svnexe.command.changelog.SvnChangeLogCommandTest.testCommandLineWithBranchBothDates(SvnChangeLogCommandTest.java:126)


FAILED:  org.apache.maven.scm.provider.svn.svnexe.command.changelog.SvnChangeLogCommandTest.testCommandLineWithStartVersion

Error Message:
expected:<...://foo.com/svn/trunk[]'> but was:<...://foo.com/svn/trunk[@]'>

Stack Trace:
junit.framework.ComparisonFailure: expected:<...://foo.com/svn/trunk[]'> but was:<...://foo.com/svn/trunk[@]'>
	at org.apache.maven.scm.provider.svn.svnexe.command.changelog.SvnChangeLogCommandTest.testCommandLine(SvnChangeLogCommandTest.java:194)
	at org.apache.maven.scm.provider.svn.svnexe.command.changelog.SvnChangeLogCommandTest.testCommandLineWithStartVersion(SvnChangeLogCommandTest.java:133)


FAILED:  org.apache.maven.scm.provider.svn.svnexe.command.changelog.SvnChangeLogCommandTest.testCommandLineNoDates

Error Message:
expected:<...://foo.com/svn/trunk[]'> but was:<...://foo.com/svn/trunk[@]'>

Stack Trace:
junit.framework.ComparisonFailure: expected:<...://foo.com/svn/trunk[]'> but was:<...://foo.com/svn/trunk[@]'>
	at org.apache.maven.scm.provider.svn.svnexe.command.changelog.SvnChangeLogCommandTest.testCommandLine(SvnChangeLogCommandTest.java:180)
	at org.apache.maven.scm.provider.svn.svnexe.command.changelog.SvnChangeLogCommandTest.testCommandLine(SvnChangeLogCommandTest.java:165)
	at org.apache.maven.scm.provider.svn.svnexe.command.changelog.SvnChangeLogCommandTest.testCommandLineNoDates(SvnChangeLogCommandTest.java:44)


FAILED:  org.apache.maven.scm.provider.svn.svnexe.command.changelog.SvnChangeLogCommandTest.testCommandLineWithBranchEndDateOnly

Error Message:
expected:<...nches/my-test-branch[' 'http://foo.com/svn/trunk]'> but was:<...nches/my-test-branch[@' 'http://foo.com/svn/trunk@]'>

Stack Trace:
junit.framework.ComparisonFailure: expected:<...nches/my-test-branch[' 'http://foo.com/svn/trunk]'> but was:<...nches/my-test-branch[@' 'http://foo.com/svn/trunk@]'>
	at org.apache.maven.scm.provider.svn.svnexe.command.changelog.SvnChangeLogCommandTest.testCommandLine(SvnChangeLogCommandTest.java:180)
	at org.apache.maven.scm.provider.svn.svnexe.command.changelog.SvnChangeLogCommandTest.testCommandLine(SvnChangeLogCommandTest.java:165)
	at org.apache.maven.scm.provider.svn.svnexe.command.changelog.SvnChangeLogCommandTest.testCommandLineWithBranchEndDateOnly(SvnChangeLogCommandTest.java:116)


FAILED:  org.apache.maven.scm.provider.svn.svnexe.command.changelog.SvnChangeLogCommandTest.testCommandLineStartDateOnly

Error Message:
expected:<...://foo.com/svn/trunk[]'> but was:<...://foo.com/svn/trunk[@]'>

Stack Trace:
junit.framework.ComparisonFailure: expected:<...://foo.com/svn/trunk[]'> but was:<...://foo.com/svn/trunk[@]'>
	at org.apache.maven.scm.provider.svn.svnexe.command.changelog.SvnChangeLogCommandTest.testCommandLine(SvnChangeLogCommandTest.java:180)
	at org.apache.maven.scm.provider.svn.svnexe.command.changelog.SvnChangeLogCommandTest.testCommandLine(SvnChangeLogCommandTest.java:165)
	at org.apache.maven.scm.provider.svn.svnexe.command.changelog.SvnChangeLogCommandTest.testCommandLineStartDateOnly(SvnChangeLogCommandTest.java:70)


FAILED:  org.apache.maven.scm.provider.svn.svnexe.command.changelog.SvnChangeLogCommandTest.testCommandLineEndDateOnly

Error Message:
expected:<...://foo.com/svn/trunk[]'> but was:<...://foo.com/svn/trunk[@]'>

Stack Trace:
junit.framework.ComparisonFailure: expected:<...://foo.com/svn/trunk[]'> but was:<...://foo.com/svn/trunk[@]'>
	at org.apache.maven.scm.provider.svn.svnexe.command.changelog.SvnChangeLogCommandTest.testCommandLine(SvnChangeLogCommandTest.java:180)
	at org.apache.maven.scm.provider.svn.svnexe.command.changelog.SvnChangeLogCommandTest.testCommandLine(SvnChangeLogCommandTest.java:165)
	at org.apache.maven.scm.provider.svn.svnexe.command.changelog.SvnChangeLogCommandTest.testCommandLineEndDateOnly(SvnChangeLogCommandTest.java:90)


FAILED:  org.apache.maven.scm.provider.svn.svnexe.command.changelog.SvnChangeLogCommandTest.testCommandLineWithStartVersionAndEndVersion

Error Message:
expected:<...://foo.com/svn/trunk[]'> but was:<...://foo.com/svn/trunk[@]'>

Stack Trace:
junit.framework.ComparisonFailure: expected:<...://foo.com/svn/trunk[]'> but was:<...://foo.com/svn/trunk[@]'>
	at org.apache.maven.scm.provider.svn.svnexe.command.changelog.SvnChangeLogCommandTest.testCommandLine(SvnChangeLogCommandTest.java:194)
	at org.apache.maven.scm.provider.svn.svnexe.command.changelog.SvnChangeLogCommandTest.testCommandLineWithStartVersionAndEndVersion(SvnChangeLogCommandTest.java:140)


FAILED:  org.apache.maven.scm.provider.svn.svnexe.command.changelog.SvnChangeLogCommandTest.testCommandLineNoDatesLimitedCount

Error Message:
expected:<...://foo.com/svn/trunk[]'> but was:<...://foo.com/svn/trunk[@]'>

Stack Trace:
junit.framework.ComparisonFailure: expected:<...://foo.com/svn/trunk[]'> but was:<...://foo.com/svn/trunk[@]'>
	at org.apache.maven.scm.provider.svn.svnexe.command.changelog.SvnChangeLogCommandTest.testCommandLine(SvnChangeLogCommandTest.java:180)
	at org.apache.maven.scm.provider.svn.svnexe.command.changelog.SvnChangeLogCommandTest.testCommandLineNoDatesLimitedCount(SvnChangeLogCommandTest.java:51)


FAILED:  org.apache.maven.scm.provider.svn.svnexe.command.changelog.SvnChangeLogCommandTest.testCommandLineWithBranchStartDateOnly

Error Message:
expected:<...nches/my-test-branch[' 'http://foo.com/svn/trunk]'> but was:<...nches/my-test-branch[@' 'http://foo.com/svn/trunk@]'>

Stack Trace:
junit.framework.ComparisonFailure: expected:<...nches/my-test-branch[' 'http://foo.com/svn/trunk]'> but was:<...nches/my-test-branch[@' 'http://foo.com/svn/trunk@]'>
	at org.apache.maven.scm.provider.svn.svnexe.command.changelog.SvnChangeLogCommandTest.testCommandLine(SvnChangeLogCommandTest.java:180)
	at org.apache.maven.scm.provider.svn.svnexe.command.changelog.SvnChangeLogCommandTest.testCommandLine(SvnChangeLogCommandTest.java:165)
	at org.apache.maven.scm.provider.svn.svnexe.command.changelog.SvnChangeLogCommandTest.testCommandLineWithBranchStartDateOnly(SvnChangeLogCommandTest.java:106)


FAILED:  org.apache.maven.scm.provider.svn.svnexe.command.changelog.SvnChangeLogCommandTest.testCommandLineDateFormat

Error Message:
expected:<...://foo.com/svn/trunk[]'> but was:<...://foo.com/svn/trunk[@]'>

Stack Trace:
junit.framework.ComparisonFailure: expected:<...://foo.com/svn/trunk[]'> but was:<...://foo.com/svn/trunk[@]'>
	at org.apache.maven.scm.provider.svn.svnexe.command.changelog.SvnChangeLogCommandTest.testCommandLine(SvnChangeLogCommandTest.java:180)
	at org.apache.maven.scm.provider.svn.svnexe.command.changelog.SvnChangeLogCommandTest.testCommandLine(SvnChangeLogCommandTest.java:165)
	at org.apache.maven.scm.provider.svn.svnexe.command.changelog.SvnChangeLogCommandTest.testCommandLineDateFormat(SvnChangeLogCommandTest.java:80)


FAILED:  org.apache.maven.scm.provider.svn.svnexe.command.changelog.SvnChangeLogCommandTest.testCommandLineWithBranchNoDates

Error Message:
expected:<...nches/my-test-branch[' 'http://foo.com/svn/trunk]'> but was:<...nches/my-test-branch[@' 'http://foo.com/svn/trunk@]'>

Stack Trace:
junit.framework.ComparisonFailure: expected:<...nches/my-test-branch[' 'http://foo.com/svn/trunk]'> but was:<...nches/my-test-branch[@' 'http://foo.com/svn/trunk@]'>
	at org.apache.maven.scm.provider.svn.svnexe.command.changelog.SvnChangeLogCommandTest.testCommandLine(SvnChangeLogCommandTest.java:180)
	at org.apache.maven.scm.provider.svn.svnexe.command.changelog.SvnChangeLogCommandTest.testCommandLine(SvnChangeLogCommandTest.java:165)
	at org.apache.maven.scm.provider.svn.svnexe.command.changelog.SvnChangeLogCommandTest.testCommandLineWithBranchNoDates(SvnChangeLogCommandTest.java:97)


FAILED:  org.apache.maven.scm.provider.svn.svnexe.command.changelog.SvnChangeLogCommandTest.testCommandLineWithDates

Error Message:
expected:<...://foo.com/svn/trunk[]'> but was:<...://foo.com/svn/trunk[@]'>

Stack Trace:
junit.framework.ComparisonFailure: expected:<...://foo.com/svn/trunk[]'> but was:<...://foo.com/svn/trunk[@]'>
	at org.apache.maven.scm.provider.svn.svnexe.command.changelog.SvnChangeLogCommandTest.testCommandLine(SvnChangeLogCommandTest.java:180)
	at org.apache.maven.scm.provider.svn.svnexe.command.changelog.SvnChangeLogCommandTest.testCommandLine(SvnChangeLogCommandTest.java:165)
	at org.apache.maven.scm.provider.svn.svnexe.command.changelog.SvnChangeLogCommandTest.testCommandLineWithDates(SvnChangeLogCommandTest.java:61)


FAILED:  org.apache.maven.scm.provider.svn.svnexe.command.changelog.SvnChangeLogCommandTest.testCommandLineWithStartVersionAndEndVersionEquals

Error Message:
expected:<...://foo.com/svn/trunk[]'> but was:<...://foo.com/svn/trunk[@]'>

Stack Trace:
junit.framework.ComparisonFailure: expected:<...://foo.com/svn/trunk[]'> but was:<...://foo.com/svn/trunk[@]'>
	at org.apache.maven.scm.provider.svn.svnexe.command.changelog.SvnChangeLogCommandTest.testCommandLine(SvnChangeLogCommandTest.java:194)
	at org.apache.maven.scm.provider.svn.svnexe.command.changelog.SvnChangeLogCommandTest.testCommandLineWithStartVersionAndEndVersionEquals(SvnChangeLogCommandTest.java:147)


FAILED:  org.apache.maven.scm.provider.svn.svnexe.command.changelog.SvnChangeLogCommandTest.testCommandLineWithBranchBothDates

Error Message:
expected:<...nches/my-test-branch[' 'http://foo.com/svn/trunk]'> but was:<...nches/my-test-branch[@' 'http://foo.com/svn/trunk@]'>

Stack Trace:
junit.framework.ComparisonFailure: expected:<...nches/my-test-branch[' 'http://foo.com/svn/trunk]'> but was:<...nches/my-test-branch[@' 'http://foo.com/svn/trunk@]'>
	at org.apache.maven.scm.provider.svn.svnexe.command.changelog.SvnChangeLogCommandTest.testCommandLine(SvnChangeLogCommandTest.java:180)
	at org.apache.maven.scm.provider.svn.svnexe.command.changelog.SvnChangeLogCommandTest.testCommandLine(SvnChangeLogCommandTest.java:165)
	at org.apache.maven.scm.provider.svn.svnexe.command.changelog.SvnChangeLogCommandTest.testCommandLineWithBranchBothDates(SvnChangeLogCommandTest.java:126)


FAILED:  org.apache.maven.scm.provider.svn.svnexe.command.changelog.SvnChangeLogCommandTest.testCommandLineWithStartVersion

Error Message:
expected:<...://foo.com/svn/trunk[]'> but was:<...://foo.com/svn/trunk[@]'>

Stack Trace:
junit.framework.ComparisonFailure: expected:<...://foo.com/svn/trunk[]'> but was:<...://foo.com/svn/trunk[@]'>
	at org.apache.maven.scm.provider.svn.svnexe.command.changelog.SvnChangeLogCommandTest.testCommandLine(SvnChangeLogCommandTest.java:194)
	at org.apache.maven.scm.provider.svn.svnexe.command.changelog.SvnChangeLogCommandTest.testCommandLineWithStartVersion(SvnChangeLogCommandTest.java:133)


FAILED:  org.apache.maven.scm.provider.svn.svnexe.command.changelog.SvnChangeLogCommandTest.testCommandLineNoDates

Error Message:
expected:<...://foo.com/svn/trunk[]'> but was:<...://foo.com/svn/trunk[@]'>

Stack Trace:
junit.framework.ComparisonFailure: expected:<...://foo.com/svn/trunk[]'> but was:<...://foo.com/svn/trunk[@]'>
	at org.apache.maven.scm.provider.svn.svnexe.command.changelog.SvnChangeLogCommandTest.testCommandLine(SvnChangeLogCommandTest.java:180)
	at org.apache.maven.scm.provider.svn.svnexe.command.changelog.SvnChangeLogCommandTest.testCommandLine(SvnChangeLogCommandTest.java:165)
	at org.apache.maven.scm.provider.svn.svnexe.command.changelog.SvnChangeLogCommandTest.testCommandLineNoDates(SvnChangeLogCommandTest.java:44)


FAILED:  org.apache.maven.scm.provider.svn.svnexe.command.changelog.SvnChangeLogCommandTest.testCommandLineWithBranchEndDateOnly

Error Message:
expected:<...nches/my-test-branch[' 'http://foo.com/svn/trunk]'> but was:<...nches/my-test-branch[@' 'http://foo.com/svn/trunk@]'>

Stack Trace:
junit.framework.ComparisonFailure: expected:<...nches/my-test-branch[' 'http://foo.com/svn/trunk]'> but was:<...nches/my-test-branch[@' 'http://foo.com/svn/trunk@]'>
	at org.apache.maven.scm.provider.svn.svnexe.command.changelog.SvnChangeLogCommandTest.testCommandLine(SvnChangeLogCommandTest.java:180)
	at org.apache.maven.scm.provider.svn.svnexe.command.changelog.SvnChangeLogCommandTest.testCommandLine(SvnChangeLogCommandTest.java:165)
	at org.apache.maven.scm.provider.svn.svnexe.command.changelog.SvnChangeLogCommandTest.testCommandLineWithBranchEndDateOnly(SvnChangeLogCommandTest.java:116)


FAILED:  org.apache.maven.scm.provider.svn.svnexe.command.changelog.SvnChangeLogCommandTest.testCommandLineStartDateOnly

Error Message:
expected:<...://foo.com/svn/trunk[]'> but was:<...://foo.com/svn/trunk[@]'>

Stack Trace:
junit.framework.ComparisonFailure: expected:<...://foo.com/svn/trunk[]'> but was:<...://foo.com/svn/trunk[@]'>
	at org.apache.maven.scm.provider.svn.svnexe.command.changelog.SvnChangeLogCommandTest.testCommandLine(SvnChangeLogCommandTest.java:180)
	at org.apache.maven.scm.provider.svn.svnexe.command.changelog.SvnChangeLogCommandTest.testCommandLine(SvnChangeLogCommandTest.java:165)
	at org.apache.maven.scm.provider.svn.svnexe.command.changelog.SvnChangeLogCommandTest.testCommandLineStartDateOnly(SvnChangeLogCommandTest.java:70)


FAILED:  org.apache.maven.scm.provider.svn.svnexe.command.changelog.SvnChangeLogCommandTest.testCommandLineEndDateOnly

Error Message:
expected:<...://foo.com/svn/trunk[]'> but was:<...://foo.com/svn/trunk[@]'>

Stack Trace:
junit.framework.ComparisonFailure: expected:<...://foo.com/svn/trunk[]'> but was:<...://foo.com/svn/trunk[@]'>
	at org.apache.maven.scm.provider.svn.svnexe.command.changelog.SvnChangeLogCommandTest.testCommandLine(SvnChangeLogCommandTest.java:180)
	at org.apache.maven.scm.provider.svn.svnexe.command.changelog.SvnChangeLogCommandTest.testCommandLine(SvnChangeLogCommandTest.java:165)
	at org.apache.maven.scm.provider.svn.svnexe.command.changelog.SvnChangeLogCommandTest.testCommandLineEndDateOnly(SvnChangeLogCommandTest.java:90)


FAILED:  org.apache.maven.scm.provider.svn.svnexe.command.changelog.SvnChangeLogCommandTest.testCommandLineWithStartVersionAndEndVersion

Error Message:
expected:<...://foo.com/svn/trunk[]'> but was:<...://foo.com/svn/trunk[@]'>

Stack Trace:
junit.framework.ComparisonFailure: expected:<...://foo.com/svn/trunk[]'> but was:<...://foo.com/svn/trunk[@]'>
	at org.apache.maven.scm.provider.svn.svnexe.command.changelog.SvnChangeLogCommandTest.testCommandLine(SvnChangeLogCommandTest.java:194)
	at org.apache.maven.scm.provider.svn.svnexe.command.changelog.SvnChangeLogCommandTest.testCommandLineWithStartVersionAndEndVersion(SvnChangeLogCommandTest.java:140)


FAILED:  org.apache.maven.scm.provider.svn.svnexe.command.changelog.SvnChangeLogCommandTest.testCommandLineNoDatesLimitedCount

Error Message:
expected:<...://foo.com/svn/trunk[]'> but was:<...://foo.com/svn/trunk[@]'>

Stack Trace:
junit.framework.ComparisonFailure: expected:<...://foo.com/svn/trunk[]'> but was:<...://foo.com/svn/trunk[@]'>
	at org.apache.maven.scm.provider.svn.svnexe.command.changelog.SvnChangeLogCommandTest.testCommandLine(SvnChangeLogCommandTest.java:180)
	at org.apache.maven.scm.provider.svn.svnexe.command.changelog.SvnChangeLogCommandTest.testCommandLineNoDatesLimitedCount(SvnChangeLogCommandTest.java:51)


FAILED:  org.apache.maven.scm.provider.svn.svnexe.command.changelog.SvnChangeLogCommandTest.testCommandLineWithBranchStartDateOnly

Error Message:
expected:<...nches/my-test-branch[' 'http://foo.com/svn/trunk]'> but was:<...nches/my-test-branch[@' 'http://foo.com/svn/trunk@]'>

Stack Trace:
junit.framework.ComparisonFailure: expected:<...nches/my-test-branch[' 'http://foo.com/svn/trunk]'> but was:<...nches/my-test-branch[@' 'http://foo.com/svn/trunk@]'>
	at org.apache.maven.scm.provider.svn.svnexe.command.changelog.SvnChangeLogCommandTest.testCommandLine(SvnChangeLogCommandTest.java:180)
	at org.apache.maven.scm.provider.svn.svnexe.command.changelog.SvnChangeLogCommandTest.testCommandLine(SvnChangeLogCommandTest.java:165)
	at org.apache.maven.scm.provider.svn.svnexe.command.changelog.SvnChangeLogCommandTest.testCommandLineWithBranchStartDateOnly(SvnChangeLogCommandTest.java:106)


FAILED:  org.apache.maven.scm.provider.svn.svnexe.command.changelog.SvnChangeLogCommandTest.testCommandLineDateFormat

Error Message:
expected:<...://foo.com/svn/trunk[]'> but was:<...://foo.com/svn/trunk[@]'>

Stack Trace:
junit.framework.ComparisonFailure: expected:<...://foo.com/svn/trunk[]'> but was:<...://foo.com/svn/trunk[@]'>
	at org.apache.maven.scm.provider.svn.svnexe.command.changelog.SvnChangeLogCommandTest.testCommandLine(SvnChangeLogCommandTest.java:180)
	at org.apache.maven.scm.provider.svn.svnexe.command.changelog.SvnChangeLogCommandTest.testCommandLine(SvnChangeLogCommandTest.java:165)
	at org.apache.maven.scm.provider.svn.svnexe.command.changelog.SvnChangeLogCommandTest.testCommandLineDateFormat(SvnChangeLogCommandTest.java:80)


FAILED:  org.apache.maven.scm.provider.svn.svnexe.command.changelog.SvnChangeLogCommandTest.testCommandLineWithBranchNoDates

Error Message:
expected:<...nches/my-test-branch[' 'http://foo.com/svn/trunk]'> but was:<...nches/my-test-branch[@' 'http://foo.com/svn/trunk@]'>

Stack Trace:
junit.framework.ComparisonFailure: expected:<...nches/my-test-branch[' 'http://foo.com/svn/trunk]'> but was:<...nches/my-test-branch[@' 'http://foo.com/svn/trunk@]'>
	at org.apache.maven.scm.provider.svn.svnexe.command.changelog.SvnChangeLogCommandTest.testCommandLine(SvnChangeLogCommandTest.java:180)
	at org.apache.maven.scm.provider.svn.svnexe.command.changelog.SvnChangeLogCommandTest.testCommandLine(SvnChangeLogCommandTest.java:165)
	at org.apache.maven.scm.provider.svn.svnexe.command.changelog.SvnChangeLogCommandTest.testCommandLineWithBranchNoDates(SvnChangeLogCommandTest.java:97)


FAILED:  org.apache.maven.scm.provider.svn.svnexe.command.changelog.SvnChangeLogCommandTest.testCommandLineWithDates

Error Message:
expected:<...://foo.com/svn/trunk[]'> but was:<...://foo.com/svn/trunk[@]'>

Stack Trace:
junit.framework.ComparisonFailure: expected:<...://foo.com/svn/trunk[]'> but was:<...://foo.com/svn/trunk[@]'>
	at org.apache.maven.scm.provider.svn.svnexe.command.changelog.SvnChangeLogCommandTest.testCommandLine(SvnChangeLogCommandTest.java:180)
	at org.apache.maven.scm.provider.svn.svnexe.command.changelog.SvnChangeLogCommandTest.testCommandLine(SvnChangeLogCommandTest.java:165)
	at org.apache.maven.scm.provider.svn.svnexe.command.changelog.SvnChangeLogCommandTest.testCommandLineWithDates(SvnChangeLogCommandTest.java:61)


FAILED:  org.apache.maven.scm.provider.svn.svnexe.command.changelog.SvnChangeLogCommandTest.testCommandLineWithStartVersionAndEndVersionEquals

Error Message:
expected:<...://foo.com/svn/trunk[]'> but was:<...://foo.com/svn/trunk[@]'>

Stack Trace:
junit.framework.ComparisonFailure: expected:<...://foo.com/svn/trunk[]'> but was:<...://foo.com/svn/trunk[@]'>
	at org.apache.maven.scm.provider.svn.svnexe.command.changelog.SvnChangeLogCommandTest.testCommandLine(SvnChangeLogCommandTest.java:194)
	at org.apache.maven.scm.provider.svn.svnexe.command.changelog.SvnChangeLogCommandTest.testCommandLineWithStartVersionAndEndVersionEquals(SvnChangeLogCommandTest.java:147)


FAILED:  org.apache.maven.scm.provider.svn.svnexe.command.changelog.SvnChangeLogCommandTest.testCommandLineWithBranchBothDates

Error Message:
expected:<...nches/my-test-branch[' 'http://foo.com/svn/trunk]'> but was:<...nches/my-test-branch[@' 'http://foo.com/svn/trunk@]'>

Stack Trace:
junit.framework.ComparisonFailure: expected:<...nches/my-test-branch[' 'http://foo.com/svn/trunk]'> but was:<...nches/my-test-branch[@' 'http://foo.com/svn/trunk@]'>
	at org.apache.maven.scm.provider.svn.svnexe.command.changelog.SvnChangeLogCommandTest.testCommandLine(SvnChangeLogCommandTest.java:180)
	at org.apache.maven.scm.provider.svn.svnexe.command.changelog.SvnChangeLogCommandTest.testCommandLine(SvnChangeLogCommandTest.java:165)
	at org.apache.maven.scm.provider.svn.svnexe.command.changelog.SvnChangeLogCommandTest.testCommandLineWithBranchBothDates(SvnChangeLogCommandTest.java:126)


FAILED:  org.apache.maven.scm.provider.svn.svnexe.command.changelog.SvnChangeLogCommandTest.testCommandLineWithStartVersion

Error Message:
expected:<...://foo.com/svn/trunk[]'> but was:<...://foo.com/svn/trunk[@]'>

Stack Trace:
junit.framework.ComparisonFailure: expected:<...://foo.com/svn/trunk[]'> but was:<...://foo.com/svn/trunk[@]'>
	at org.apache.maven.scm.provider.svn.svnexe.command.changelog.SvnChangeLogCommandTest.testCommandLine(SvnChangeLogCommandTest.java:194)
	at org.apache.maven.scm.provider.svn.svnexe.command.changelog.SvnChangeLogCommandTest.testCommandLineWithStartVersion(SvnChangeLogCommandTest.java:133)


FAILED:  org.apache.maven.scm.provider.svn.svnexe.command.changelog.SvnChangeLogCommandTest.testCommandLineNoDates

Error Message:
expected:<...://foo.com/svn/trunk[]'> but was:<...://foo.com/svn/trunk[@]'>

Stack Trace:
junit.framework.ComparisonFailure: expected:<...://foo.com/svn/trunk[]'> but was:<...://foo.com/svn/trunk[@]'>
	at org.apache.maven.scm.provider.svn.svnexe.command.changelog.SvnChangeLogCommandTest.testCommandLine(SvnChangeLogCommandTest.java:180)
	at org.apache.maven.scm.provider.svn.svnexe.command.changelog.SvnChangeLogCommandTest.testCommandLine(SvnChangeLogCommandTest.java:165)
	at org.apache.maven.scm.provider.svn.svnexe.command.changelog.SvnChangeLogCommandTest.testCommandLineNoDates(SvnChangeLogCommandTest.java:44)


FAILED:  org.apache.maven.scm.provider.svn.svnexe.command.changelog.SvnChangeLogCommandTest.testCommandLineWithBranchEndDateOnly

Error Message:
expected:<...nches/my-test-branch[' 'http://foo.com/svn/trunk]'> but was:<...nches/my-test-branch[@' 'http://foo.com/svn/trunk@]'>

Stack Trace:
junit.framework.ComparisonFailure: expected:<...nches/my-test-branch[' 'http://foo.com/svn/trunk]'> but was:<...nches/my-test-branch[@' 'http://foo.com/svn/trunk@]'>
	at org.apache.maven.scm.provider.svn.svnexe.command.changelog.SvnChangeLogCommandTest.testCommandLine(SvnChangeLogCommandTest.java:180)
	at org.apache.maven.scm.provider.svn.svnexe.command.changelog.SvnChangeLogCommandTest.testCommandLine(SvnChangeLogCommandTest.java:165)
	at org.apache.maven.scm.provider.svn.svnexe.command.changelog.SvnChangeLogCommandTest.testCommandLineWithBranchEndDateOnly(SvnChangeLogCommandTest.java:116)


FAILED:  org.apache.maven.scm.provider.svn.svnexe.command.changelog.SvnChangeLogCommandTest.testCommandLineStartDateOnly

Error Message:
expected:<...://foo.com/svn/trunk[]'> but was:<...://foo.com/svn/trunk[@]'>

Stack Trace:
junit.framework.ComparisonFailure: expected:<...://foo.com/svn/trunk[]'> but was:<...://foo.com/svn/trunk[@]'>
	at org.apache.maven.scm.provider.svn.svnexe.command.changelog.SvnChangeLogCommandTest.testCommandLine(SvnChangeLogCommandTest.java:180)
	at org.apache.maven.scm.provider.svn.svnexe.command.changelog.SvnChangeLogCommandTest.testCommandLine(SvnChangeLogCommandTest.java:165)
	at org.apache.maven.scm.provider.svn.svnexe.command.changelog.SvnChangeLogCommandTest.testCommandLineStartDateOnly(SvnChangeLogCommandTest.java:70)


FAILED:  org.apache.maven.scm.provider.svn.svnexe.command.changelog.SvnChangeLogCommandTest.testCommandLineEndDateOnly

Error Message:
expected:<...://foo.com/svn/trunk[]'> but was:<...://foo.com/svn/trunk[@]'>

Stack Trace:
junit.framework.ComparisonFailure: expected:<...://foo.com/svn/trunk[]'> but was:<...://foo.com/svn/trunk[@]'>
	at org.apache.maven.scm.provider.svn.svnexe.command.changelog.SvnChangeLogCommandTest.testCommandLine(SvnChangeLogCommandTest.java:180)
	at org.apache.maven.scm.provider.svn.svnexe.command.changelog.SvnChangeLogCommandTest.testCommandLine(SvnChangeLogCommandTest.java:165)
	at org.apache.maven.scm.provider.svn.svnexe.command.changelog.SvnChangeLogCommandTest.testCommandLineEndDateOnly(SvnChangeLogCommandTest.java:90)


FAILED:  org.apache.maven.scm.provider.svn.svnexe.command.changelog.SvnChangeLogCommandTest.testCommandLineWithStartVersionAndEndVersion

Error Message:
expected:<...://foo.com/svn/trunk[]'> but was:<...://foo.com/svn/trunk[@]'>

Stack Trace:
junit.framework.ComparisonFailure: expected:<...://foo.com/svn/trunk[]'> but was:<...://foo.com/svn/trunk[@]'>
	at org.apache.maven.scm.provider.svn.svnexe.command.changelog.SvnChangeLogCommandTest.testCommandLine(SvnChangeLogCommandTest.java:194)
	at org.apache.maven.scm.provider.svn.svnexe.command.changelog.SvnChangeLogCommandTest.testCommandLineWithStartVersionAndEndVersion(SvnChangeLogCommandTest.java:140)


FAILED:  org.apache.maven.scm.provider.svn.svnexe.command.changelog.SvnChangeLogCommandTest.testCommandLineNoDatesLimitedCount

Error Message:
expected:<...://foo.com/svn/trunk[]"> but was:<...://foo.com/svn/trunk[@]">

Stack Trace:
junit.framework.ComparisonFailure: expected:<...://foo.com/svn/trunk[]"> but was:<...://foo.com/svn/trunk[@]">
	at org.apache.maven.scm.provider.svn.svnexe.command.changelog.SvnChangeLogCommandTest.testCommandLine(SvnChangeLogCommandTest.java:180)
	at org.apache.maven.scm.provider.svn.svnexe.command.changelog.SvnChangeLogCommandTest.testCommandLineNoDatesLimitedCount(SvnChangeLogCommandTest.java:51)


FAILED:  org.apache.maven.scm.provider.svn.svnexe.command.changelog.SvnChangeLogCommandTest.testCommandLineWithBranchStartDateOnly

Error Message:
expected:<...nches/my-test-branch[ http://foo.com/svn/trunk]"> but was:<...nches/my-test-branch[@ http://foo.com/svn/trunk@]">

Stack Trace:
junit.framework.ComparisonFailure: expected:<...nches/my-test-branch[ http://foo.com/svn/trunk]"> but was:<...nches/my-test-branch[@ http://foo.com/svn/trunk@]">
	at org.apache.maven.scm.provider.svn.svnexe.command.changelog.SvnChangeLogCommandTest.testCommandLine(SvnChangeLogCommandTest.java:180)
	at org.apache.maven.scm.provider.svn.svnexe.command.changelog.SvnChangeLogCommandTest.testCommandLine(SvnChangeLogCommandTest.java:165)
	at org.apache.maven.scm.provider.svn.svnexe.command.changelog.SvnChangeLogCommandTest.testCommandLineWithBranchStartDateOnly(SvnChangeLogCommandTest.java:106)


FAILED:  org.apache.maven.scm.provider.svn.svnexe.command.changelog.SvnChangeLogCommandTest.testCommandLineDateFormat

Error Message:
expected:<...://foo.com/svn/trunk[]"> but was:<...://foo.com/svn/trunk[@]">

Stack Trace:
junit.framework.ComparisonFailure: expected:<...://foo.com/svn/trunk[]"> but was:<...://foo.com/svn/trunk[@]">
	at org.apache.maven.scm.provider.svn.svnexe.command.changelog.SvnChangeLogCommandTest.testCommandLine(SvnChangeLogCommandTest.java:180)
	at org.apache.maven.scm.provider.svn.svnexe.command.changelog.SvnChangeLogCommandTest.testCommandLine(SvnChangeLogCommandTest.java:165)
	at org.apache.maven.scm.provider.svn.svnexe.command.changelog.SvnChangeLogCommandTest.testCommandLineDateFormat(SvnChangeLogCommandTest.java:80)


FAILED:  org.apache.maven.scm.provider.svn.svnexe.command.changelog.SvnChangeLogCommandTest.testCommandLineWithBranchNoDates

Error Message:
expected:<...nches/my-test-branch[ http://foo.com/svn/trunk]"> but was:<...nches/my-test-branch[@ http://foo.com/svn/trunk@]">

Stack Trace:
junit.framework.ComparisonFailure: expected:<...nches/my-test-branch[ http://foo.com/svn/trunk]"> but was:<...nches/my-test-branch[@ http://foo.com/svn/trunk@]">
	at org.apache.maven.scm.provider.svn.svnexe.command.changelog.SvnChangeLogCommandTest.testCommandLine(SvnChangeLogCommandTest.java:180)
	at org.apache.maven.scm.provider.svn.svnexe.command.changelog.SvnChangeLogCommandTest.testCommandLine(SvnChangeLogCommandTest.java:165)
	at org.apache.maven.scm.provider.svn.svnexe.command.changelog.SvnChangeLogCommandTest.testCommandLineWithBranchNoDates(SvnChangeLogCommandTest.java:97)


FAILED:  org.apache.maven.scm.provider.svn.svnexe.command.changelog.SvnChangeLogCommandTest.testCommandLineWithDates

Error Message:
expected:<...://foo.com/svn/trunk[]"> but was:<...://foo.com/svn/trunk[@]">

Stack Trace:
junit.framework.ComparisonFailure: expected:<...://foo.com/svn/trunk[]"> but was:<...://foo.com/svn/trunk[@]">
	at org.apache.maven.scm.provider.svn.svnexe.command.changelog.SvnChangeLogCommandTest.testCommandLine(SvnChangeLogCommandTest.java:180)
	at org.apache.maven.scm.provider.svn.svnexe.command.changelog.SvnChangeLogCommandTest.testCommandLine(SvnChangeLogCommandTest.java:165)
	at org.apache.maven.scm.provider.svn.svnexe.command.changelog.SvnChangeLogCommandTest.testCommandLineWithDates(SvnChangeLogCommandTest.java:61)


FAILED:  org.apache.maven.scm.provider.svn.svnexe.command.changelog.SvnChangeLogCommandTest.testCommandLineWithStartVersionAndEndVersionEquals

Error Message:
expected:<...://foo.com/svn/trunk[]"> but was:<...://foo.com/svn/trunk[@]">

Stack Trace:
junit.framework.ComparisonFailure: expected:<...://foo.com/svn/trunk[]"> but was:<...://foo.com/svn/trunk[@]">
	at org.apache.maven.scm.provider.svn.svnexe.command.changelog.SvnChangeLogCommandTest.testCommandLine(SvnChangeLogCommandTest.java:194)
	at org.apache.maven.scm.provider.svn.svnexe.command.changelog.SvnChangeLogCommandTest.testCommandLineWithStartVersionAndEndVersionEquals(SvnChangeLogCommandTest.java:147)


FAILED:  org.apache.maven.scm.provider.svn.svnexe.command.changelog.SvnChangeLogCommandTest.testCommandLineWithBranchBothDates

Error Message:
expected:<...nches/my-test-branch[ http://foo.com/svn/trunk]"> but was:<...nches/my-test-branch[@ http://foo.com/svn/trunk@]">

Stack Trace:
junit.framework.ComparisonFailure: expected:<...nches/my-test-branch[ http://foo.com/svn/trunk]"> but was:<...nches/my-test-branch[@ http://foo.com/svn/trunk@]">
	at org.apache.maven.scm.provider.svn.svnexe.command.changelog.SvnChangeLogCommandTest.testCommandLine(SvnChangeLogCommandTest.java:180)
	at org.apache.maven.scm.provider.svn.svnexe.command.changelog.SvnChangeLogCommandTest.testCommandLine(SvnChangeLogCommandTest.java:165)
	at org.apache.maven.scm.provider.svn.svnexe.command.changelog.SvnChangeLogCommandTest.testCommandLineWithBranchBothDates(SvnChangeLogCommandTest.java:126)


FAILED:  org.apache.maven.scm.provider.svn.svnexe.command.changelog.SvnChangeLogCommandTest.testCommandLineWithStartVersion

Error Message:
expected:<...://foo.com/svn/trunk[]"> but was:<...://foo.com/svn/trunk[@]">

Stack Trace:
junit.framework.ComparisonFailure: expected:<...://foo.com/svn/trunk[]"> but was:<...://foo.com/svn/trunk[@]">
	at org.apache.maven.scm.provider.svn.svnexe.command.changelog.SvnChangeLogCommandTest.testCommandLine(SvnChangeLogCommandTest.java:194)
	at org.apache.maven.scm.provider.svn.svnexe.command.changelog.SvnChangeLogCommandTest.testCommandLineWithStartVersion(SvnChangeLogCommandTest.java:133)


FAILED:  org.apache.maven.scm.provider.svn.svnexe.command.changelog.SvnChangeLogCommandTest.testCommandLineNoDates

Error Message:
expected:<...://foo.com/svn/trunk[]"> but was:<...://foo.com/svn/trunk[@]">

Stack Trace:
junit.framework.ComparisonFailure: expected:<...://foo.com/svn/trunk[]"> but was:<...://foo.com/svn/trunk[@]">
	at org.apache.maven.scm.provider.svn.svnexe.command.changelog.SvnChangeLogCommandTest.testCommandLine(SvnChangeLogCommandTest.java:180)
	at org.apache.maven.scm.provider.svn.svnexe.command.changelog.SvnChangeLogCommandTest.testCommandLine(SvnChangeLogCommandTest.java:165)
	at org.apache.maven.scm.provider.svn.svnexe.command.changelog.SvnChangeLogCommandTest.testCommandLineNoDates(SvnChangeLogCommandTest.java:44)


FAILED:  org.apache.maven.scm.provider.svn.svnexe.command.changelog.SvnChangeLogCommandTest.testCommandLineWithBranchEndDateOnly

Error Message:
expected:<...nches/my-test-branch[ http://foo.com/svn/trunk]"> but was:<...nches/my-test-branch[@ http://foo.com/svn/trunk@]">

Stack Trace:
junit.framework.ComparisonFailure: expected:<...nches/my-test-branch[ http://foo.com/svn/trunk]"> but was:<...nches/my-test-branch[@ http://foo.com/svn/trunk@]">
	at org.apache.maven.scm.provider.svn.svnexe.command.changelog.SvnChangeLogCommandTest.testCommandLine(SvnChangeLogCommandTest.java:180)
	at org.apache.maven.scm.provider.svn.svnexe.command.changelog.SvnChangeLogCommandTest.testCommandLine(SvnChangeLogCommandTest.java:165)
	at org.apache.maven.scm.provider.svn.svnexe.command.changelog.SvnChangeLogCommandTest.testCommandLineWithBranchEndDateOnly(SvnChangeLogCommandTest.java:116)


FAILED:  org.apache.maven.scm.provider.svn.svnexe.command.changelog.SvnChangeLogCommandTest.testCommandLineStartDateOnly

Error Message:
expected:<...://foo.com/svn/trunk[]"> but was:<...://foo.com/svn/trunk[@]">

Stack Trace:
junit.framework.ComparisonFailure: expected:<...://foo.com/svn/trunk[]"> but was:<...://foo.com/svn/trunk[@]">
	at org.apache.maven.scm.provider.svn.svnexe.command.changelog.SvnChangeLogCommandTest.testCommandLine(SvnChangeLogCommandTest.java:180)
	at org.apache.maven.scm.provider.svn.svnexe.command.changelog.SvnChangeLogCommandTest.testCommandLine(SvnChangeLogCommandTest.java:165)
	at org.apache.maven.scm.provider.svn.svnexe.command.changelog.SvnChangeLogCommandTest.testCommandLineStartDateOnly(SvnChangeLogCommandTest.java:70)


FAILED:  org.apache.maven.scm.provider.svn.svnexe.command.changelog.SvnChangeLogCommandTest.testCommandLineEndDateOnly

Error Message:
expected:<...://foo.com/svn/trunk[]"> but was:<...://foo.com/svn/trunk[@]">

Stack Trace:
junit.framework.ComparisonFailure: expected:<...://foo.com/svn/trunk[]"> but was:<...://foo.com/svn/trunk[@]">
	at org.apache.maven.scm.provider.svn.svnexe.command.changelog.SvnChangeLogCommandTest.testCommandLine(SvnChangeLogCommandTest.java:180)
	at org.apache.maven.scm.provider.svn.svnexe.command.changelog.SvnChangeLogCommandTest.testCommandLine(SvnChangeLogCommandTest.java:165)
	at org.apache.maven.scm.provider.svn.svnexe.command.changelog.SvnChangeLogCommandTest.testCommandLineEndDateOnly(SvnChangeLogCommandTest.java:90)


FAILED:  org.apache.maven.scm.provider.svn.svnexe.command.changelog.SvnChangeLogCommandTest.testCommandLineWithStartVersionAndEndVersion

Error Message:
expected:<...://foo.com/svn/trunk[]"> but was:<...://foo.com/svn/trunk[@]">

Stack Trace:
junit.framework.ComparisonFailure: expected:<...://foo.com/svn/trunk[]"> but was:<...://foo.com/svn/trunk[@]">
	at org.apache.maven.scm.provider.svn.svnexe.command.changelog.SvnChangeLogCommandTest.testCommandLine(SvnChangeLogCommandTest.java:194)
	at org.apache.maven.scm.provider.svn.svnexe.command.changelog.SvnChangeLogCommandTest.testCommandLineWithStartVersionAndEndVersion(SvnChangeLogCommandTest.java:140)


FAILED:  org.apache.maven.scm.provider.svn.svnexe.command.changelog.SvnChangeLogCommandTest.testCommandLineNoDatesLimitedCount

Error Message:
expected:<...://foo.com/svn/trunk[]'> but was:<...://foo.com/svn/trunk[@]'>

Stack Trace:
junit.framework.ComparisonFailure: expected:<...://foo.com/svn/trunk[]'> but was:<...://foo.com/svn/trunk[@]'>
	at org.apache.maven.scm.provider.svn.svnexe.command.changelog.SvnChangeLogCommandTest.testCommandLine(SvnChangeLogCommandTest.java:180)
	at org.apache.maven.scm.provider.svn.svnexe.command.changelog.SvnChangeLogCommandTest.testCommandLineNoDatesLimitedCount(SvnChangeLogCommandTest.java:51)


FAILED:  org.apache.maven.scm.provider.svn.svnexe.command.changelog.SvnChangeLogCommandTest.testCommandLineWithBranchStartDateOnly

Error Message:
expected:<...nches/my-test-branch[' 'http://foo.com/svn/trunk]'> but was:<...nches/my-test-branch[@' 'http://foo.com/svn/trunk@]'>

Stack Trace:
junit.framework.ComparisonFailure: expected:<...nches/my-test-branch[' 'http://foo.com/svn/trunk]'> but was:<...nches/my-test-branch[@' 'http://foo.com/svn/trunk@]'>
	at org.apache.maven.scm.provider.svn.svnexe.command.changelog.SvnChangeLogCommandTest.testCommandLine(SvnChangeLogCommandTest.java:180)
	at org.apache.maven.scm.provider.svn.svnexe.command.changelog.SvnChangeLogCommandTest.testCommandLine(SvnChangeLogCommandTest.java:165)
	at org.apache.maven.scm.provider.svn.svnexe.command.changelog.SvnChangeLogCommandTest.testCommandLineWithBranchStartDateOnly(SvnChangeLogCommandTest.java:106)


FAILED:  org.apache.maven.scm.provider.svn.svnexe.command.changelog.SvnChangeLogCommandTest.testCommandLineDateFormat

Error Message:
expected:<...://foo.com/svn/trunk[]'> but was:<...://foo.com/svn/trunk[@]'>

Stack Trace:
junit.framework.ComparisonFailure: expected:<...://foo.com/svn/trunk[]'> but was:<...://foo.com/svn/trunk[@]'>
	at org.apache.maven.scm.provider.svn.svnexe.command.changelog.SvnChangeLogCommandTest.testCommandLine(SvnChangeLogCommandTest.java:180)
	at org.apache.maven.scm.provider.svn.svnexe.command.changelog.SvnChangeLogCommandTest.testCommandLine(SvnChangeLogCommandTest.java:165)
	at org.apache.maven.scm.provider.svn.svnexe.command.changelog.SvnChangeLogCommandTest.testCommandLineDateFormat(SvnChangeLogCommandTest.java:80)


FAILED:  org.apache.maven.scm.provider.svn.svnexe.command.changelog.SvnChangeLogCommandTest.testCommandLineWithBranchNoDates

Error Message:
expected:<...nches/my-test-branch[' 'http://foo.com/svn/trunk]'> but was:<...nches/my-test-branch[@' 'http://foo.com/svn/trunk@]'>

Stack Trace:
junit.framework.ComparisonFailure: expected:<...nches/my-test-branch[' 'http://foo.com/svn/trunk]'> but was:<...nches/my-test-branch[@' 'http://foo.com/svn/trunk@]'>
	at org.apache.maven.scm.provider.svn.svnexe.command.changelog.SvnChangeLogCommandTest.testCommandLine(SvnChangeLogCommandTest.java:180)
	at org.apache.maven.scm.provider.svn.svnexe.command.changelog.SvnChangeLogCommandTest.testCommandLine(SvnChangeLogCommandTest.java:165)
	at org.apache.maven.scm.provider.svn.svnexe.command.changelog.SvnChangeLogCommandTest.testCommandLineWithBranchNoDates(SvnChangeLogCommandTest.java:97)


FAILED:  org.apache.maven.scm.provider.svn.svnexe.command.changelog.SvnChangeLogCommandTest.testCommandLineWithDates

Error Message:
expected:<...://foo.com/svn/trunk[]'> but was:<...://foo.com/svn/trunk[@]'>

Stack Trace:
junit.framework.ComparisonFailure: expected:<...://foo.com/svn/trunk[]'> but was:<...://foo.com/svn/trunk[@]'>
	at org.apache.maven.scm.provider.svn.svnexe.command.changelog.SvnChangeLogCommandTest.testCommandLine(SvnChangeLogCommandTest.java:180)
	at org.apache.maven.scm.provider.svn.svnexe.command.changelog.SvnChangeLogCommandTest.testCommandLine(SvnChangeLogCommandTest.java:165)
	at org.apache.maven.scm.provider.svn.svnexe.command.changelog.SvnChangeLogCommandTest.testCommandLineWithDates(SvnChangeLogCommandTest.java:61)


FAILED:  org.apache.maven.scm.provider.svn.svnexe.command.changelog.SvnChangeLogCommandTest.testCommandLineWithStartVersionAndEndVersionEquals

Error Message:
expected:<...://foo.com/svn/trunk[]'> but was:<...://foo.com/svn/trunk[@]'>

Stack Trace:
junit.framework.ComparisonFailure: expected:<...://foo.com/svn/trunk[]'> but was:<...://foo.com/svn/trunk[@]'>
	at org.apache.maven.scm.provider.svn.svnexe.command.changelog.SvnChangeLogCommandTest.testCommandLine(SvnChangeLogCommandTest.java:194)
	at org.apache.maven.scm.provider.svn.svnexe.command.changelog.SvnChangeLogCommandTest.testCommandLineWithStartVersionAndEndVersionEquals(SvnChangeLogCommandTest.java:147)


FAILED:  org.apache.maven.scm.provider.svn.svnexe.command.changelog.SvnChangeLogCommandTest.testCommandLineWithBranchBothDates

Error Message:
expected:<...nches/my-test-branch[' 'http://foo.com/svn/trunk]'> but was:<...nches/my-test-branch[@' 'http://foo.com/svn/trunk@]'>

Stack Trace:
junit.framework.ComparisonFailure: expected:<...nches/my-test-branch[' 'http://foo.com/svn/trunk]'> but was:<...nches/my-test-branch[@' 'http://foo.com/svn/trunk@]'>
	at org.apache.maven.scm.provider.svn.svnexe.command.changelog.SvnChangeLogCommandTest.testCommandLine(SvnChangeLogCommandTest.java:180)
	at org.apache.maven.scm.provider.svn.svnexe.command.changelog.SvnChangeLogCommandTest.testCommandLine(SvnChangeLogCommandTest.java:165)
	at org.apache.maven.scm.provider.svn.svnexe.command.changelog.SvnChangeLogCommandTest.testCommandLineWithBranchBothDates(SvnChangeLogCommandTest.java:126)


FAILED:  org.apache.maven.scm.provider.svn.svnexe.command.changelog.SvnChangeLogCommandTest.testCommandLineWithStartVersion

Error Message:
expected:<...://foo.com/svn/trunk[]'> but was:<...://foo.com/svn/trunk[@]'>

Stack Trace:
junit.framework.ComparisonFailure: expected:<...://foo.com/svn/trunk[]'> but was:<...://foo.com/svn/trunk[@]'>
	at org.apache.maven.scm.provider.svn.svnexe.command.changelog.SvnChangeLogCommandTest.testCommandLine(SvnChangeLogCommandTest.java:194)
	at org.apache.maven.scm.provider.svn.svnexe.command.changelog.SvnChangeLogCommandTest.testCommandLineWithStartVersion(SvnChangeLogCommandTest.java:133)


FAILED:  org.apache.maven.scm.provider.svn.svnexe.command.changelog.SvnChangeLogCommandTest.testCommandLineNoDates

Error Message:
expected:<...://foo.com/svn/trunk[]'> but was:<...://foo.com/svn/trunk[@]'>

Stack Trace:
junit.framework.ComparisonFailure: expected:<...://foo.com/svn/trunk[]'> but was:<...://foo.com/svn/trunk[@]'>
	at org.apache.maven.scm.provider.svn.svnexe.command.changelog.SvnChangeLogCommandTest.testCommandLine(SvnChangeLogCommandTest.java:180)
	at org.apache.maven.scm.provider.svn.svnexe.command.changelog.SvnChangeLogCommandTest.testCommandLine(SvnChangeLogCommandTest.java:165)
	at org.apache.maven.scm.provider.svn.svnexe.command.changelog.SvnChangeLogCommandTest.testCommandLineNoDates(SvnChangeLogCommandTest.java:44)


FAILED:  org.apache.maven.scm.provider.svn.svnexe.command.changelog.SvnChangeLogCommandTest.testCommandLineWithBranchEndDateOnly

Error Message:
expected:<...nches/my-test-branch[' 'http://foo.com/svn/trunk]'> but was:<...nches/my-test-branch[@' 'http://foo.com/svn/trunk@]'>

Stack Trace:
junit.framework.ComparisonFailure: expected:<...nches/my-test-branch[' 'http://foo.com/svn/trunk]'> but was:<...nches/my-test-branch[@' 'http://foo.com/svn/trunk@]'>
	at org.apache.maven.scm.provider.svn.svnexe.command.changelog.SvnChangeLogCommandTest.testCommandLine(SvnChangeLogCommandTest.java:180)
	at org.apache.maven.scm.provider.svn.svnexe.command.changelog.SvnChangeLogCommandTest.testCommandLine(SvnChangeLogCommandTest.java:165)
	at org.apache.maven.scm.provider.svn.svnexe.command.changelog.SvnChangeLogCommandTest.testCommandLineWithBranchEndDateOnly(SvnChangeLogCommandTest.java:116)


FAILED:  org.apache.maven.scm.provider.svn.svnexe.command.changelog.SvnChangeLogCommandTest.testCommandLineStartDateOnly

Error Message:
expected:<...://foo.com/svn/trunk[]'> but was:<...://foo.com/svn/trunk[@]'>

Stack Trace:
junit.framework.ComparisonFailure: expected:<...://foo.com/svn/trunk[]'> but was:<...://foo.com/svn/trunk[@]'>
	at org.apache.maven.scm.provider.svn.svnexe.command.changelog.SvnChangeLogCommandTest.testCommandLine(SvnChangeLogCommandTest.java:180)
	at org.apache.maven.scm.provider.svn.svnexe.command.changelog.SvnChangeLogCommandTest.testCommandLine(SvnChangeLogCommandTest.java:165)
	at org.apache.maven.scm.provider.svn.svnexe.command.changelog.SvnChangeLogCommandTest.testCommandLineStartDateOnly(SvnChangeLogCommandTest.java:70)


FAILED:  org.apache.maven.scm.provider.svn.svnexe.command.changelog.SvnChangeLogCommandTest.testCommandLineEndDateOnly

Error Message:
expected:<...://foo.com/svn/trunk[]'> but was:<...://foo.com/svn/trunk[@]'>

Stack Trace:
junit.framework.ComparisonFailure: expected:<...://foo.com/svn/trunk[]'> but was:<...://foo.com/svn/trunk[@]'>
	at org.apache.maven.scm.provider.svn.svnexe.command.changelog.SvnChangeLogCommandTest.testCommandLine(SvnChangeLogCommandTest.java:180)
	at org.apache.maven.scm.provider.svn.svnexe.command.changelog.SvnChangeLogCommandTest.testCommandLine(SvnChangeLogCommandTest.java:165)
	at org.apache.maven.scm.provider.svn.svnexe.command.changelog.SvnChangeLogCommandTest.testCommandLineEndDateOnly(SvnChangeLogCommandTest.java:90)


FAILED:  org.apache.maven.scm.provider.svn.svnexe.command.changelog.SvnChangeLogCommandTest.testCommandLineWithStartVersionAndEndVersion

Error Message:
expected:<...://foo.com/svn/trunk[]'> but was:<...://foo.com/svn/trunk[@]'>

Stack Trace:
junit.framework.ComparisonFailure: expected:<...://foo.com/svn/trunk[]'> but was:<...://foo.com/svn/trunk[@]'>
	at org.apache.maven.scm.provider.svn.svnexe.command.changelog.SvnChangeLogCommandTest.testCommandLine(SvnChangeLogCommandTest.java:194)
	at org.apache.maven.scm.provider.svn.svnexe.command.changelog.SvnChangeLogCommandTest.testCommandLineWithStartVersionAndEndVersion(SvnChangeLogCommandTest.java:140)


FAILED:  org.apache.maven.scm.provider.svn.svnexe.command.changelog.SvnChangeLogCommandTest.testCommandLineNoDatesLimitedCount

Error Message:
expected:<...://foo.com/svn/trunk[]"> but was:<...://foo.com/svn/trunk[@]">

Stack Trace:
junit.framework.ComparisonFailure: expected:<...://foo.com/svn/trunk[]"> but was:<...://foo.com/svn/trunk[@]">
	at org.apache.maven.scm.provider.svn.svnexe.command.changelog.SvnChangeLogCommandTest.testCommandLine(SvnChangeLogCommandTest.java:180)
	at org.apache.maven.scm.provider.svn.svnexe.command.changelog.SvnChangeLogCommandTest.testCommandLineNoDatesLimitedCount(SvnChangeLogCommandTest.java:51)


FAILED:  org.apache.maven.scm.provider.svn.svnexe.command.changelog.SvnChangeLogCommandTest.testCommandLineWithBranchStartDateOnly

Error Message:
expected:<...nches/my-test-branch[ http://foo.com/svn/trunk]"> but was:<...nches/my-test-branch[@ http://foo.com/svn/trunk@]">

Stack Trace:
junit.framework.ComparisonFailure: expected:<...nches/my-test-branch[ http://foo.com/svn/trunk]"> but was:<...nches/my-test-branch[@ http://foo.com/svn/trunk@]">
	at org.apache.maven.scm.provider.svn.svnexe.command.changelog.SvnChangeLogCommandTest.testCommandLine(SvnChangeLogCommandTest.java:180)
	at org.apache.maven.scm.provider.svn.svnexe.command.changelog.SvnChangeLogCommandTest.testCommandLine(SvnChangeLogCommandTest.java:165)
	at org.apache.maven.scm.provider.svn.svnexe.command.changelog.SvnChangeLogCommandTest.testCommandLineWithBranchStartDateOnly(SvnChangeLogCommandTest.java:106)


FAILED:  org.apache.maven.scm.provider.svn.svnexe.command.changelog.SvnChangeLogCommandTest.testCommandLineDateFormat

Error Message:
expected:<...://foo.com/svn/trunk[]"> but was:<...://foo.com/svn/trunk[@]">

Stack Trace:
junit.framework.ComparisonFailure: expected:<...://foo.com/svn/trunk[]"> but was:<...://foo.com/svn/trunk[@]">
	at org.apache.maven.scm.provider.svn.svnexe.command.changelog.SvnChangeLogCommandTest.testCommandLine(SvnChangeLogCommandTest.java:180)
	at org.apache.maven.scm.provider.svn.svnexe.command.changelog.SvnChangeLogCommandTest.testCommandLine(SvnChangeLogCommandTest.java:165)
	at org.apache.maven.scm.provider.svn.svnexe.command.changelog.SvnChangeLogCommandTest.testCommandLineDateFormat(SvnChangeLogCommandTest.java:80)


FAILED:  org.apache.maven.scm.provider.svn.svnexe.command.changelog.SvnChangeLogCommandTest.testCommandLineWithBranchNoDates

Error Message:
expected:<...nches/my-test-branch[ http://foo.com/svn/trunk]"> but was:<...nches/my-test-branch[@ http://foo.com/svn/trunk@]">

Stack Trace:
junit.framework.ComparisonFailure: expected:<...nches/my-test-branch[ http://foo.com/svn/trunk]"> but was:<...nches/my-test-branch[@ http://foo.com/svn/trunk@]">
	at org.apache.maven.scm.provider.svn.svnexe.command.changelog.SvnChangeLogCommandTest.testCommandLine(SvnChangeLogCommandTest.java:180)
	at org.apache.maven.scm.provider.svn.svnexe.command.changelog.SvnChangeLogCommandTest.testCommandLine(SvnChangeLogCommandTest.java:165)
	at org.apache.maven.scm.provider.svn.svnexe.command.changelog.SvnChangeLogCommandTest.testCommandLineWithBranchNoDates(SvnChangeLogCommandTest.java:97)


FAILED:  org.apache.maven.scm.provider.svn.svnexe.command.changelog.SvnChangeLogCommandTest.testCommandLineWithDates

Error Message:
expected:<...://foo.com/svn/trunk[]"> but was:<...://foo.com/svn/trunk[@]">

Stack Trace:
junit.framework.ComparisonFailure: expected:<...://foo.com/svn/trunk[]"> but was:<...://foo.com/svn/trunk[@]">
	at org.apache.maven.scm.provider.svn.svnexe.command.changelog.SvnChangeLogCommandTest.testCommandLine(SvnChangeLogCommandTest.java:180)
	at org.apache.maven.scm.provider.svn.svnexe.command.changelog.SvnChangeLogCommandTest.testCommandLine(SvnChangeLogCommandTest.java:165)
	at org.apache.maven.scm.provider.svn.svnexe.command.changelog.SvnChangeLogCommandTest.testCommandLineWithDates(SvnChangeLogCommandTest.java:61)


FAILED:  org.apache.maven.scm.provider.svn.svnexe.command.changelog.SvnChangeLogCommandTest.testCommandLineWithStartVersionAndEndVersionEquals

Error Message:
expected:<...://foo.com/svn/trunk[]"> but was:<...://foo.com/svn/trunk[@]">

Stack Trace:
junit.framework.ComparisonFailure: expected:<...://foo.com/svn/trunk[]"> but was:<...://foo.com/svn/trunk[@]">
	at org.apache.maven.scm.provider.svn.svnexe.command.changelog.SvnChangeLogCommandTest.testCommandLine(SvnChangeLogCommandTest.java:194)
	at org.apache.maven.scm.provider.svn.svnexe.command.changelog.SvnChangeLogCommandTest.testCommandLineWithStartVersionAndEndVersionEquals(SvnChangeLogCommandTest.java:147)


FAILED:  org.apache.maven.scm.provider.svn.svnexe.command.changelog.SvnChangeLogCommandTest.testCommandLineWithBranchBothDates

Error Message:
expected:<...nches/my-test-branch[ http://foo.com/svn/trunk]"> but was:<...nches/my-test-branch[@ http://foo.com/svn/trunk@]">

Stack Trace:
junit.framework.ComparisonFailure: expected:<...nches/my-test-branch[ http://foo.com/svn/trunk]"> but was:<...nches/my-test-branch[@ http://foo.com/svn/trunk@]">
	at org.apache.maven.scm.provider.svn.svnexe.command.changelog.SvnChangeLogCommandTest.testCommandLine(SvnChangeLogCommandTest.java:180)
	at org.apache.maven.scm.provider.svn.svnexe.command.changelog.SvnChangeLogCommandTest.testCommandLine(SvnChangeLogCommandTest.java:165)
	at org.apache.maven.scm.provider.svn.svnexe.command.changelog.SvnChangeLogCommandTest.testCommandLineWithBranchBothDates(SvnChangeLogCommandTest.java:126)


FAILED:  org.apache.maven.scm.provider.svn.svnexe.command.changelog.SvnChangeLogCommandTest.testCommandLineWithStartVersion

Error Message:
expected:<...://foo.com/svn/trunk[]"> but was:<...://foo.com/svn/trunk[@]">

Stack Trace:
junit.framework.ComparisonFailure: expected:<...://foo.com/svn/trunk[]"> but was:<...://foo.com/svn/trunk[@]">
	at org.apache.maven.scm.provider.svn.svnexe.command.changelog.SvnChangeLogCommandTest.testCommandLine(SvnChangeLogCommandTest.java:194)
	at org.apache.maven.scm.provider.svn.svnexe.command.changelog.SvnChangeLogCommandTest.testCommandLineWithStartVersion(SvnChangeLogCommandTest.java:133)


FAILED:  org.apache.maven.scm.provider.svn.svnexe.command.changelog.SvnChangeLogCommandTest.testCommandLineNoDates

Error Message:
expected:<...://foo.com/svn/trunk[]"> but was:<...://foo.com/svn/trunk[@]">

Stack Trace:
junit.framework.ComparisonFailure: expected:<...://foo.com/svn/trunk[]"> but was:<...://foo.com/svn/trunk[@]">
	at org.apache.maven.scm.provider.svn.svnexe.command.changelog.SvnChangeLogCommandTest.testCommandLine(SvnChangeLogCommandTest.java:180)
	at org.apache.maven.scm.provider.svn.svnexe.command.changelog.SvnChangeLogCommandTest.testCommandLine(SvnChangeLogCommandTest.java:165)
	at org.apache.maven.scm.provider.svn.svnexe.command.changelog.SvnChangeLogCommandTest.testCommandLineNoDates(SvnChangeLogCommandTest.java:44)


FAILED:  org.apache.maven.scm.provider.svn.svnexe.command.changelog.SvnChangeLogCommandTest.testCommandLineWithBranchEndDateOnly

Error Message:
expected:<...nches/my-test-branch[ http://foo.com/svn/trunk]"> but was:<...nches/my-test-branch[@ http://foo.com/svn/trunk@]">

Stack Trace:
junit.framework.ComparisonFailure: expected:<...nches/my-test-branch[ http://foo.com/svn/trunk]"> but was:<...nches/my-test-branch[@ http://foo.com/svn/trunk@]">
	at org.apache.maven.scm.provider.svn.svnexe.command.changelog.SvnChangeLogCommandTest.testCommandLine(SvnChangeLogCommandTest.java:180)
	at org.apache.maven.scm.provider.svn.svnexe.command.changelog.SvnChangeLogCommandTest.testCommandLine(SvnChangeLogCommandTest.java:165)
	at org.apache.maven.scm.provider.svn.svnexe.command.changelog.SvnChangeLogCommandTest.testCommandLineWithBranchEndDateOnly(SvnChangeLogCommandTest.java:116)


FAILED:  org.apache.maven.scm.provider.svn.svnexe.command.changelog.SvnChangeLogCommandTest.testCommandLineStartDateOnly

Error Message:
expected:<...://foo.com/svn/trunk[]"> but was:<...://foo.com/svn/trunk[@]">

Stack Trace:
junit.framework.ComparisonFailure: expected:<...://foo.com/svn/trunk[]"> but was:<...://foo.com/svn/trunk[@]">
	at org.apache.maven.scm.provider.svn.svnexe.command.changelog.SvnChangeLogCommandTest.testCommandLine(SvnChangeLogCommandTest.java:180)
	at org.apache.maven.scm.provider.svn.svnexe.command.changelog.SvnChangeLogCommandTest.testCommandLine(SvnChangeLogCommandTest.java:165)
	at org.apache.maven.scm.provider.svn.svnexe.command.changelog.SvnChangeLogCommandTest.testCommandLineStartDateOnly(SvnChangeLogCommandTest.java:70)


FAILED:  org.apache.maven.scm.provider.svn.svnexe.command.changelog.SvnChangeLogCommandTest.testCommandLineEndDateOnly

Error Message:
expected:<...://foo.com/svn/trunk[]"> but was:<...://foo.com/svn/trunk[@]">

Stack Trace:
junit.framework.ComparisonFailure: expected:<...://foo.com/svn/trunk[]"> but was:<...://foo.com/svn/trunk[@]">
	at org.apache.maven.scm.provider.svn.svnexe.command.changelog.SvnChangeLogCommandTest.testCommandLine(SvnChangeLogCommandTest.java:180)
	at org.apache.maven.scm.provider.svn.svnexe.command.changelog.SvnChangeLogCommandTest.testCommandLine(SvnChangeLogCommandTest.java:165)
	at org.apache.maven.scm.provider.svn.svnexe.command.changelog.SvnChangeLogCommandTest.testCommandLineEndDateOnly(SvnChangeLogCommandTest.java:90)


FAILED:  org.apache.maven.scm.provider.svn.svnexe.command.changelog.SvnChangeLogCommandTest.testCommandLineWithStartVersionAndEndVersion

Error Message:
expected:<...://foo.com/svn/trunk[]"> but was:<...://foo.com/svn/trunk[@]">

Stack Trace:
junit.framework.ComparisonFailure: expected:<...://foo.com/svn/trunk[]"> but was:<...://foo.com/svn/trunk[@]">
	at org.apache.maven.scm.provider.svn.svnexe.command.changelog.SvnChangeLogCommandTest.testCommandLine(SvnChangeLogCommandTest.java:194)
	at org.apache.maven.scm.provider.svn.svnexe.command.changelog.SvnChangeLogCommandTest.testCommandLineWithStartVersionAndEndVersion(SvnChangeLogCommandTest.java:140)


FAILED:  org.apache.maven.scm.provider.svn.svnexe.command.changelog.SvnChangeLogCommandTest.testCommandLineNoDatesLimitedCount

Error Message:
expected:<...://foo.com/svn/trunk[]"> but was:<...://foo.com/svn/trunk[@]">

Stack Trace:
junit.framework.ComparisonFailure: expected:<...://foo.com/svn/trunk[]"> but was:<...://foo.com/svn/trunk[@]">
	at org.apache.maven.scm.provider.svn.svnexe.command.changelog.SvnChangeLogCommandTest.testCommandLine(SvnChangeLogCommandTest.java:180)
	at org.apache.maven.scm.provider.svn.svnexe.command.changelog.SvnChangeLogCommandTest.testCommandLineNoDatesLimitedCount(SvnChangeLogCommandTest.java:51)


FAILED:  org.apache.maven.scm.provider.svn.svnexe.command.changelog.SvnChangeLogCommandTest.testCommandLineWithBranchStartDateOnly

Error Message:
expected:<...nches/my-test-branch[ http://foo.com/svn/trunk]"> but was:<...nches/my-test-branch[@ http://foo.com/svn/trunk@]">

Stack Trace:
junit.framework.ComparisonFailure: expected:<...nches/my-test-branch[ http://foo.com/svn/trunk]"> but was:<...nches/my-test-branch[@ http://foo.com/svn/trunk@]">
	at org.apache.maven.scm.provider.svn.svnexe.command.changelog.SvnChangeLogCommandTest.testCommandLine(SvnChangeLogCommandTest.java:180)
	at org.apache.maven.scm.provider.svn.svnexe.command.changelog.SvnChangeLogCommandTest.testCommandLine(SvnChangeLogCommandTest.java:165)
	at org.apache.maven.scm.provider.svn.svnexe.command.changelog.SvnChangeLogCommandTest.testCommandLineWithBranchStartDateOnly(SvnChangeLogCommandTest.java:106)


FAILED:  org.apache.maven.scm.provider.svn.svnexe.command.changelog.SvnChangeLogCommandTest.testCommandLineDateFormat

Error Message:
expected:<...://foo.com/svn/trunk[]"> but was:<...://foo.com/svn/trunk[@]">

Stack Trace:
junit.framework.ComparisonFailure: expected:<...://foo.com/svn/trunk[]"> but was:<...://foo.com/svn/trunk[@]">
	at org.apache.maven.scm.provider.svn.svnexe.command.changelog.SvnChangeLogCommandTest.testCommandLine(SvnChangeLogCommandTest.java:180)
	at org.apache.maven.scm.provider.svn.svnexe.command.changelog.SvnChangeLogCommandTest.testCommandLine(SvnChangeLogCommandTest.java:165)
	at org.apache.maven.scm.provider.svn.svnexe.command.changelog.SvnChangeLogCommandTest.testCommandLineDateFormat(SvnChangeLogCommandTest.java:80)


FAILED:  org.apache.maven.scm.provider.svn.svnexe.command.changelog.SvnChangeLogCommandTest.testCommandLineWithBranchNoDates

Error Message:
expected:<...nches/my-test-branch[ http://foo.com/svn/trunk]"> but was:<...nches/my-test-branch[@ http://foo.com/svn/trunk@]">

Stack Trace:
junit.framework.ComparisonFailure: expected:<...nches/my-test-branch[ http://foo.com/svn/trunk]"> but was:<...nches/my-test-branch[@ http://foo.com/svn/trunk@]">
	at org.apache.maven.scm.provider.svn.svnexe.command.changelog.SvnChangeLogCommandTest.testCommandLine(SvnChangeLogCommandTest.java:180)
	at org.apache.maven.scm.provider.svn.svnexe.command.changelog.SvnChangeLogCommandTest.testCommandLine(SvnChangeLogCommandTest.java:165)
	at org.apache.maven.scm.provider.svn.svnexe.command.changelog.SvnChangeLogCommandTest.testCommandLineWithBranchNoDates(SvnChangeLogCommandTest.java:97)


FAILED:  org.apache.maven.scm.provider.svn.svnexe.command.changelog.SvnChangeLogCommandTest.testCommandLineWithDates

Error Message:
expected:<...://foo.com/svn/trunk[]"> but was:<...://foo.com/svn/trunk[@]">

Stack Trace:
junit.framework.ComparisonFailure: expected:<...://foo.com/svn/trunk[]"> but was:<...://foo.com/svn/trunk[@]">
	at org.apache.maven.scm.provider.svn.svnexe.command.changelog.SvnChangeLogCommandTest.testCommandLine(SvnChangeLogCommandTest.java:180)
	at org.apache.maven.scm.provider.svn.svnexe.command.changelog.SvnChangeLogCommandTest.testCommandLine(SvnChangeLogCommandTest.java:165)
	at org.apache.maven.scm.provider.svn.svnexe.command.changelog.SvnChangeLogCommandTest.testCommandLineWithDates(SvnChangeLogCommandTest.java:61)


FAILED:  org.apache.maven.scm.provider.svn.svnexe.command.changelog.SvnChangeLogCommandTest.testCommandLineWithStartVersionAndEndVersionEquals

Error Message:
expected:<...://foo.com/svn/trunk[]"> but was:<...://foo.com/svn/trunk[@]">

Stack Trace:
junit.framework.ComparisonFailure: expected:<...://foo.com/svn/trunk[]"> but was:<...://foo.com/svn/trunk[@]">
	at org.apache.maven.scm.provider.svn.svnexe.command.changelog.SvnChangeLogCommandTest.testCommandLine(SvnChangeLogCommandTest.java:194)
	at org.apache.maven.scm.provider.svn.svnexe.command.changelog.SvnChangeLogCommandTest.testCommandLineWithStartVersionAndEndVersionEquals(SvnChangeLogCommandTest.java:147)


FAILED:  org.apache.maven.scm.provider.svn.svnexe.command.changelog.SvnChangeLogCommandTest.testCommandLineWithBranchBothDates

Error Message:
expected:<...nches/my-test-branch[ http://foo.com/svn/trunk]"> but was:<...nches/my-test-branch[@ http://foo.com/svn/trunk@]">

Stack Trace:
junit.framework.ComparisonFailure: expected:<...nches/my-test-branch[ http://foo.com/svn/trunk]"> but was:<...nches/my-test-branch[@ http://foo.com/svn/trunk@]">
	at org.apache.maven.scm.provider.svn.svnexe.command.changelog.SvnChangeLogCommandTest.testCommandLine(SvnChangeLogCommandTest.java:180)
	at org.apache.maven.scm.provider.svn.svnexe.command.changelog.SvnChangeLogCommandTest.testCommandLine(SvnChangeLogCommandTest.java:165)
	at org.apache.maven.scm.provider.svn.svnexe.command.changelog.SvnChangeLogCommandTest.testCommandLineWithBranchBothDates(SvnChangeLogCommandTest.java:126)


FAILED:  org.apache.maven.scm.provider.svn.svnexe.command.changelog.SvnChangeLogCommandTest.testCommandLineWithStartVersion

Error Message:
expected:<...://foo.com/svn/trunk[]"> but was:<...://foo.com/svn/trunk[@]">

Stack Trace:
junit.framework.ComparisonFailure: expected:<...://foo.com/svn/trunk[]"> but was:<...://foo.com/svn/trunk[@]">
	at org.apache.maven.scm.provider.svn.svnexe.command.changelog.SvnChangeLogCommandTest.testCommandLine(SvnChangeLogCommandTest.java:194)
	at org.apache.maven.scm.provider.svn.svnexe.command.changelog.SvnChangeLogCommandTest.testCommandLineWithStartVersion(SvnChangeLogCommandTest.java:133)


FAILED:  org.apache.maven.scm.provider.svn.svnexe.command.changelog.SvnChangeLogCommandTest.testCommandLineNoDates

Error Message:
expected:<...://foo.com/svn/trunk[]"> but was:<...://foo.com/svn/trunk[@]">

Stack Trace:
junit.framework.ComparisonFailure: expected:<...://foo.com/svn/trunk[]"> but was:<...://foo.com/svn/trunk[@]">
	at org.apache.maven.scm.provider.svn.svnexe.command.changelog.SvnChangeLogCommandTest.testCommandLine(SvnChangeLogCommandTest.java:180)
	at org.apache.maven.scm.provider.svn.svnexe.command.changelog.SvnChangeLogCommandTest.testCommandLine(SvnChangeLogCommandTest.java:165)
	at org.apache.maven.scm.provider.svn.svnexe.command.changelog.SvnChangeLogCommandTest.testCommandLineNoDates(SvnChangeLogCommandTest.java:44)


FAILED:  org.apache.maven.scm.provider.svn.svnexe.command.changelog.SvnChangeLogCommandTest.testCommandLineWithBranchEndDateOnly

Error Message:
expected:<...nches/my-test-branch[ http://foo.com/svn/trunk]"> but was:<...nches/my-test-branch[@ http://foo.com/svn/trunk@]">

Stack Trace:
junit.framework.ComparisonFailure: expected:<...nches/my-test-branch[ http://foo.com/svn/trunk]"> but was:<...nches/my-test-branch[@ http://foo.com/svn/trunk@]">
	at org.apache.maven.scm.provider.svn.svnexe.command.changelog.SvnChangeLogCommandTest.testCommandLine(SvnChangeLogCommandTest.java:180)
	at org.apache.maven.scm.provider.svn.svnexe.command.changelog.SvnChangeLogCommandTest.testCommandLine(SvnChangeLogCommandTest.java:165)
	at org.apache.maven.scm.provider.svn.svnexe.command.changelog.SvnChangeLogCommandTest.testCommandLineWithBranchEndDateOnly(SvnChangeLogCommandTest.java:116)


FAILED:  org.apache.maven.scm.provider.svn.svnexe.command.changelog.SvnChangeLogCommandTest.testCommandLineStartDateOnly

Error Message:
expected:<...://foo.com/svn/trunk[]"> but was:<...://foo.com/svn/trunk[@]">

Stack Trace:
junit.framework.ComparisonFailure: expected:<...://foo.com/svn/trunk[]"> but was:<...://foo.com/svn/trunk[@]">
	at org.apache.maven.scm.provider.svn.svnexe.command.changelog.SvnChangeLogCommandTest.testCommandLine(SvnChangeLogCommandTest.java:180)
	at org.apache.maven.scm.provider.svn.svnexe.command.changelog.SvnChangeLogCommandTest.testCommandLine(SvnChangeLogCommandTest.java:165)
	at org.apache.maven.scm.provider.svn.svnexe.command.changelog.SvnChangeLogCommandTest.testCommandLineStartDateOnly(SvnChangeLogCommandTest.java:70)


FAILED:  org.apache.maven.scm.provider.svn.svnexe.command.changelog.SvnChangeLogCommandTest.testCommandLineEndDateOnly

Error Message:
expected:<...://foo.com/svn/trunk[]"> but was:<...://foo.com/svn/trunk[@]">

Stack Trace:
junit.framework.ComparisonFailure: expected:<...://foo.com/svn/trunk[]"> but was:<...://foo.com/svn/trunk[@]">
	at org.apache.maven.scm.provider.svn.svnexe.command.changelog.SvnChangeLogCommandTest.testCommandLine(SvnChangeLogCommandTest.java:180)
	at org.apache.maven.scm.provider.svn.svnexe.command.changelog.SvnChangeLogCommandTest.testCommandLine(SvnChangeLogCommandTest.java:165)
	at org.apache.maven.scm.provider.svn.svnexe.command.changelog.SvnChangeLogCommandTest.testCommandLineEndDateOnly(SvnChangeLogCommandTest.java:90)


FAILED:  org.apache.maven.scm.provider.svn.svnexe.command.changelog.SvnChangeLogCommandTest.testCommandLineWithStartVersionAndEndVersion

Error Message:
expected:<...://foo.com/svn/trunk[]"> but was:<...://foo.com/svn/trunk[@]">

Stack Trace:
junit.framework.ComparisonFailure: expected:<...://foo.com/svn/trunk[]"> but was:<...://foo.com/svn/trunk[@]">
	at org.apache.maven.scm.provider.svn.svnexe.command.changelog.SvnChangeLogCommandTest.testCommandLine(SvnChangeLogCommandTest.java:194)
	at org.apache.maven.scm.provider.svn.svnexe.command.changelog.SvnChangeLogCommandTest.testCommandLineWithStartVersionAndEndVersion(SvnChangeLogCommandTest.java:140)


FAILED:  org.apache.maven.scm.provider.svn.svnexe.command.checkout.SvnCheckOutCommandTest.testRecursiveCheckOutCommandLine

Error Message:
expected:<...://foo.com/svn/trunk[] F:\jenkins\jenkins-...> but was:<...://foo.com/svn/trunk[@] F:\jenkins\jenkins-...>

Stack Trace:
junit.framework.ComparisonFailure: expected:<...://foo.com/svn/trunk[] F:\jenkins\jenkins-...> but was:<...://foo.com/svn/trunk[@] F:\jenkins\jenkins-...>
	at org.apache.maven.scm.provider.svn.svnexe.command.checkout.SvnCheckOutCommandTest.testCommandLine(SvnCheckOutCommandTest.java:113)
	at org.apache.maven.scm.provider.svn.svnexe.command.checkout.SvnCheckOutCommandTest.testRecursiveCheckOutCommandLine(SvnCheckOutCommandTest.java:92)


FAILED:  org.apache.maven.scm.provider.svn.svnexe.command.checkout.SvnCheckOutCommandTest.testCommandLineWithEmptyRevision

Error Message:
expected:<...://foo.com/svn/trunk[] F:\jenkins\jenkins-...> but was:<...://foo.com/svn/trunk[@] F:\jenkins\jenkins-...>

Stack Trace:
junit.framework.ComparisonFailure: expected:<...://foo.com/svn/trunk[] F:\jenkins\jenkins-...> but was:<...://foo.com/svn/trunk[@] F:\jenkins\jenkins-...>
	at org.apache.maven.scm.provider.svn.svnexe.command.checkout.SvnCheckOutCommandTest.testCommandLine(SvnCheckOutCommandTest.java:113)
	at org.apache.maven.scm.provider.svn.svnexe.command.checkout.SvnCheckOutCommandTest.testCommandLineWithEmptyRevision(SvnCheckOutCommandTest.java:75)


FAILED:  org.apache.maven.scm.provider.svn.svnexe.command.checkout.SvnCheckOutCommandTest.testCommandLineWithoutRevision

Error Message:
expected:<...://foo.com/svn/trunk[] F:\jenkins\jenkins-...> but was:<...://foo.com/svn/trunk[@] F:\jenkins\jenkins-...>

Stack Trace:
junit.framework.ComparisonFailure: expected:<...://foo.com/svn/trunk[] F:\jenkins\jenkins-...> but was:<...://foo.com/svn/trunk[@] F:\jenkins\jenkins-...>
	at org.apache.maven.scm.provider.svn.svnexe.command.checkout.SvnCheckOutCommandTest.testCommandLine(SvnCheckOutCommandTest.java:113)
	at org.apache.maven.scm.provider.svn.svnexe.command.checkout.SvnCheckOutCommandTest.testCommandLineWithoutRevision(SvnCheckOutCommandTest.java:67)


FAILED:  org.apache.maven.scm.provider.svn.svnexe.command.checkout.SvnCheckOutCommandTest.testCommandLineWithRevision

Error Message:
expected:<...://foo.com/svn/trunk[] F:\jenkins\jenkins-...> but was:<...://foo.com/svn/trunk[@] F:\jenkins\jenkins-...>

Stack Trace:
junit.framework.ComparisonFailure: expected:<...://foo.com/svn/trunk[] F:\jenkins\jenkins-...> but was:<...://foo.com/svn/trunk[@] F:\jenkins\jenkins-...>
	at org.apache.maven.scm.provider.svn.svnexe.command.checkout.SvnCheckOutCommandTest.testCommandLine(SvnCheckOutCommandTest.java:113)
	at org.apache.maven.scm.provider.svn.svnexe.command.checkout.SvnCheckOutCommandTest.testCommandLineWithRevision(SvnCheckOutCommandTest.java:83)


FAILED:  org.apache.maven.scm.provider.svn.svnexe.command.checkout.SvnCheckOutCommandTest.testRecursiveCheckOutCommandLine

Error Message:
expected:<...://foo.com/svn/trunk[]' '/home/jenkins/jen...> but was:<...://foo.com/svn/trunk[@]' '/home/jenkins/jen...>

Stack Trace:
junit.framework.ComparisonFailure: expected:<...://foo.com/svn/trunk[]' '/home/jenkins/jen...> but was:<...://foo.com/svn/trunk[@]' '/home/jenkins/jen...>
	at org.apache.maven.scm.provider.svn.svnexe.command.checkout.SvnCheckOutCommandTest.testCommandLine(SvnCheckOutCommandTest.java:113)
	at org.apache.maven.scm.provider.svn.svnexe.command.checkout.SvnCheckOutCommandTest.testRecursiveCheckOutCommandLine(SvnCheckOutCommandTest.java:92)


FAILED:  org.apache.maven.scm.provider.svn.svnexe.command.checkout.SvnCheckOutCommandTest.testCommandLineWithEmptyRevision

Error Message:
expected:<...://foo.com/svn/trunk[]' '/home/jenkins/jen...> but was:<...://foo.com/svn/trunk[@]' '/home/jenkins/jen...>

Stack Trace:
junit.framework.ComparisonFailure: expected:<...://foo.com/svn/trunk[]' '/home/jenkins/jen...> but was:<...://foo.com/svn/trunk[@]' '/home/jenkins/jen...>
	at org.apache.maven.scm.provider.svn.svnexe.command.checkout.SvnCheckOutCommandTest.testCommandLine(SvnCheckOutCommandTest.java:113)
	at org.apache.maven.scm.provider.svn.svnexe.command.checkout.SvnCheckOutCommandTest.testCommandLineWithEmptyRevision(SvnCheckOutCommandTest.java:75)


FAILED:  org.apache.maven.scm.provider.svn.svnexe.command.checkout.SvnCheckOutCommandTest.testCommandLineWithoutRevision

Error Message:
expected:<...://foo.com/svn/trunk[]' '/home/jenkins/jen...> but was:<...://foo.com/svn/trunk[@]' '/home/jenkins/jen...>

Stack Trace:
junit.framework.ComparisonFailure: expected:<...://foo.com/svn/trunk[]' '/home/jenkins/jen...> but was:<...://foo.com/svn/trunk[@]' '/home/jenkins/jen...>
	at org.apache.maven.scm.provider.svn.svnexe.command.checkout.SvnCheckOutCommandTest.testCommandLine(SvnCheckOutCommandTest.java:113)
	at org.apache.maven.scm.provider.svn.svnexe.command.checkout.SvnCheckOutCommandTest.testCommandLineWithoutRevision(SvnCheckOutCommandTest.java:67)


FAILED:  org.apache.maven.scm.provider.svn.svnexe.command.checkout.SvnCheckOutCommandTest.testCommandLineWithRevision

Error Message:
expected:<...://foo.com/svn/trunk[]' '/home/jenkins/jen...> but was:<...://foo.com/svn/trunk[@]' '/home/jenkins/jen...>

Stack Trace:
junit.framework.ComparisonFailure: expected:<...://foo.com/svn/trunk[]' '/home/jenkins/jen...> but was:<...://foo.com/svn/trunk[@]' '/home/jenkins/jen...>
	at org.apache.maven.scm.provider.svn.svnexe.command.checkout.SvnCheckOutCommandTest.testCommandLine(SvnCheckOutCommandTest.java:113)
	at org.apache.maven.scm.provider.svn.svnexe.command.checkout.SvnCheckOutCommandTest.testCommandLineWithRevision(SvnCheckOutCommandTest.java:83)


FAILED:  org.apache.maven.scm.provider.svn.svnexe.command.checkout.SvnCheckOutCommandTest.testRecursiveCheckOutCommandLine

Error Message:
expected:<...://foo.com/svn/trunk[]' '/home/jenkins/jen...> but was:<...://foo.com/svn/trunk[@]' '/home/jenkins/jen...>

Stack Trace:
junit.framework.ComparisonFailure: expected:<...://foo.com/svn/trunk[]' '/home/jenkins/jen...> but was:<...://foo.com/svn/trunk[@]' '/home/jenkins/jen...>
	at org.apache.maven.scm.provider.svn.svnexe.command.checkout.SvnCheckOutCommandTest.testCommandLine(SvnCheckOutCommandTest.java:113)
	at org.apache.maven.scm.provider.svn.svnexe.command.checkout.SvnCheckOutCommandTest.testRecursiveCheckOutCommandLine(SvnCheckOutCommandTest.java:92)


FAILED:  org.apache.maven.scm.provider.svn.svnexe.command.checkout.SvnCheckOutCommandTest.testCommandLineWithEmptyRevision

Error Message:
expected:<...://foo.com/svn/trunk[]' '/home/jenkins/jen...> but was:<...://foo.com/svn/trunk[@]' '/home/jenkins/jen...>

Stack Trace:
junit.framework.ComparisonFailure: expected:<...://foo.com/svn/trunk[]' '/home/jenkins/jen...> but was:<...://foo.com/svn/trunk[@]' '/home/jenkins/jen...>
	at org.apache.maven.scm.provider.svn.svnexe.command.checkout.SvnCheckOutCommandTest.testCommandLine(SvnCheckOutCommandTest.java:113)
	at org.apache.maven.scm.provider.svn.svnexe.command.checkout.SvnCheckOutCommandTest.testCommandLineWithEmptyRevision(SvnCheckOutCommandTest.java:75)


FAILED:  org.apache.maven.scm.provider.svn.svnexe.command.checkout.SvnCheckOutCommandTest.testCommandLineWithoutRevision

Error Message:
expected:<...://foo.com/svn/trunk[]' '/home/jenkins/jen...> but was:<...://foo.com/svn/trunk[@]' '/home/jenkins/jen...>

Stack Trace:
junit.framework.ComparisonFailure: expected:<...://foo.com/svn/trunk[]' '/home/jenkins/jen...> but was:<...://foo.com/svn/trunk[@]' '/home/jenkins/jen...>
	at org.apache.maven.scm.provider.svn.svnexe.command.checkout.SvnCheckOutCommandTest.testCommandLine(SvnCheckOutCommandTest.java:113)
	at org.apache.maven.scm.provider.svn.svnexe.command.checkout.SvnCheckOutCommandTest.testCommandLineWithoutRevision(SvnCheckOutCommandTest.java:67)


FAILED:  org.apache.maven.scm.provider.svn.svnexe.command.checkout.SvnCheckOutCommandTest.testCommandLineWithRevision

Error Message:
expected:<...://foo.com/svn/trunk[]' '/home/jenkins/jen...> but was:<...://foo.com/svn/trunk[@]' '/home/jenkins/jen...>

Stack Trace:
junit.framework.ComparisonFailure: expected:<...://foo.com/svn/trunk[]' '/home/jenkins/jen...> but was:<...://foo.com/svn/trunk[@]' '/home/jenkins/jen...>
	at org.apache.maven.scm.provider.svn.svnexe.command.checkout.SvnCheckOutCommandTest.testCommandLine(SvnCheckOutCommandTest.java:113)
	at org.apache.maven.scm.provider.svn.svnexe.command.checkout.SvnCheckOutCommandTest.testCommandLineWithRevision(SvnCheckOutCommandTest.java:83)


FAILED:  org.apache.maven.scm.provider.svn.svnexe.command.checkout.SvnCheckOutCommandTest.testRecursiveCheckOutCommandLine

Error Message:
expected:<...://foo.com/svn/trunk[]' '/home/jenkins/jen...> but was:<...://foo.com/svn/trunk[@]' '/home/jenkins/jen...>

Stack Trace:
junit.framework.ComparisonFailure: expected:<...://foo.com/svn/trunk[]' '/home/jenkins/jen...> but was:<...://foo.com/svn/trunk[@]' '/home/jenkins/jen...>
	at org.apache.maven.scm.provider.svn.svnexe.command.checkout.SvnCheckOutCommandTest.testCommandLine(SvnCheckOutCommandTest.java:113)
	at org.apache.maven.scm.provider.svn.svnexe.command.checkout.SvnCheckOutCommandTest.testRecursiveCheckOutCommandLine(SvnCheckOutCommandTest.java:92)


FAILED:  org.apache.maven.scm.provider.svn.svnexe.command.checkout.SvnCheckOutCommandTest.testCommandLineWithEmptyRevision

Error Message:
expected:<...://foo.com/svn/trunk[]' '/home/jenkins/jen...> but was:<...://foo.com/svn/trunk[@]' '/home/jenkins/jen...>

Stack Trace:
junit.framework.ComparisonFailure: expected:<...://foo.com/svn/trunk[]' '/home/jenkins/jen...> but was:<...://foo.com/svn/trunk[@]' '/home/jenkins/jen...>
	at org.apache.maven.scm.provider.svn.svnexe.command.checkout.SvnCheckOutCommandTest.testCommandLine(SvnCheckOutCommandTest.java:113)
	at org.apache.maven.scm.provider.svn.svnexe.command.checkout.SvnCheckOutCommandTest.testCommandLineWithEmptyRevision(SvnCheckOutCommandTest.java:75)


FAILED:  org.apache.maven.scm.provider.svn.svnexe.command.checkout.SvnCheckOutCommandTest.testCommandLineWithoutRevision

Error Message:
expected:<...://foo.com/svn/trunk[]' '/home/jenkins/jen...> but was:<...://foo.com/svn/trunk[@]' '/home/jenkins/jen...>

Stack Trace:
junit.framework.ComparisonFailure: expected:<...://foo.com/svn/trunk[]' '/home/jenkins/jen...> but was:<...://foo.com/svn/trunk[@]' '/home/jenkins/jen...>
	at org.apache.maven.scm.provider.svn.svnexe.command.checkout.SvnCheckOutCommandTest.testCommandLine(SvnCheckOutCommandTest.java:113)
	at org.apache.maven.scm.provider.svn.svnexe.command.checkout.SvnCheckOutCommandTest.testCommandLineWithoutRevision(SvnCheckOutCommandTest.java:67)


FAILED:  org.apache.maven.scm.provider.svn.svnexe.command.checkout.SvnCheckOutCommandTest.testCommandLineWithRevision

Error Message:
expected:<...://foo.com/svn/trunk[]' '/home/jenkins/jen...> but was:<...://foo.com/svn/trunk[@]' '/home/jenkins/jen...>

Stack Trace:
junit.framework.ComparisonFailure: expected:<...://foo.com/svn/trunk[]' '/home/jenkins/jen...> but was:<...://foo.com/svn/trunk[@]' '/home/jenkins/jen...>
	at org.apache.maven.scm.provider.svn.svnexe.command.checkout.SvnCheckOutCommandTest.testCommandLine(SvnCheckOutCommandTest.java:113)
	at org.apache.maven.scm.provider.svn.svnexe.command.checkout.SvnCheckOutCommandTest.testCommandLineWithRevision(SvnCheckOutCommandTest.java:83)


FAILED:  org.apache.maven.scm.provider.svn.svnexe.command.checkout.SvnCheckOutCommandTest.testRecursiveCheckOutCommandLine

Error Message:
expected:<...://foo.com/svn/trunk[] F:\jenkins\jenkins-...> but was:<...://foo.com/svn/trunk[@] F:\jenkins\jenkins-...>

Stack Trace:
junit.framework.ComparisonFailure: expected:<...://foo.com/svn/trunk[] F:\jenkins\jenkins-...> but was:<...://foo.com/svn/trunk[@] F:\jenkins\jenkins-...>
	at org.apache.maven.scm.provider.svn.svnexe.command.checkout.SvnCheckOutCommandTest.testCommandLine(SvnCheckOutCommandTest.java:113)
	at org.apache.maven.scm.provider.svn.svnexe.command.checkout.SvnCheckOutCommandTest.testRecursiveCheckOutCommandLine(SvnCheckOutCommandTest.java:92)


FAILED:  org.apache.maven.scm.provider.svn.svnexe.command.checkout.SvnCheckOutCommandTest.testCommandLineWithEmptyRevision

Error Message:
expected:<...://foo.com/svn/trunk[] F:\jenkins\jenkins-...> but was:<...://foo.com/svn/trunk[@] F:\jenkins\jenkins-...>

Stack Trace:
junit.framework.ComparisonFailure: expected:<...://foo.com/svn/trunk[] F:\jenkins\jenkins-...> but was:<...://foo.com/svn/trunk[@] F:\jenkins\jenkins-...>
	at org.apache.maven.scm.provider.svn.svnexe.command.checkout.SvnCheckOutCommandTest.testCommandLine(SvnCheckOutCommandTest.java:113)
	at org.apache.maven.scm.provider.svn.svnexe.command.checkout.SvnCheckOutCommandTest.testCommandLineWithEmptyRevision(SvnCheckOutCommandTest.java:75)


FAILED:  org.apache.maven.scm.provider.svn.svnexe.command.checkout.SvnCheckOutCommandTest.testCommandLineWithoutRevision

Error Message:
expected:<...://foo.com/svn/trunk[] F:\jenkins\jenkins-...> but was:<...://foo.com/svn/trunk[@] F:\jenkins\jenkins-...>

Stack Trace:
junit.framework.ComparisonFailure: expected:<...://foo.com/svn/trunk[] F:\jenkins\jenkins-...> but was:<...://foo.com/svn/trunk[@] F:\jenkins\jenkins-...>
	at org.apache.maven.scm.provider.svn.svnexe.command.checkout.SvnCheckOutCommandTest.testCommandLine(SvnCheckOutCommandTest.java:113)
	at org.apache.maven.scm.provider.svn.svnexe.command.checkout.SvnCheckOutCommandTest.testCommandLineWithoutRevision(SvnCheckOutCommandTest.java:67)


FAILED:  org.apache.maven.scm.provider.svn.svnexe.command.checkout.SvnCheckOutCommandTest.testCommandLineWithRevision

Error Message:
expected:<...://foo.com/svn/trunk[] F:\jenkins\jenkins-...> but was:<...://foo.com/svn/trunk[@] F:\jenkins\jenkins-...>

Stack Trace:
junit.framework.ComparisonFailure: expected:<...://foo.com/svn/trunk[] F:\jenkins\jenkins-...> but was:<...://foo.com/svn/trunk[@] F:\jenkins\jenkins-...>
	at org.apache.maven.scm.provider.svn.svnexe.command.checkout.SvnCheckOutCommandTest.testCommandLine(SvnCheckOutCommandTest.java:113)
	at org.apache.maven.scm.provider.svn.svnexe.command.checkout.SvnCheckOutCommandTest.testCommandLineWithRevision(SvnCheckOutCommandTest.java:83)


FAILED:  org.apache.maven.scm.provider.svn.svnexe.command.checkout.SvnCheckOutCommandTest.testRecursiveCheckOutCommandLine

Error Message:
expected:<...://foo.com/svn/trunk[]' '/home/jenkins/jen...> but was:<...://foo.com/svn/trunk[@]' '/home/jenkins/jen...>

Stack Trace:
junit.framework.ComparisonFailure: expected:<...://foo.com/svn/trunk[]' '/home/jenkins/jen...> but was:<...://foo.com/svn/trunk[@]' '/home/jenkins/jen...>
	at org.apache.maven.scm.provider.svn.svnexe.command.checkout.SvnCheckOutCommandTest.testCommandLine(SvnCheckOutCommandTest.java:113)
	at org.apache.maven.scm.provider.svn.svnexe.command.checkout.SvnCheckOutCommandTest.testRecursiveCheckOutCommandLine(SvnCheckOutCommandTest.java:92)


FAILED:  org.apache.maven.scm.provider.svn.svnexe.command.checkout.SvnCheckOutCommandTest.testCommandLineWithEmptyRevision

Error Message:
expected:<...://foo.com/svn/trunk[]' '/home/jenkins/jen...> but was:<...://foo.com/svn/trunk[@]' '/home/jenkins/jen...>

Stack Trace:
junit.framework.ComparisonFailure: expected:<...://foo.com/svn/trunk[]' '/home/jenkins/jen...> but was:<...://foo.com/svn/trunk[@]' '/home/jenkins/jen...>
	at org.apache.maven.scm.provider.svn.svnexe.command.checkout.SvnCheckOutCommandTest.testCommandLine(SvnCheckOutCommandTest.java:113)
	at org.apache.maven.scm.provider.svn.svnexe.command.checkout.SvnCheckOutCommandTest.testCommandLineWithEmptyRevision(SvnCheckOutCommandTest.java:75)


FAILED:  org.apache.maven.scm.provider.svn.svnexe.command.checkout.SvnCheckOutCommandTest.testCommandLineWithoutRevision

Error Message:
expected:<...://foo.com/svn/trunk[]' '/home/jenkins/jen...> but was:<...://foo.com/svn/trunk[@]' '/home/jenkins/jen...>

Stack Trace:
junit.framework.ComparisonFailure: expected:<...://foo.com/svn/trunk[]' '/home/jenkins/jen...> but was:<...://foo.com/svn/trunk[@]' '/home/jenkins/jen...>
	at org.apache.maven.scm.provider.svn.svnexe.command.checkout.SvnCheckOutCommandTest.testCommandLine(SvnCheckOutCommandTest.java:113)
	at org.apache.maven.scm.provider.svn.svnexe.command.checkout.SvnCheckOutCommandTest.testCommandLineWithoutRevision(SvnCheckOutCommandTest.java:67)


FAILED:  org.apache.maven.scm.provider.svn.svnexe.command.checkout.SvnCheckOutCommandTest.testCommandLineWithRevision

Error Message:
expected:<...://foo.com/svn/trunk[]' '/home/jenkins/jen...> but was:<...://foo.com/svn/trunk[@]' '/home/jenkins/jen...>

Stack Trace:
junit.framework.ComparisonFailure: expected:<...://foo.com/svn/trunk[]' '/home/jenkins/jen...> but was:<...://foo.com/svn/trunk[@]' '/home/jenkins/jen...>
	at org.apache.maven.scm.provider.svn.svnexe.command.checkout.SvnCheckOutCommandTest.testCommandLine(SvnCheckOutCommandTest.java:113)
	at org.apache.maven.scm.provider.svn.svnexe.command.checkout.SvnCheckOutCommandTest.testCommandLineWithRevision(SvnCheckOutCommandTest.java:83)


FAILED:  org.apache.maven.scm.provider.svn.svnexe.command.checkout.SvnCheckOutCommandTest.testRecursiveCheckOutCommandLine

Error Message:
expected:<...://foo.com/svn/trunk[] F:\jenkins\jenkins-...> but was:<...://foo.com/svn/trunk[@] F:\jenkins\jenkins-...>

Stack Trace:
junit.framework.ComparisonFailure: expected:<...://foo.com/svn/trunk[] F:\jenkins\jenkins-...> but was:<...://foo.com/svn/trunk[@] F:\jenkins\jenkins-...>
	at org.apache.maven.scm.provider.svn.svnexe.command.checkout.SvnCheckOutCommandTest.testCommandLine(SvnCheckOutCommandTest.java:113)
	at org.apache.maven.scm.provider.svn.svnexe.command.checkout.SvnCheckOutCommandTest.testRecursiveCheckOutCommandLine(SvnCheckOutCommandTest.java:92)


FAILED:  org.apache.maven.scm.provider.svn.svnexe.command.checkout.SvnCheckOutCommandTest.testCommandLineWithEmptyRevision

Error Message:
expected:<...://foo.com/svn/trunk[] F:\jenkins\jenkins-...> but was:<...://foo.com/svn/trunk[@] F:\jenkins\jenkins-...>

Stack Trace:
junit.framework.ComparisonFailure: expected:<...://foo.com/svn/trunk[] F:\jenkins\jenkins-...> but was:<...://foo.com/svn/trunk[@] F:\jenkins\jenkins-...>
	at org.apache.maven.scm.provider.svn.svnexe.command.checkout.SvnCheckOutCommandTest.testCommandLine(SvnCheckOutCommandTest.java:113)
	at org.apache.maven.scm.provider.svn.svnexe.command.checkout.SvnCheckOutCommandTest.testCommandLineWithEmptyRevision(SvnCheckOutCommandTest.java:75)


FAILED:  org.apache.maven.scm.provider.svn.svnexe.command.checkout.SvnCheckOutCommandTest.testCommandLineWithoutRevision

Error Message:
expected:<...://foo.com/svn/trunk[] F:\jenkins\jenkins-...> but was:<...://foo.com/svn/trunk[@] F:\jenkins\jenkins-...>

Stack Trace:
junit.framework.ComparisonFailure: expected:<...://foo.com/svn/trunk[] F:\jenkins\jenkins-...> but was:<...://foo.com/svn/trunk[@] F:\jenkins\jenkins-...>
	at org.apache.maven.scm.provider.svn.svnexe.command.checkout.SvnCheckOutCommandTest.testCommandLine(SvnCheckOutCommandTest.java:113)
	at org.apache.maven.scm.provider.svn.svnexe.command.checkout.SvnCheckOutCommandTest.testCommandLineWithoutRevision(SvnCheckOutCommandTest.java:67)


FAILED:  org.apache.maven.scm.provider.svn.svnexe.command.checkout.SvnCheckOutCommandTest.testCommandLineWithRevision

Error Message:
expected:<...://foo.com/svn/trunk[] F:\jenkins\jenkins-...> but was:<...://foo.com/svn/trunk[@] F:\jenkins\jenkins-...>

Stack Trace:
junit.framework.ComparisonFailure: expected:<...://foo.com/svn/trunk[] F:\jenkins\jenkins-...> but was:<...://foo.com/svn/trunk[@] F:\jenkins\jenkins-...>
	at org.apache.maven.scm.provider.svn.svnexe.command.checkout.SvnCheckOutCommandTest.testCommandLine(SvnCheckOutCommandTest.java:113)
	at org.apache.maven.scm.provider.svn.svnexe.command.checkout.SvnCheckOutCommandTest.testCommandLineWithRevision(SvnCheckOutCommandTest.java:83)


FAILED:  org.apache.maven.scm.provider.svn.svnexe.command.checkout.SvnCheckOutCommandTest.testRecursiveCheckOutCommandLine

Error Message:
expected:<...://foo.com/svn/trunk[] F:\jenkins\jenkins-...> but was:<...://foo.com/svn/trunk[@] F:\jenkins\jenkins-...>

Stack Trace:
junit.framework.ComparisonFailure: expected:<...://foo.com/svn/trunk[] F:\jenkins\jenkins-...> but was:<...://foo.com/svn/trunk[@] F:\jenkins\jenkins-...>
	at org.apache.maven.scm.provider.svn.svnexe.command.checkout.SvnCheckOutCommandTest.testCommandLine(SvnCheckOutCommandTest.java:113)
	at org.apache.maven.scm.provider.svn.svnexe.command.checkout.SvnCheckOutCommandTest.testRecursiveCheckOutCommandLine(SvnCheckOutCommandTest.java:92)


FAILED:  org.apache.maven.scm.provider.svn.svnexe.command.checkout.SvnCheckOutCommandTest.testCommandLineWithEmptyRevision

Error Message:
expected:<...://foo.com/svn/trunk[] F:\jenkins\jenkins-...> but was:<...://foo.com/svn/trunk[@] F:\jenkins\jenkins-...>

Stack Trace:
junit.framework.ComparisonFailure: expected:<...://foo.com/svn/trunk[] F:\jenkins\jenkins-...> but was:<...://foo.com/svn/trunk[@] F:\jenkins\jenkins-...>
	at org.apache.maven.scm.provider.svn.svnexe.command.checkout.SvnCheckOutCommandTest.testCommandLine(SvnCheckOutCommandTest.java:113)
	at org.apache.maven.scm.provider.svn.svnexe.command.checkout.SvnCheckOutCommandTest.testCommandLineWithEmptyRevision(SvnCheckOutCommandTest.java:75)


FAILED:  org.apache.maven.scm.provider.svn.svnexe.command.checkout.SvnCheckOutCommandTest.testCommandLineWithoutRevision

Error Message:
expected:<...://foo.com/svn/trunk[] F:\jenkins\jenkins-...> but was:<...://foo.com/svn/trunk[@] F:\jenkins\jenkins-...>

Stack Trace:
junit.framework.ComparisonFailure: expected:<...://foo.com/svn/trunk[] F:\jenkins\jenkins-...> but was:<...://foo.com/svn/trunk[@] F:\jenkins\jenkins-...>
	at org.apache.maven.scm.provider.svn.svnexe.command.checkout.SvnCheckOutCommandTest.testCommandLine(SvnCheckOutCommandTest.java:113)
	at org.apache.maven.scm.provider.svn.svnexe.command.checkout.SvnCheckOutCommandTest.testCommandLineWithoutRevision(SvnCheckOutCommandTest.java:67)


FAILED:  org.apache.maven.scm.provider.svn.svnexe.command.checkout.SvnCheckOutCommandTest.testCommandLineWithRevision

Error Message:
expected:<...://foo.com/svn/trunk[] F:\jenkins\jenkins-...> but was:<...://foo.com/svn/trunk[@] F:\jenkins\jenkins-...>

Stack Trace:
junit.framework.ComparisonFailure: expected:<...://foo.com/svn/trunk[] F:\jenkins\jenkins-...> but was:<...://foo.com/svn/trunk[@] F:\jenkins\jenkins-...>
	at org.apache.maven.scm.provider.svn.svnexe.command.checkout.SvnCheckOutCommandTest.testCommandLine(SvnCheckOutCommandTest.java:113)
	at org.apache.maven.scm.provider.svn.svnexe.command.checkout.SvnCheckOutCommandTest.testCommandLineWithRevision(SvnCheckOutCommandTest.java:83)


FAILED:  org.apache.maven.scm.provider.svn.svnexe.command.export.SvnExportCommandTest.testGetExportCommandLineWithImplicitExportDirectory

Error Message:
expected:<...://foo.com/svn/trunk[]"> but was:<...://foo.com/svn/trunk[@]">

Stack Trace:
junit.framework.ComparisonFailure: expected:<...://foo.com/svn/trunk[]"> but was:<...://foo.com/svn/trunk[@]">
	at org.apache.maven.scm.provider.svn.svnexe.command.export.SvnExportCommandTest.testCommandLine(SvnExportCommandTest.java:61)
	at org.apache.maven.scm.provider.svn.svnexe.command.export.SvnExportCommandTest.testGetExportCommandLineWithImplicitExportDirectory(SvnExportCommandTest.java:38)


FAILED:  org.apache.maven.scm.provider.svn.svnexe.command.export.SvnExportCommandTest.testGetExportCommandLineWithExplicitExportDirectory

Error Message:
expected:<...://foo.com/svn/trunk[] F:\jenkins\jenkins-...> but was:<...://foo.com/svn/trunk[@] F:\jenkins\jenkins-...>

Stack Trace:
junit.framework.ComparisonFailure: expected:<...://foo.com/svn/trunk[] F:\jenkins\jenkins-...> but was:<...://foo.com/svn/trunk[@] F:\jenkins\jenkins-...>
	at org.apache.maven.scm.provider.svn.svnexe.command.export.SvnExportCommandTest.testCommandLine(SvnExportCommandTest.java:61)
	at org.apache.maven.scm.provider.svn.svnexe.command.export.SvnExportCommandTest.testGetExportCommandLineWithExplicitExportDirectory(SvnExportCommandTest.java:47)


FAILED:  org.apache.maven.scm.provider.svn.svnexe.command.export.SvnExportCommandTest.testGetExportCommandLineWithImplicitExportDirectory

Error Message:
expected:<...://foo.com/svn/trunk[]'> but was:<...://foo.com/svn/trunk[@]'>

Stack Trace:
junit.framework.ComparisonFailure: expected:<...://foo.com/svn/trunk[]'> but was:<...://foo.com/svn/trunk[@]'>
	at org.apache.maven.scm.provider.svn.svnexe.command.export.SvnExportCommandTest.testCommandLine(SvnExportCommandTest.java:61)
	at org.apache.maven.scm.provider.svn.svnexe.command.export.SvnExportCommandTest.testGetExportCommandLineWithImplicitExportDirectory(SvnExportCommandTest.java:38)


FAILED:  org.apache.maven.scm.provider.svn.svnexe.command.export.SvnExportCommandTest.testGetExportCommandLineWithExplicitExportDirectory

Error Message:
expected:<...://foo.com/svn/trunk[]' '/home/jenkins/jen...> but was:<...://foo.com/svn/trunk[@]' '/home/jenkins/jen...>

Stack Trace:
junit.framework.ComparisonFailure: expected:<...://foo.com/svn/trunk[]' '/home/jenkins/jen...> but was:<...://foo.com/svn/trunk[@]' '/home/jenkins/jen...>
	at org.apache.maven.scm.provider.svn.svnexe.command.export.SvnExportCommandTest.testCommandLine(SvnExportCommandTest.java:61)
	at org.apache.maven.scm.provider.svn.svnexe.command.export.SvnExportCommandTest.testGetExportCommandLineWithExplicitExportDirectory(SvnExportCommandTest.java:47)


FAILED:  org.apache.maven.scm.provider.svn.svnexe.command.export.SvnExportCommandTest.testGetExportCommandLineWithImplicitExportDirectory

Error Message:
expected:<...://foo.com/svn/trunk[]'> but was:<...://foo.com/svn/trunk[@]'>

Stack Trace:
junit.framework.ComparisonFailure: expected:<...://foo.com/svn/trunk[]'> but was:<...://foo.com/svn/trunk[@]'>
	at org.apache.maven.scm.provider.svn.svnexe.command.export.SvnExportCommandTest.testCommandLine(SvnExportCommandTest.java:61)
	at org.apache.maven.scm.provider.svn.svnexe.command.export.SvnExportCommandTest.testGetExportCommandLineWithImplicitExportDirectory(SvnExportCommandTest.java:38)


FAILED:  org.apache.maven.scm.provider.svn.svnexe.command.export.SvnExportCommandTest.testGetExportCommandLineWithExplicitExportDirectory

Error Message:
expected:<...://foo.com/svn/trunk[]' '/home/jenkins/jen...> but was:<...://foo.com/svn/trunk[@]' '/home/jenkins/jen...>

Stack Trace:
junit.framework.ComparisonFailure: expected:<...://foo.com/svn/trunk[]' '/home/jenkins/jen...> but was:<...://foo.com/svn/trunk[@]' '/home/jenkins/jen...>
	at org.apache.maven.scm.provider.svn.svnexe.command.export.SvnExportCommandTest.testCommandLine(SvnExportCommandTest.java:61)
	at org.apache.maven.scm.provider.svn.svnexe.command.export.SvnExportCommandTest.testGetExportCommandLineWithExplicitExportDirectory(SvnExportCommandTest.java:47)


FAILED:  org.apache.maven.scm.provider.svn.svnexe.command.export.SvnExportCommandTest.testGetExportCommandLineWithImplicitExportDirectory

Error Message:
expected:<...://foo.com/svn/trunk[]'> but was:<...://foo.com/svn/trunk[@]'>

Stack Trace:
junit.framework.ComparisonFailure: expected:<...://foo.com/svn/trunk[]'> but was:<...://foo.com/svn/trunk[@]'>
	at org.apache.maven.scm.provider.svn.svnexe.command.export.SvnExportCommandTest.testCommandLine(SvnExportCommandTest.java:61)
	at org.apache.maven.scm.provider.svn.svnexe.command.export.SvnExportCommandTest.testGetExportCommandLineWithImplicitExportDirectory(SvnExportCommandTest.java:38)


FAILED:  org.apache.maven.scm.provider.svn.svnexe.command.export.SvnExportCommandTest.testGetExportCommandLineWithExplicitExportDirectory

Error Message:
expected:<...://foo.com/svn/trunk[]' '/home/jenkins/jen...> but was:<...://foo.com/svn/trunk[@]' '/home/jenkins/jen...>

Stack Trace:
junit.framework.ComparisonFailure: expected:<...://foo.com/svn/trunk[]' '/home/jenkins/jen...> but was:<...://foo.com/svn/trunk[@]' '/home/jenkins/jen...>
	at org.apache.maven.scm.provider.svn.svnexe.command.export.SvnExportCommandTest.testCommandLine(SvnExportCommandTest.java:61)
	at org.apache.maven.scm.provider.svn.svnexe.command.export.SvnExportCommandTest.testGetExportCommandLineWithExplicitExportDirectory(SvnExportCommandTest.java:47)


FAILED:  org.apache.maven.scm.provider.svn.svnexe.command.export.SvnExportCommandTest.testGetExportCommandLineWithImplicitExportDirectory

Error Message:
expected:<...://foo.com/svn/trunk[]"> but was:<...://foo.com/svn/trunk[@]">

Stack Trace:
junit.framework.ComparisonFailure: expected:<...://foo.com/svn/trunk[]"> but was:<...://foo.com/svn/trunk[@]">
	at org.apache.maven.scm.provider.svn.svnexe.command.export.SvnExportCommandTest.testCommandLine(SvnExportCommandTest.java:61)
	at org.apache.maven.scm.provider.svn.svnexe.command.export.SvnExportCommandTest.testGetExportCommandLineWithImplicitExportDirectory(SvnExportCommandTest.java:38)


FAILED:  org.apache.maven.scm.provider.svn.svnexe.command.export.SvnExportCommandTest.testGetExportCommandLineWithExplicitExportDirectory

Error Message:
expected:<...://foo.com/svn/trunk[] F:\jenkins\jenkins-...> but was:<...://foo.com/svn/trunk[@] F:\jenkins\jenkins-...>

Stack Trace:
junit.framework.ComparisonFailure: expected:<...://foo.com/svn/trunk[] F:\jenkins\jenkins-...> but was:<...://foo.com/svn/trunk[@] F:\jenkins\jenkins-...>
	at org.apache.maven.scm.provider.svn.svnexe.command.export.SvnExportCommandTest.testCommandLine(SvnExportCommandTest.java:61)
	at org.apache.maven.scm.provider.svn.svnexe.command.export.SvnExportCommandTest.testGetExportCommandLineWithExplicitExportDirectory(SvnExportCommandTest.java:47)


FAILED:  org.apache.maven.scm.provider.svn.svnexe.command.export.SvnExportCommandTest.testGetExportCommandLineWithImplicitExportDirectory

Error Message:
expected:<...://foo.com/svn/trunk[]'> but was:<...://foo.com/svn/trunk[@]'>

Stack Trace:
junit.framework.ComparisonFailure: expected:<...://foo.com/svn/trunk[]'> but was:<...://foo.com/svn/trunk[@]'>
	at org.apache.maven.scm.provider.svn.svnexe.command.export.SvnExportCommandTest.testCommandLine(SvnExportCommandTest.java:61)
	at org.apache.maven.scm.provider.svn.svnexe.command.export.SvnExportCommandTest.testGetExportCommandLineWithImplicitExportDirectory(SvnExportCommandTest.java:38)


FAILED:  org.apache.maven.scm.provider.svn.svnexe.command.export.SvnExportCommandTest.testGetExportCommandLineWithExplicitExportDirectory

Error Message:
expected:<...://foo.com/svn/trunk[]' '/home/jenkins/jen...> but was:<...://foo.com/svn/trunk[@]' '/home/jenkins/jen...>

Stack Trace:
junit.framework.ComparisonFailure: expected:<...://foo.com/svn/trunk[]' '/home/jenkins/jen...> but was:<...://foo.com/svn/trunk[@]' '/home/jenkins/jen...>
	at org.apache.maven.scm.provider.svn.svnexe.command.export.SvnExportCommandTest.testCommandLine(SvnExportCommandTest.java:61)
	at org.apache.maven.scm.provider.svn.svnexe.command.export.SvnExportCommandTest.testGetExportCommandLineWithExplicitExportDirectory(SvnExportCommandTest.java:47)


FAILED:  org.apache.maven.scm.provider.svn.svnexe.command.export.SvnExportCommandTest.testGetExportCommandLineWithImplicitExportDirectory

Error Message:
expected:<...://foo.com/svn/trunk[]"> but was:<...://foo.com/svn/trunk[@]">

Stack Trace:
junit.framework.ComparisonFailure: expected:<...://foo.com/svn/trunk[]"> but was:<...://foo.com/svn/trunk[@]">
	at org.apache.maven.scm.provider.svn.svnexe.command.export.SvnExportCommandTest.testCommandLine(SvnExportCommandTest.java:61)
	at org.apache.maven.scm.provider.svn.svnexe.command.export.SvnExportCommandTest.testGetExportCommandLineWithImplicitExportDirectory(SvnExportCommandTest.java:38)


FAILED:  org.apache.maven.scm.provider.svn.svnexe.command.export.SvnExportCommandTest.testGetExportCommandLineWithExplicitExportDirectory

Error Message:
expected:<...://foo.com/svn/trunk[] F:\jenkins\jenkins-...> but was:<...://foo.com/svn/trunk[@] F:\jenkins\jenkins-...>

Stack Trace:
junit.framework.ComparisonFailure: expected:<...://foo.com/svn/trunk[] F:\jenkins\jenkins-...> but was:<...://foo.com/svn/trunk[@] F:\jenkins\jenkins-...>
	at org.apache.maven.scm.provider.svn.svnexe.command.export.SvnExportCommandTest.testCommandLine(SvnExportCommandTest.java:61)
	at org.apache.maven.scm.provider.svn.svnexe.command.export.SvnExportCommandTest.testGetExportCommandLineWithExplicitExportDirectory(SvnExportCommandTest.java:47)


FAILED:  org.apache.maven.scm.provider.svn.svnexe.command.export.SvnExportCommandTest.testGetExportCommandLineWithImplicitExportDirectory

Error Message:
expected:<...://foo.com/svn/trunk[]"> but was:<...://foo.com/svn/trunk[@]">

Stack Trace:
junit.framework.ComparisonFailure: expected:<...://foo.com/svn/trunk[]"> but was:<...://foo.com/svn/trunk[@]">
	at org.apache.maven.scm.provider.svn.svnexe.command.export.SvnExportCommandTest.testCommandLine(SvnExportCommandTest.java:61)
	at org.apache.maven.scm.provider.svn.svnexe.command.export.SvnExportCommandTest.testGetExportCommandLineWithImplicitExportDirectory(SvnExportCommandTest.java:38)


FAILED:  org.apache.maven.scm.provider.svn.svnexe.command.export.SvnExportCommandTest.testGetExportCommandLineWithExplicitExportDirectory

Error Message:
expected:<...://foo.com/svn/trunk[] F:\jenkins\jenkins-...> but was:<...://foo.com/svn/trunk[@] F:\jenkins\jenkins-...>

Stack Trace:
junit.framework.ComparisonFailure: expected:<...://foo.com/svn/trunk[] F:\jenkins\jenkins-...> but was:<...://foo.com/svn/trunk[@] F:\jenkins\jenkins-...>
	at org.apache.maven.scm.provider.svn.svnexe.command.export.SvnExportCommandTest.testCommandLine(SvnExportCommandTest.java:61)
	at org.apache.maven.scm.provider.svn.svnexe.command.export.SvnExportCommandTest.testGetExportCommandLineWithExplicitExportDirectory(SvnExportCommandTest.java:47)


FAILED:  org.apache.maven.scm.provider.svn.svnexe.command.list.SvnListCommandTest.testCommandLineWithUsernameAndTag

Error Message:
expected:<.../foo.com/svn/trunk/.[]"> but was:<.../foo.com/svn/trunk/.[@]">

Stack Trace:
junit.framework.ComparisonFailure: expected:<.../foo.com/svn/trunk/.[]"> but was:<.../foo.com/svn/trunk/.[@]">
	at org.apache.maven.scm.provider.svn.svnexe.command.list.SvnListCommandTest.testCommandLine(SvnListCommandTest.java:96)
	at org.apache.maven.scm.provider.svn.svnexe.command.list.SvnListCommandTest.testCommandLineWithUsernameAndTag(SvnListCommandTest.java:66)


FAILED:  org.apache.maven.scm.provider.svn.svnexe.command.list.SvnListCommandTest.testCommandLineWithEmptyTag

Error Message:
expected:<.../foo.com/svn/trunk/.[]"> but was:<.../foo.com/svn/trunk/.[@]">

Stack Trace:
junit.framework.ComparisonFailure: expected:<.../foo.com/svn/trunk/.[]"> but was:<.../foo.com/svn/trunk/.[@]">
	at org.apache.maven.scm.provider.svn.svnexe.command.list.SvnListCommandTest.testCommandLine(SvnListCommandTest.java:96)
	at org.apache.maven.scm.provider.svn.svnexe.command.list.SvnListCommandTest.testCommandLine(SvnListCommandTest.java:85)
	at org.apache.maven.scm.provider.svn.svnexe.command.list.SvnListCommandTest.testCommandLineWithEmptyTag(SvnListCommandTest.java:41)


FAILED:  org.apache.maven.scm.provider.svn.svnexe.command.list.SvnListCommandTest.testCommandLineWithWhitespaceTag

Error Message:
expected:<.../foo.com/svn/trunk/.[]"> but was:<.../foo.com/svn/trunk/.[@]">

Stack Trace:
junit.framework.ComparisonFailure: expected:<.../foo.com/svn/trunk/.[]"> but was:<.../foo.com/svn/trunk/.[@]">
	at org.apache.maven.scm.provider.svn.svnexe.command.list.SvnListCommandTest.testCommandLine(SvnListCommandTest.java:96)
	at org.apache.maven.scm.provider.svn.svnexe.command.list.SvnListCommandTest.testCommandLine(SvnListCommandTest.java:85)
	at org.apache.maven.scm.provider.svn.svnexe.command.list.SvnListCommandTest.testCommandLineWithWhitespaceTag(SvnListCommandTest.java:47)


FAILED:  org.apache.maven.scm.provider.svn.svnexe.command.list.SvnListCommandTest.testCommandLineWithoutTag

Error Message:
expected:<.../foo.com/svn/trunk/.[]"> but was:<.../foo.com/svn/trunk/.[@]">

Stack Trace:
junit.framework.ComparisonFailure: expected:<.../foo.com/svn/trunk/.[]"> but was:<.../foo.com/svn/trunk/.[@]">
	at org.apache.maven.scm.provider.svn.svnexe.command.list.SvnListCommandTest.testCommandLine(SvnListCommandTest.java:96)
	at org.apache.maven.scm.provider.svn.svnexe.command.list.SvnListCommandTest.testCommandLine(SvnListCommandTest.java:85)
	at org.apache.maven.scm.provider.svn.svnexe.command.list.SvnListCommandTest.testCommandLineWithoutTag(SvnListCommandTest.java:53)


FAILED:  org.apache.maven.scm.provider.svn.svnexe.command.list.SvnListCommandTest.testCommandLineTag

Error Message:
expected:<.../foo.com/svn/trunk/.[]"> but was:<.../foo.com/svn/trunk/.[@]">

Stack Trace:
junit.framework.ComparisonFailure: expected:<.../foo.com/svn/trunk/.[]"> but was:<.../foo.com/svn/trunk/.[@]">
	at org.apache.maven.scm.provider.svn.svnexe.command.list.SvnListCommandTest.testCommandLine(SvnListCommandTest.java:96)
	at org.apache.maven.scm.provider.svn.svnexe.command.list.SvnListCommandTest.testCommandLineTag(SvnListCommandTest.java:59)


FAILED:  org.apache.maven.scm.provider.svn.svnexe.command.list.SvnListCommandTest.testCommandLineWithUsernameAndTag

Error Message:
expected:<.../foo.com/svn/trunk/.[]'> but was:<.../foo.com/svn/trunk/.[@]'>

Stack Trace:
junit.framework.ComparisonFailure: expected:<.../foo.com/svn/trunk/.[]'> but was:<.../foo.com/svn/trunk/.[@]'>
	at org.apache.maven.scm.provider.svn.svnexe.command.list.SvnListCommandTest.testCommandLine(SvnListCommandTest.java:96)
	at org.apache.maven.scm.provider.svn.svnexe.command.list.SvnListCommandTest.testCommandLineWithUsernameAndTag(SvnListCommandTest.java:66)


FAILED:  org.apache.maven.scm.provider.svn.svnexe.command.list.SvnListCommandTest.testCommandLineWithEmptyTag

Error Message:
expected:<.../foo.com/svn/trunk/.[]'> but was:<.../foo.com/svn/trunk/.[@]'>

Stack Trace:
junit.framework.ComparisonFailure: expected:<.../foo.com/svn/trunk/.[]'> but was:<.../foo.com/svn/trunk/.[@]'>
	at org.apache.maven.scm.provider.svn.svnexe.command.list.SvnListCommandTest.testCommandLine(SvnListCommandTest.java:96)
	at org.apache.maven.scm.provider.svn.svnexe.command.list.SvnListCommandTest.testCommandLine(SvnListCommandTest.java:85)
	at org.apache.maven.scm.provider.svn.svnexe.command.list.SvnListCommandTest.testCommandLineWithEmptyTag(SvnListCommandTest.java:41)


FAILED:  org.apache.maven.scm.provider.svn.svnexe.command.list.SvnListCommandTest.testCommandLineWithWhitespaceTag

Error Message:
expected:<.../foo.com/svn/trunk/.[]'> but was:<.../foo.com/svn/trunk/.[@]'>

Stack Trace:
junit.framework.ComparisonFailure: expected:<.../foo.com/svn/trunk/.[]'> but was:<.../foo.com/svn/trunk/.[@]'>
	at org.apache.maven.scm.provider.svn.svnexe.command.list.SvnListCommandTest.testCommandLine(SvnListCommandTest.java:96)
	at org.apache.maven.scm.provider.svn.svnexe.command.list.SvnListCommandTest.testCommandLine(SvnListCommandTest.java:85)
	at org.apache.maven.scm.provider.svn.svnexe.command.list.SvnListCommandTest.testCommandLineWithWhitespaceTag(SvnListCommandTest.java:47)


FAILED:  org.apache.maven.scm.provider.svn.svnexe.command.list.SvnListCommandTest.testCommandLineWithoutTag

Error Message:
expected:<.../foo.com/svn/trunk/.[]'> but was:<.../foo.com/svn/trunk/.[@]'>

Stack Trace:
junit.framework.ComparisonFailure: expected:<.../foo.com/svn/trunk/.[]'> but was:<.../foo.com/svn/trunk/.[@]'>
	at org.apache.maven.scm.provider.svn.svnexe.command.list.SvnListCommandTest.testCommandLine(SvnListCommandTest.java:96)
	at org.apache.maven.scm.provider.svn.svnexe.command.list.SvnListCommandTest.testCommandLine(SvnListCommandTest.java:85)
	at org.apache.maven.scm.provider.svn.svnexe.command.list.SvnListCommandTest.testCommandLineWithoutTag(SvnListCommandTest.java:53)


FAILED:  org.apache.maven.scm.provider.svn.svnexe.command.list.SvnListCommandTest.testCommandLineTag

Error Message:
expected:<.../foo.com/svn/trunk/.[]'> but was:<.../foo.com/svn/trunk/.[@]'>

Stack Trace:
junit.framework.ComparisonFailure: expected:<.../foo.com/svn/trunk/.[]'> but was:<.../foo.com/svn/trunk/.[@]'>
	at org.apache.maven.scm.provider.svn.svnexe.command.list.SvnListCommandTest.testCommandLine(SvnListCommandTest.java:96)
	at org.apache.maven.scm.provider.svn.svnexe.command.list.SvnListCommandTest.testCommandLineTag(SvnListCommandTest.java:59)


FAILED:  org.apache.maven.scm.provider.svn.svnexe.command.list.SvnListCommandTest.testCommandLineWithUsernameAndTag

Error Message:
expected:<.../foo.com/svn/trunk/.[]'> but was:<.../foo.com/svn/trunk/.[@]'>

Stack Trace:
junit.framework.ComparisonFailure: expected:<.../foo.com/svn/trunk/.[]'> but was:<.../foo.com/svn/trunk/.[@]'>
	at org.apache.maven.scm.provider.svn.svnexe.command.list.SvnListCommandTest.testCommandLine(SvnListCommandTest.java:96)
	at org.apache.maven.scm.provider.svn.svnexe.command.list.SvnListCommandTest.testCommandLineWithUsernameAndTag(SvnListCommandTest.java:66)


FAILED:  org.apache.maven.scm.provider.svn.svnexe.command.list.SvnListCommandTest.testCommandLineWithEmptyTag

Error Message:
expected:<.../foo.com/svn/trunk/.[]'> but was:<.../foo.com/svn/trunk/.[@]'>

Stack Trace:
junit.framework.ComparisonFailure: expected:<.../foo.com/svn/trunk/.[]'> but was:<.../foo.com/svn/trunk/.[@]'>
	at org.apache.maven.scm.provider.svn.svnexe.command.list.SvnListCommandTest.testCommandLine(SvnListCommandTest.java:96)
	at org.apache.maven.scm.provider.svn.svnexe.command.list.SvnListCommandTest.testCommandLine(SvnListCommandTest.java:85)
	at org.apache.maven.scm.provider.svn.svnexe.command.list.SvnListCommandTest.testCommandLineWithEmptyTag(SvnListCommandTest.java:41)


FAILED:  org.apache.maven.scm.provider.svn.svnexe.command.list.SvnListCommandTest.testCommandLineWithWhitespaceTag

Error Message:
expected:<.../foo.com/svn/trunk/.[]'> but was:<.../foo.com/svn/trunk/.[@]'>

Stack Trace:
junit.framework.ComparisonFailure: expected:<.../foo.com/svn/trunk/.[]'> but was:<.../foo.com/svn/trunk/.[@]'>
	at org.apache.maven.scm.provider.svn.svnexe.command.list.SvnListCommandTest.testCommandLine(SvnListCommandTest.java:96)
	at org.apache.maven.scm.provider.svn.svnexe.command.list.SvnListCommandTest.testCommandLine(SvnListCommandTest.java:85)
	at org.apache.maven.scm.provider.svn.svnexe.command.list.SvnListCommandTest.testCommandLineWithWhitespaceTag(SvnListCommandTest.java:47)


FAILED:  org.apache.maven.scm.provider.svn.svnexe.command.list.SvnListCommandTest.testCommandLineWithoutTag

Error Message:
expected:<.../foo.com/svn/trunk/.[]'> but was:<.../foo.com/svn/trunk/.[@]'>

Stack Trace:
junit.framework.ComparisonFailure: expected:<.../foo.com/svn/trunk/.[]'> but was:<.../foo.com/svn/trunk/.[@]'>
	at org.apache.maven.scm.provider.svn.svnexe.command.list.SvnListCommandTest.testCommandLine(SvnListCommandTest.java:96)
	at org.apache.maven.scm.provider.svn.svnexe.command.list.SvnListCommandTest.testCommandLine(SvnListCommandTest.java:85)
	at org.apache.maven.scm.provider.svn.svnexe.command.list.SvnListCommandTest.testCommandLineWithoutTag(SvnListCommandTest.java:53)


FAILED:  org.apache.maven.scm.provider.svn.svnexe.command.list.SvnListCommandTest.testCommandLineTag

Error Message:
expected:<.../foo.com/svn/trunk/.[]'> but was:<.../foo.com/svn/trunk/.[@]'>

Stack Trace:
junit.framework.ComparisonFailure: expected:<.../foo.com/svn/trunk/.[]'> but was:<.../foo.com/svn/trunk/.[@]'>
	at org.apache.maven.scm.provider.svn.svnexe.command.list.SvnListCommandTest.testCommandLine(SvnListCommandTest.java:96)
	at org.apache.maven.scm.provider.svn.svnexe.command.list.SvnListCommandTest.testCommandLineTag(SvnListCommandTest.java:59)


FAILED:  org.apache.maven.scm.provider.svn.svnexe.command.list.SvnListCommandTest.testCommandLineWithUsernameAndTag

Error Message:
expected:<.../foo.com/svn/trunk/.[]'> but was:<.../foo.com/svn/trunk/.[@]'>

Stack Trace:
junit.framework.ComparisonFailure: expected:<.../foo.com/svn/trunk/.[]'> but was:<.../foo.com/svn/trunk/.[@]'>
	at org.apache.maven.scm.provider.svn.svnexe.command.list.SvnListCommandTest.testCommandLine(SvnListCommandTest.java:96)
	at org.apache.maven.scm.provider.svn.svnexe.command.list.SvnListCommandTest.testCommandLineWithUsernameAndTag(SvnListCommandTest.java:66)


FAILED:  org.apache.maven.scm.provider.svn.svnexe.command.list.SvnListCommandTest.testCommandLineWithEmptyTag

Error Message:
expected:<.../foo.com/svn/trunk/.[]'> but was:<.../foo.com/svn/trunk/.[@]'>

Stack Trace:
junit.framework.ComparisonFailure: expected:<.../foo.com/svn/trunk/.[]'> but was:<.../foo.com/svn/trunk/.[@]'>
	at org.apache.maven.scm.provider.svn.svnexe.command.list.SvnListCommandTest.testCommandLine(SvnListCommandTest.java:96)
	at org.apache.maven.scm.provider.svn.svnexe.command.list.SvnListCommandTest.testCommandLine(SvnListCommandTest.java:85)
	at org.apache.maven.scm.provider.svn.svnexe.command.list.SvnListCommandTest.testCommandLineWithEmptyTag(SvnListCommandTest.java:41)


FAILED:  org.apache.maven.scm.provider.svn.svnexe.command.list.SvnListCommandTest.testCommandLineWithWhitespaceTag

Error Message:
expected:<.../foo.com/svn/trunk/.[]'> but was:<.../foo.com/svn/trunk/.[@]'>

Stack Trace:
junit.framework.ComparisonFailure: expected:<.../foo.com/svn/trunk/.[]'> but was:<.../foo.com/svn/trunk/.[@]'>
	at org.apache.maven.scm.provider.svn.svnexe.command.list.SvnListCommandTest.testCommandLine(SvnListCommandTest.java:96)
	at org.apache.maven.scm.provider.svn.svnexe.command.list.SvnListCommandTest.testCommandLine(SvnListCommandTest.java:85)
	at org.apache.maven.scm.provider.svn.svnexe.command.list.SvnListCommandTest.testCommandLineWithWhitespaceTag(SvnListCommandTest.java:47)


FAILED:  org.apache.maven.scm.provider.svn.svnexe.command.list.SvnListCommandTest.testCommandLineWithoutTag

Error Message:
expected:<.../foo.com/svn/trunk/.[]'> but was:<.../foo.com/svn/trunk/.[@]'>

Stack Trace:
junit.framework.ComparisonFailure: expected:<.../foo.com/svn/trunk/.[]'> but was:<.../foo.com/svn/trunk/.[@]'>
	at org.apache.maven.scm.provider.svn.svnexe.command.list.SvnListCommandTest.testCommandLine(SvnListCommandTest.java:96)
	at org.apache.maven.scm.provider.svn.svnexe.command.list.SvnListCommandTest.testCommandLine(SvnListCommandTest.java:85)
	at org.apache.maven.scm.provider.svn.svnexe.command.list.SvnListCommandTest.testCommandLineWithoutTag(SvnListCommandTest.java:53)


FAILED:  org.apache.maven.scm.provider.svn.svnexe.command.list.SvnListCommandTest.testCommandLineTag

Error Message:
expected:<.../foo.com/svn/trunk/.[]'> but was:<.../foo.com/svn/trunk/.[@]'>

Stack Trace:
junit.framework.ComparisonFailure: expected:<.../foo.com/svn/trunk/.[]'> but was:<.../foo.com/svn/trunk/.[@]'>
	at org.apache.maven.scm.provider.svn.svnexe.command.list.SvnListCommandTest.testCommandLine(SvnListCommandTest.java:96)
	at org.apache.maven.scm.provider.svn.svnexe.command.list.SvnListCommandTest.testCommandLineTag(SvnListCommandTest.java:59)


FAILED:  org.apache.maven.scm.provider.svn.svnexe.command.list.SvnListCommandTest.testCommandLineWithUsernameAndTag

Error Message:
expected:<.../foo.com/svn/trunk/.[]"> but was:<.../foo.com/svn/trunk/.[@]">

Stack Trace:
junit.framework.ComparisonFailure: expected:<.../foo.com/svn/trunk/.[]"> but was:<.../foo.com/svn/trunk/.[@]">
	at org.apache.maven.scm.provider.svn.svnexe.command.list.SvnListCommandTest.testCommandLine(SvnListCommandTest.java:96)
	at org.apache.maven.scm.provider.svn.svnexe.command.list.SvnListCommandTest.testCommandLineWithUsernameAndTag(SvnListCommandTest.java:66)


FAILED:  org.apache.maven.scm.provider.svn.svnexe.command.list.SvnListCommandTest.testCommandLineWithEmptyTag

Error Message:
expected:<.../foo.com/svn/trunk/.[]"> but was:<.../foo.com/svn/trunk/.[@]">

Stack Trace:
junit.framework.ComparisonFailure: expected:<.../foo.com/svn/trunk/.[]"> but was:<.../foo.com/svn/trunk/.[@]">
	at org.apache.maven.scm.provider.svn.svnexe.command.list.SvnListCommandTest.testCommandLine(SvnListCommandTest.java:96)
	at org.apache.maven.scm.provider.svn.svnexe.command.list.SvnListCommandTest.testCommandLine(SvnListCommandTest.java:85)
	at org.apache.maven.scm.provider.svn.svnexe.command.list.SvnListCommandTest.testCommandLineWithEmptyTag(SvnListCommandTest.java:41)


FAILED:  org.apache.maven.scm.provider.svn.svnexe.command.list.SvnListCommandTest.testCommandLineWithWhitespaceTag

Error Message:
expected:<.../foo.com/svn/trunk/.[]"> but was:<.../foo.com/svn/trunk/.[@]">

Stack Trace:
junit.framework.ComparisonFailure: expected:<.../foo.com/svn/trunk/.[]"> but was:<.../foo.com/svn/trunk/.[@]">
	at org.apache.maven.scm.provider.svn.svnexe.command.list.SvnListCommandTest.testCommandLine(SvnListCommandTest.java:96)
	at org.apache.maven.scm.provider.svn.svnexe.command.list.SvnListCommandTest.testCommandLine(SvnListCommandTest.java:85)
	at org.apache.maven.scm.provider.svn.svnexe.command.list.SvnListCommandTest.testCommandLineWithWhitespaceTag(SvnListCommandTest.java:47)


FAILED:  org.apache.maven.scm.provider.svn.svnexe.command.list.SvnListCommandTest.testCommandLineWithoutTag

Error Message:
expected:<.../foo.com/svn/trunk/.[]"> but was:<.../foo.com/svn/trunk/.[@]">

Stack Trace:
junit.framework.ComparisonFailure: expected:<.../foo.com/svn/trunk/.[]"> but was:<.../foo.com/svn/trunk/.[@]">
	at org.apache.maven.scm.provider.svn.svnexe.command.list.SvnListCommandTest.testCommandLine(SvnListCommandTest.java:96)
	at org.apache.maven.scm.provider.svn.svnexe.command.list.SvnListCommandTest.testCommandLine(SvnListCommandTest.java:85)
	at org.apache.maven.scm.provider.svn.svnexe.command.list.SvnListCommandTest.testCommandLineWithoutTag(SvnListCommandTest.java:53)


FAILED:  org.apache.maven.scm.provider.svn.svnexe.command.list.SvnListCommandTest.testCommandLineTag

Error Message:
expected:<.../foo.com/svn/trunk/.[]"> but was:<.../foo.com/svn/trunk/.[@]">

Stack Trace:
junit.framework.ComparisonFailure: expected:<.../foo.com/svn/trunk/.[]"> but was:<.../foo.com/svn/trunk/.[@]">
	at org.apache.maven.scm.provider.svn.svnexe.command.list.SvnListCommandTest.testCommandLine(SvnListCommandTest.java:96)
	at org.apache.maven.scm.provider.svn.svnexe.command.list.SvnListCommandTest.testCommandLineTag(SvnListCommandTest.java:59)


FAILED:  org.apache.maven.scm.provider.svn.svnexe.command.list.SvnListCommandTest.testCommandLineWithUsernameAndTag

Error Message:
expected:<.../foo.com/svn/trunk/.[]'> but was:<.../foo.com/svn/trunk/.[@]'>

Stack Trace:
junit.framework.ComparisonFailure: expected:<.../foo.com/svn/trunk/.[]'> but was:<.../foo.com/svn/trunk/.[@]'>
	at org.apache.maven.scm.provider.svn.svnexe.command.list.SvnListCommandTest.testCommandLine(SvnListCommandTest.java:96)
	at org.apache.maven.scm.provider.svn.svnexe.command.list.SvnListCommandTest.testCommandLineWithUsernameAndTag(SvnListCommandTest.java:66)


FAILED:  org.apache.maven.scm.provider.svn.svnexe.command.list.SvnListCommandTest.testCommandLineWithEmptyTag

Error Message:
expected:<.../foo.com/svn/trunk/.[]'> but was:<.../foo.com/svn/trunk/.[@]'>

Stack Trace:
junit.framework.ComparisonFailure: expected:<.../foo.com/svn/trunk/.[]'> but was:<.../foo.com/svn/trunk/.[@]'>
	at org.apache.maven.scm.provider.svn.svnexe.command.list.SvnListCommandTest.testCommandLine(SvnListCommandTest.java:96)
	at org.apache.maven.scm.provider.svn.svnexe.command.list.SvnListCommandTest.testCommandLine(SvnListCommandTest.java:85)
	at org.apache.maven.scm.provider.svn.svnexe.command.list.SvnListCommandTest.testCommandLineWithEmptyTag(SvnListCommandTest.java:41)


FAILED:  org.apache.maven.scm.provider.svn.svnexe.command.list.SvnListCommandTest.testCommandLineWithWhitespaceTag

Error Message:
expected:<.../foo.com/svn/trunk/.[]'> but was:<.../foo.com/svn/trunk/.[@]'>

Stack Trace:
junit.framework.ComparisonFailure: expected:<.../foo.com/svn/trunk/.[]'> but was:<.../foo.com/svn/trunk/.[@]'>
	at org.apache.maven.scm.provider.svn.svnexe.command.list.SvnListCommandTest.testCommandLine(SvnListCommandTest.java:96)
	at org.apache.maven.scm.provider.svn.svnexe.command.list.SvnListCommandTest.testCommandLine(SvnListCommandTest.java:85)
	at org.apache.maven.scm.provider.svn.svnexe.command.list.SvnListCommandTest.testCommandLineWithWhitespaceTag(SvnListCommandTest.java:47)


FAILED:  org.apache.maven.scm.provider.svn.svnexe.command.list.SvnListCommandTest.testCommandLineWithoutTag

Error Message:
expected:<.../foo.com/svn/trunk/.[]'> but was:<.../foo.com/svn/trunk/.[@]'>

Stack Trace:
junit.framework.ComparisonFailure: expected:<.../foo.com/svn/trunk/.[]'> but was:<.../foo.com/svn/trunk/.[@]'>
	at org.apache.maven.scm.provider.svn.svnexe.command.list.SvnListCommandTest.testCommandLine(SvnListCommandTest.java:96)
	at org.apache.maven.scm.provider.svn.svnexe.command.list.SvnListCommandTest.testCommandLine(SvnListCommandTest.java:85)
	at org.apache.maven.scm.provider.svn.svnexe.command.list.SvnListCommandTest.testCommandLineWithoutTag(SvnListCommandTest.java:53)


FAILED:  org.apache.maven.scm.provider.svn.svnexe.command.list.SvnListCommandTest.testCommandLineTag

Error Message:
expected:<.../foo.com/svn/trunk/.[]'> but was:<.../foo.com/svn/trunk/.[@]'>

Stack Trace:
junit.framework.ComparisonFailure: expected:<.../foo.com/svn/trunk/.[]'> but was:<.../foo.com/svn/trunk/.[@]'>
	at org.apache.maven.scm.provider.svn.svnexe.command.list.SvnListCommandTest.testCommandLine(SvnListCommandTest.java:96)
	at org.apache.maven.scm.provider.svn.svnexe.command.list.SvnListCommandTest.testCommandLineTag(SvnListCommandTest.java:59)


FAILED:  org.apache.maven.scm.provider.svn.svnexe.command.list.SvnListCommandTest.testCommandLineWithUsernameAndTag

Error Message:
expected:<.../foo.com/svn/trunk/.[]"> but was:<.../foo.com/svn/trunk/.[@]">

Stack Trace:
junit.framework.ComparisonFailure: expected:<.../foo.com/svn/trunk/.[]"> but was:<.../foo.com/svn/trunk/.[@]">
	at org.apache.maven.scm.provider.svn.svnexe.command.list.SvnListCommandTest.testCommandLine(SvnListCommandTest.java:96)
	at org.apache.maven.scm.provider.svn.svnexe.command.list.SvnListCommandTest.testCommandLineWithUsernameAndTag(SvnListCommandTest.java:66)


FAILED:  org.apache.maven.scm.provider.svn.svnexe.command.list.SvnListCommandTest.testCommandLineWithEmptyTag

Error Message:
expected:<.../foo.com/svn/trunk/.[]"> but was:<.../foo.com/svn/trunk/.[@]">

Stack Trace:
junit.framework.ComparisonFailure: expected:<.../foo.com/svn/trunk/.[]"> but was:<.../foo.com/svn/trunk/.[@]">
	at org.apache.maven.scm.provider.svn.svnexe.command.list.SvnListCommandTest.testCommandLine(SvnListCommandTest.java:96)
	at org.apache.maven.scm.provider.svn.svnexe.command.list.SvnListCommandTest.testCommandLine(SvnListCommandTest.java:85)
	at org.apache.maven.scm.provider.svn.svnexe.command.list.SvnListCommandTest.testCommandLineWithEmptyTag(SvnListCommandTest.java:41)


FAILED:  org.apache.maven.scm.provider.svn.svnexe.command.list.SvnListCommandTest.testCommandLineWithWhitespaceTag

Error Message:
expected:<.../foo.com/svn/trunk/.[]"> but was:<.../foo.com/svn/trunk/.[@]">

Stack Trace:
junit.framework.ComparisonFailure: expected:<.../foo.com/svn/trunk/.[]"> but was:<.../foo.com/svn/trunk/.[@]">
	at org.apache.maven.scm.provider.svn.svnexe.command.list.SvnListCommandTest.testCommandLine(SvnListCommandTest.java:96)
	at org.apache.maven.scm.provider.svn.svnexe.command.list.SvnListCommandTest.testCommandLine(SvnListCommandTest.java:85)
	at org.apache.maven.scm.provider.svn.svnexe.command.list.SvnListCommandTest.testCommandLineWithWhitespaceTag(SvnListCommandTest.java:47)


FAILED:  org.apache.maven.scm.provider.svn.svnexe.command.list.SvnListCommandTest.testCommandLineWithoutTag

Error Message:
expected:<.../foo.com/svn/trunk/.[]"> but was:<.../foo.com/svn/trunk/.[@]">

Stack Trace:
junit.framework.ComparisonFailure: expected:<.../foo.com/svn/trunk/.[]"> but was:<.../foo.com/svn/trunk/.[@]">
	at org.apache.maven.scm.provider.svn.svnexe.command.list.SvnListCommandTest.testCommandLine(SvnListCommandTest.java:96)
	at org.apache.maven.scm.provider.svn.svnexe.command.list.SvnListCommandTest.testCommandLine(SvnListCommandTest.java:85)
	at org.apache.maven.scm.provider.svn.svnexe.command.list.SvnListCommandTest.testCommandLineWithoutTag(SvnListCommandTest.java:53)


FAILED:  org.apache.maven.scm.provider.svn.svnexe.command.list.SvnListCommandTest.testCommandLineTag

Error Message:
expected:<.../foo.com/svn/trunk/.[]"> but was:<.../foo.com/svn/trunk/.[@]">

Stack Trace:
junit.framework.ComparisonFailure: expected:<.../foo.com/svn/trunk/.[]"> but was:<.../foo.com/svn/trunk/.[@]">
	at org.apache.maven.scm.provider.svn.svnexe.command.list.SvnListCommandTest.testCommandLine(SvnListCommandTest.java:96)
	at org.apache.maven.scm.provider.svn.svnexe.command.list.SvnListCommandTest.testCommandLineTag(SvnListCommandTest.java:59)


FAILED:  org.apache.maven.scm.provider.svn.svnexe.command.list.SvnListCommandTest.testCommandLineWithUsernameAndTag

Error Message:
expected:<.../foo.com/svn/trunk/.[]"> but was:<.../foo.com/svn/trunk/.[@]">

Stack Trace:
junit.framework.ComparisonFailure: expected:<.../foo.com/svn/trunk/.[]"> but was:<.../foo.com/svn/trunk/.[@]">
	at org.apache.maven.scm.provider.svn.svnexe.command.list.SvnListCommandTest.testCommandLine(SvnListCommandTest.java:96)
	at org.apache.maven.scm.provider.svn.svnexe.command.list.SvnListCommandTest.testCommandLineWithUsernameAndTag(SvnListCommandTest.java:66)


FAILED:  org.apache.maven.scm.provider.svn.svnexe.command.list.SvnListCommandTest.testCommandLineWithEmptyTag

Error Message:
expected:<.../foo.com/svn/trunk/.[]"> but was:<.../foo.com/svn/trunk/.[@]">

Stack Trace:
junit.framework.ComparisonFailure: expected:<.../foo.com/svn/trunk/.[]"> but was:<.../foo.com/svn/trunk/.[@]">
	at org.apache.maven.scm.provider.svn.svnexe.command.list.SvnListCommandTest.testCommandLine(SvnListCommandTest.java:96)
	at org.apache.maven.scm.provider.svn.svnexe.command.list.SvnListCommandTest.testCommandLine(SvnListCommandTest.java:85)
	at org.apache.maven.scm.provider.svn.svnexe.command.list.SvnListCommandTest.testCommandLineWithEmptyTag(SvnListCommandTest.java:41)


FAILED:  org.apache.maven.scm.provider.svn.svnexe.command.list.SvnListCommandTest.testCommandLineWithWhitespaceTag

Error Message:
expected:<.../foo.com/svn/trunk/.[]"> but was:<.../foo.com/svn/trunk/.[@]">

Stack Trace:
junit.framework.ComparisonFailure: expected:<.../foo.com/svn/trunk/.[]"> but was:<.../foo.com/svn/trunk/.[@]">
	at org.apache.maven.scm.provider.svn.svnexe.command.list.SvnListCommandTest.testCommandLine(SvnListCommandTest.java:96)
	at org.apache.maven.scm.provider.svn.svnexe.command.list.SvnListCommandTest.testCommandLine(SvnListCommandTest.java:85)
	at org.apache.maven.scm.provider.svn.svnexe.command.list.SvnListCommandTest.testCommandLineWithWhitespaceTag(SvnListCommandTest.java:47)


FAILED:  org.apache.maven.scm.provider.svn.svnexe.command.list.SvnListCommandTest.testCommandLineWithoutTag

Error Message:
expected:<.../foo.com/svn/trunk/.[]"> but was:<.../foo.com/svn/trunk/.[@]">

Stack Trace:
junit.framework.ComparisonFailure: expected:<.../foo.com/svn/trunk/.[]"> but was:<.../foo.com/svn/trunk/.[@]">
	at org.apache.maven.scm.provider.svn.svnexe.command.list.SvnListCommandTest.testCommandLine(SvnListCommandTest.java:96)
	at org.apache.maven.scm.provider.svn.svnexe.command.list.SvnListCommandTest.testCommandLine(SvnListCommandTest.java:85)
	at org.apache.maven.scm.provider.svn.svnexe.command.list.SvnListCommandTest.testCommandLineWithoutTag(SvnListCommandTest.java:53)


FAILED:  org.apache.maven.scm.provider.svn.svnexe.command.list.SvnListCommandTest.testCommandLineTag

Error Message:
expected:<.../foo.com/svn/trunk/.[]"> but was:<.../foo.com/svn/trunk/.[@]">

Stack Trace:
junit.framework.ComparisonFailure: expected:<.../foo.com/svn/trunk/.[]"> but was:<.../foo.com/svn/trunk/.[@]">
	at org.apache.maven.scm.provider.svn.svnexe.command.list.SvnListCommandTest.testCommandLine(SvnListCommandTest.java:96)
	at org.apache.maven.scm.provider.svn.svnexe.command.list.SvnListCommandTest.testCommandLineTag(SvnListCommandTest.java:59)


FAILED:  org.apache.maven.scm.provider.svn.svnexe.command.mkdir.SvnMkdirCommandTest.testCommandLineMkdirUrlWithUsername

Error Message:
expected:<...om/svn/trunk/missing[] --file F:\jenkins\j...> but was:<...om/svn/trunk/missing[@] --file F:\jenkins\j...>

Stack Trace:
junit.framework.ComparisonFailure: expected:<...om/svn/trunk/missing[] --file F:\jenkins\j...> but was:<...om/svn/trunk/missing[@] --file F:\jenkins\j...>
	at org.apache.maven.scm.provider.svn.svnexe.command.mkdir.SvnMkdirCommandTest.testCommandLine(SvnMkdirCommandTest.java:101)
	at org.apache.maven.scm.provider.svn.svnexe.command.mkdir.SvnMkdirCommandTest.testCommandLineMkdirUrlWithUsername(SvnMkdirCommandTest.java:77)


FAILED:  org.apache.maven.scm.provider.svn.svnexe.command.mkdir.SvnMkdirCommandTest.testCommandLineMkdirUrl

Error Message:
expected:<...om/svn/trunk/missing[] --file F:\jenkins\j...> but was:<...om/svn/trunk/missing[@] --file F:\jenkins\j...>

Stack Trace:
junit.framework.ComparisonFailure: expected:<...om/svn/trunk/missing[] --file F:\jenkins\j...> but was:<...om/svn/trunk/missing[@] --file F:\jenkins\j...>
	at org.apache.maven.scm.provider.svn.svnexe.command.mkdir.SvnMkdirCommandTest.testCommandLine(SvnMkdirCommandTest.java:101)
	at org.apache.maven.scm.provider.svn.svnexe.command.mkdir.SvnMkdirCommandTest.testCommandLineMkdirUrl(SvnMkdirCommandTest.java:70)


FAILED:  org.apache.maven.scm.provider.svn.svnexe.command.mkdir.SvnMkdirCommandTest.testCommandLineMkdirUrlWithUsername

Error Message:
expected:<...om/svn/trunk/missing[]' '--file' '/home/je...> but was:<...om/svn/trunk/missing[@]' '--file' '/home/je...>

Stack Trace:
junit.framework.ComparisonFailure: expected:<...om/svn/trunk/missing[]' '--file' '/home/je...> but was:<...om/svn/trunk/missing[@]' '--file' '/home/je...>
	at org.apache.maven.scm.provider.svn.svnexe.command.mkdir.SvnMkdirCommandTest.testCommandLine(SvnMkdirCommandTest.java:101)
	at org.apache.maven.scm.provider.svn.svnexe.command.mkdir.SvnMkdirCommandTest.testCommandLineMkdirUrlWithUsername(SvnMkdirCommandTest.java:77)


FAILED:  org.apache.maven.scm.provider.svn.svnexe.command.mkdir.SvnMkdirCommandTest.testCommandLineMkdirUrl

Error Message:
expected:<...om/svn/trunk/missing[]' '--file' '/home/je...> but was:<...om/svn/trunk/missing[@]' '--file' '/home/je...>

Stack Trace:
junit.framework.ComparisonFailure: expected:<...om/svn/trunk/missing[]' '--file' '/home/je...> but was:<...om/svn/trunk/missing[@]' '--file' '/home/je...>
	at org.apache.maven.scm.provider.svn.svnexe.command.mkdir.SvnMkdirCommandTest.testCommandLine(SvnMkdirCommandTest.java:101)
	at org.apache.maven.scm.provider.svn.svnexe.command.mkdir.SvnMkdirCommandTest.testCommandLineMkdirUrl(SvnMkdirCommandTest.java:70)


FAILED:  org.apache.maven.scm.provider.svn.svnexe.command.mkdir.SvnMkdirCommandTest.testCommandLineMkdirUrlWithUsername

Error Message:
expected:<...om/svn/trunk/missing[]' '--file' '/home/je...> but was:<...om/svn/trunk/missing[@]' '--file' '/home/je...>

Stack Trace:
junit.framework.ComparisonFailure: expected:<...om/svn/trunk/missing[]' '--file' '/home/je...> but was:<...om/svn/trunk/missing[@]' '--file' '/home/je...>
	at org.apache.maven.scm.provider.svn.svnexe.command.mkdir.SvnMkdirCommandTest.testCommandLine(SvnMkdirCommandTest.java:101)
	at org.apache.maven.scm.provider.svn.svnexe.command.mkdir.SvnMkdirCommandTest.testCommandLineMkdirUrlWithUsername(SvnMkdirCommandTest.java:77)


FAILED:  org.apache.maven.scm.provider.svn.svnexe.command.mkdir.SvnMkdirCommandTest.testCommandLineMkdirUrl

Error Message:
expected:<...om/svn/trunk/missing[]' '--file' '/home/je...> but was:<...om/svn/trunk/missing[@]' '--file' '/home/je...>

Stack Trace:
junit.framework.ComparisonFailure: expected:<...om/svn/trunk/missing[]' '--file' '/home/je...> but was:<...om/svn/trunk/missing[@]' '--file' '/home/je...>
	at org.apache.maven.scm.provider.svn.svnexe.command.mkdir.SvnMkdirCommandTest.testCommandLine(SvnMkdirCommandTest.java:101)
	at org.apache.maven.scm.provider.svn.svnexe.command.mkdir.SvnMkdirCommandTest.testCommandLineMkdirUrl(SvnMkdirCommandTest.java:70)


FAILED:  org.apache.maven.scm.provider.svn.svnexe.command.mkdir.SvnMkdirCommandTest.testCommandLineMkdirUrlWithUsername

Error Message:
expected:<...om/svn/trunk/missing[]' '--file' '/home/je...> but was:<...om/svn/trunk/missing[@]' '--file' '/home/je...>

Stack Trace:
junit.framework.ComparisonFailure: expected:<...om/svn/trunk/missing[]' '--file' '/home/je...> but was:<...om/svn/trunk/missing[@]' '--file' '/home/je...>
	at org.apache.maven.scm.provider.svn.svnexe.command.mkdir.SvnMkdirCommandTest.testCommandLine(SvnMkdirCommandTest.java:101)
	at org.apache.maven.scm.provider.svn.svnexe.command.mkdir.SvnMkdirCommandTest.testCommandLineMkdirUrlWithUsername(SvnMkdirCommandTest.java:77)


FAILED:  org.apache.maven.scm.provider.svn.svnexe.command.mkdir.SvnMkdirCommandTest.testCommandLineMkdirUrl

Error Message:
expected:<...om/svn/trunk/missing[]' '--file' '/home/je...> but was:<...om/svn/trunk/missing[@]' '--file' '/home/je...>

Stack Trace:
junit.framework.ComparisonFailure: expected:<...om/svn/trunk/missing[]' '--file' '/home/je...> but was:<...om/svn/trunk/missing[@]' '--file' '/home/je...>
	at org.apache.maven.scm.provider.svn.svnexe.command.mkdir.SvnMkdirCommandTest.testCommandLine(SvnMkdirCommandTest.java:101)
	at org.apache.maven.scm.provider.svn.svnexe.command.mkdir.SvnMkdirCommandTest.testCommandLineMkdirUrl(SvnMkdirCommandTest.java:70)


FAILED:  org.apache.maven.scm.provider.svn.svnexe.command.mkdir.SvnMkdirCommandTest.testCommandLineMkdirUrlWithUsername

Error Message:
expected:<...om/svn/trunk/missing[] --file F:\jenkins\j...> but was:<...om/svn/trunk/missing[@] --file F:\jenkins\j...>

Stack Trace:
junit.framework.ComparisonFailure: expected:<...om/svn/trunk/missing[] --file F:\jenkins\j...> but was:<...om/svn/trunk/missing[@] --file F:\jenkins\j...>
	at org.apache.maven.scm.provider.svn.svnexe.command.mkdir.SvnMkdirCommandTest.testCommandLine(SvnMkdirCommandTest.java:101)
	at org.apache.maven.scm.provider.svn.svnexe.command.mkdir.SvnMkdirCommandTest.testCommandLineMkdirUrlWithUsername(SvnMkdirCommandTest.java:77)


FAILED:  org.apache.maven.scm.provider.svn.svnexe.command.mkdir.SvnMkdirCommandTest.testCommandLineMkdirUrl

Error Message:
expected:<...om/svn/trunk/missing[] --file F:\jenkins\j...> but was:<...om/svn/trunk/missing[@] --file F:\jenkins\j...>

Stack Trace:
junit.framework.ComparisonFailure: expected:<...om/svn/trunk/missing[] --file F:\jenkins\j...> but was:<...om/svn/trunk/missing[@] --file F:\jenkins\j...>
	at org.apache.maven.scm.provider.svn.svnexe.command.mkdir.SvnMkdirCommandTest.testCommandLine(SvnMkdirCommandTest.java:101)
	at org.apache.maven.scm.provider.svn.svnexe.command.mkdir.SvnMkdirCommandTest.testCommandLineMkdirUrl(SvnMkdirCommandTest.java:70)


FAILED:  org.apache.maven.scm.provider.svn.svnexe.command.mkdir.SvnMkdirCommandTest.testCommandLineMkdirUrlWithUsername

Error Message:
expected:<...om/svn/trunk/missing[]' '--file' '/home/je...> but was:<...om/svn/trunk/missing[@]' '--file' '/home/je...>

Stack Trace:
junit.framework.ComparisonFailure: expected:<...om/svn/trunk/missing[]' '--file' '/home/je...> but was:<...om/svn/trunk/missing[@]' '--file' '/home/je...>
	at org.apache.maven.scm.provider.svn.svnexe.command.mkdir.SvnMkdirCommandTest.testCommandLine(SvnMkdirCommandTest.java:101)
	at org.apache.maven.scm.provider.svn.svnexe.command.mkdir.SvnMkdirCommandTest.testCommandLineMkdirUrlWithUsername(SvnMkdirCommandTest.java:77)


FAILED:  org.apache.maven.scm.provider.svn.svnexe.command.mkdir.SvnMkdirCommandTest.testCommandLineMkdirUrl

Error Message:
expected:<...om/svn/trunk/missing[]' '--file' '/home/je...> but was:<...om/svn/trunk/missing[@]' '--file' '/home/je...>

Stack Trace:
junit.framework.ComparisonFailure: expected:<...om/svn/trunk/missing[]' '--file' '/home/je...> but was:<...om/svn/trunk/missing[@]' '--file' '/home/je...>
	at org.apache.maven.scm.provider.svn.svnexe.command.mkdir.SvnMkdirCommandTest.testCommandLine(SvnMkdirCommandTest.java:101)
	at org.apache.maven.scm.provider.svn.svnexe.command.mkdir.SvnMkdirCommandTest.testCommandLineMkdirUrl(SvnMkdirCommandTest.java:70)


FAILED:  org.apache.maven.scm.provider.svn.svnexe.command.mkdir.SvnMkdirCommandTest.testCommandLineMkdirUrlWithUsername

Error Message:
expected:<...om/svn/trunk/missing[] --file F:\jenkins\j...> but was:<...om/svn/trunk/missing[@] --file F:\jenkins\j...>

Stack Trace:
junit.framework.ComparisonFailure: expected:<...om/svn/trunk/missing[] --file F:\jenkins\j...> but was:<...om/svn/trunk/missing[@] --file F:\jenkins\j...>
	at org.apache.maven.scm.provider.svn.svnexe.command.mkdir.SvnMkdirCommandTest.testCommandLine(SvnMkdirCommandTest.java:101)
	at org.apache.maven.scm.provider.svn.svnexe.command.mkdir.SvnMkdirCommandTest.testCommandLineMkdirUrlWithUsername(SvnMkdirCommandTest.java:77)


FAILED:  org.apache.maven.scm.provider.svn.svnexe.command.mkdir.SvnMkdirCommandTest.testCommandLineMkdirUrl

Error Message:
expected:<...om/svn/trunk/missing[] --file F:\jenkins\j...> but was:<...om/svn/trunk/missing[@] --file F:\jenkins\j...>

Stack Trace:
junit.framework.ComparisonFailure: expected:<...om/svn/trunk/missing[] --file F:\jenkins\j...> but was:<...om/svn/trunk/missing[@] --file F:\jenkins\j...>
	at org.apache.maven.scm.provider.svn.svnexe.command.mkdir.SvnMkdirCommandTest.testCommandLine(SvnMkdirCommandTest.java:101)
	at org.apache.maven.scm.provider.svn.svnexe.command.mkdir.SvnMkdirCommandTest.testCommandLineMkdirUrl(SvnMkdirCommandTest.java:70)


FAILED:  org.apache.maven.scm.provider.svn.svnexe.command.mkdir.SvnMkdirCommandTest.testCommandLineMkdirUrlWithUsername

Error Message:
expected:<...om/svn/trunk/missing[] --file F:\jenkins\j...> but was:<...om/svn/trunk/missing[@] --file F:\jenkins\j...>

Stack Trace:
junit.framework.ComparisonFailure: expected:<...om/svn/trunk/missing[] --file F:\jenkins\j...> but was:<...om/svn/trunk/missing[@] --file F:\jenkins\j...>
	at org.apache.maven.scm.provider.svn.svnexe.command.mkdir.SvnMkdirCommandTest.testCommandLine(SvnMkdirCommandTest.java:101)
	at org.apache.maven.scm.provider.svn.svnexe.command.mkdir.SvnMkdirCommandTest.testCommandLineMkdirUrlWithUsername(SvnMkdirCommandTest.java:77)


FAILED:  org.apache.maven.scm.provider.svn.svnexe.command.mkdir.SvnMkdirCommandTest.testCommandLineMkdirUrl

Error Message:
expected:<...om/svn/trunk/missing[] --file F:\jenkins\j...> but was:<...om/svn/trunk/missing[@] --file F:\jenkins\j...>

Stack Trace:
junit.framework.ComparisonFailure: expected:<...om/svn/trunk/missing[] --file F:\jenkins\j...> but was:<...om/svn/trunk/missing[@] --file F:\jenkins\j...>
	at org.apache.maven.scm.provider.svn.svnexe.command.mkdir.SvnMkdirCommandTest.testCommandLine(SvnMkdirCommandTest.java:101)
	at org.apache.maven.scm.provider.svn.svnexe.command.mkdir.SvnMkdirCommandTest.testCommandLineMkdirUrl(SvnMkdirCommandTest.java:70)


FAILED:  org.apache.maven.scm.provider.svn.svnexe.command.update.SvnUpdateCommandTest.testCommandLineWithNonDeterminantBase

Error Message:
expected:<...nches/my-test-branch[] F:\jenkins\jenkins-...> but was:<...nches/my-test-branch[@] F:\jenkins\jenkins-...>

Stack Trace:
junit.framework.ComparisonFailure: expected:<...nches/my-test-branch[] F:\jenkins\jenkins-...> but was:<...nches/my-test-branch[@] F:\jenkins\jenkins-...>
	at org.apache.maven.scm.provider.svn.svnexe.command.update.SvnUpdateCommandTest.testCommandLine(SvnUpdateCommandTest.java:198)
	at org.apache.maven.scm.provider.svn.svnexe.command.update.SvnUpdateCommandTest.testCommandLine(SvnUpdateCommandTest.java:190)
	at org.apache.maven.scm.provider.svn.svnexe.command.update.SvnUpdateCommandTest.testCommandLineWithNonDeterminantBase(SvnUpdateCommandTest.java:147)


FAILED:  org.apache.maven.scm.provider.svn.svnexe.command.update.SvnUpdateCommandTest.testCommandLineWithRelativeURLTag

Error Message:
expected:<...nches/my-test-branch[] F:\jenkins\jenkins-...> but was:<...nches/my-test-branch[@] F:\jenkins\jenkins-...>

Stack Trace:
junit.framework.ComparisonFailure: expected:<...nches/my-test-branch[] F:\jenkins\jenkins-...> but was:<...nches/my-test-branch[@] F:\jenkins\jenkins-...>
	at org.apache.maven.scm.provider.svn.svnexe.command.update.SvnUpdateCommandTest.testCommandLine(SvnUpdateCommandTest.java:198)
	at org.apache.maven.scm.provider.svn.svnexe.command.update.SvnUpdateCommandTest.testCommandLine(SvnUpdateCommandTest.java:190)
	at org.apache.maven.scm.provider.svn.svnexe.command.update.SvnUpdateCommandTest.testCommandLineWithRelativeURLTag(SvnUpdateCommandTest.java:130)


FAILED:  org.apache.maven.scm.provider.svn.svnexe.command.update.SvnUpdateCommandTest.testCommandLineWithBranchSameAsBase

Error Message:
expected:<....com/svn/tags/my-tag[] F:\jenkins\jenkins-...> but was:<....com/svn/tags/my-tag[@] F:\jenkins\jenkins-...>

Stack Trace:
junit.framework.ComparisonFailure: expected:<....com/svn/tags/my-tag[] F:\jenkins\jenkins-...> but was:<....com/svn/tags/my-tag[@] F:\jenkins\jenkins-...>
	at org.apache.maven.scm.provider.svn.svnexe.command.update.SvnUpdateCommandTest.testCommandLine(SvnUpdateCommandTest.java:198)
	at org.apache.maven.scm.provider.svn.svnexe.command.update.SvnUpdateCommandTest.testCommandLine(SvnUpdateCommandTest.java:190)
	at org.apache.maven.scm.provider.svn.svnexe.command.update.SvnUpdateCommandTest.testCommandLineWithBranchSameAsBase(SvnUpdateCommandTest.java:163)


FAILED:  org.apache.maven.scm.provider.svn.svnexe.command.update.SvnUpdateCommandTest.testCommandLineWithAbsoluteURLTag

Error Message:
expected:<...nches/my-test-branch[] F:\jenkins\jenkins-...> but was:<...nches/my-test-branch[@] F:\jenkins\jenkins-...>

Stack Trace:
junit.framework.ComparisonFailure: expected:<...nches/my-test-branch[] F:\jenkins\jenkins-...> but was:<...nches/my-test-branch[@] F:\jenkins\jenkins-...>
	at org.apache.maven.scm.provider.svn.svnexe.command.update.SvnUpdateCommandTest.testCommandLine(SvnUpdateCommandTest.java:198)
	at org.apache.maven.scm.provider.svn.svnexe.command.update.SvnUpdateCommandTest.testCommandLine(SvnUpdateCommandTest.java:190)
	at org.apache.maven.scm.provider.svn.svnexe.command.update.SvnUpdateCommandTest.testCommandLineWithAbsoluteURLTag(SvnUpdateCommandTest.java:138)


FAILED:  org.apache.maven.scm.provider.svn.svnexe.command.update.SvnUpdateCommandTest.testCommandLineWithNonDeterminantBaseTrailingSlash

Error Message:
expected:<...nches/my-test-branch[] F:\jenkins\jenkins-...> but was:<...nches/my-test-branch[@] F:\jenkins\jenkins-...>

Stack Trace:
junit.framework.ComparisonFailure: expected:<...nches/my-test-branch[] F:\jenkins\jenkins-...> but was:<...nches/my-test-branch[@] F:\jenkins\jenkins-...>
	at org.apache.maven.scm.provider.svn.svnexe.command.update.SvnUpdateCommandTest.testCommandLine(SvnUpdateCommandTest.java:198)
	at org.apache.maven.scm.provider.svn.svnexe.command.update.SvnUpdateCommandTest.testCommandLine(SvnUpdateCommandTest.java:190)
	at org.apache.maven.scm.provider.svn.svnexe.command.update.SvnUpdateCommandTest.testCommandLineWithNonDeterminantBaseTrailingSlash(SvnUpdateCommandTest.java:155)


FAILED:  org.apache.maven.scm.provider.svn.svnexe.command.update.SvnUpdateCommandTest.testCommandLineWithNonDeterminantBase

Error Message:
expected:<...nches/my-test-branch[]' '/home/jenkins/jen...> but was:<...nches/my-test-branch[@]' '/home/jenkins/jen...>

Stack Trace:
junit.framework.ComparisonFailure: expected:<...nches/my-test-branch[]' '/home/jenkins/jen...> but was:<...nches/my-test-branch[@]' '/home/jenkins/jen...>
	at org.apache.maven.scm.provider.svn.svnexe.command.update.SvnUpdateCommandTest.testCommandLine(SvnUpdateCommandTest.java:198)
	at org.apache.maven.scm.provider.svn.svnexe.command.update.SvnUpdateCommandTest.testCommandLine(SvnUpdateCommandTest.java:190)
	at org.apache.maven.scm.provider.svn.svnexe.command.update.SvnUpdateCommandTest.testCommandLineWithNonDeterminantBase(SvnUpdateCommandTest.java:147)


FAILED:  org.apache.maven.scm.provider.svn.svnexe.command.update.SvnUpdateCommandTest.testCommandLineWithRelativeURLTag

Error Message:
expected:<...nches/my-test-branch[]' '/home/jenkins/jen...> but was:<...nches/my-test-branch[@]' '/home/jenkins/jen...>

Stack Trace:
junit.framework.ComparisonFailure: expected:<...nches/my-test-branch[]' '/home/jenkins/jen...> but was:<...nches/my-test-branch[@]' '/home/jenkins/jen...>
	at org.apache.maven.scm.provider.svn.svnexe.command.update.SvnUpdateCommandTest.testCommandLine(SvnUpdateCommandTest.java:198)
	at org.apache.maven.scm.provider.svn.svnexe.command.update.SvnUpdateCommandTest.testCommandLine(SvnUpdateCommandTest.java:190)
	at org.apache.maven.scm.provider.svn.svnexe.command.update.SvnUpdateCommandTest.testCommandLineWithRelativeURLTag(SvnUpdateCommandTest.java:130)


FAILED:  org.apache.maven.scm.provider.svn.svnexe.command.update.SvnUpdateCommandTest.testCommandLineWithBranchSameAsBase

Error Message:
expected:<....com/svn/tags/my-tag[]' '/home/jenkins/jen...> but was:<....com/svn/tags/my-tag[@]' '/home/jenkins/jen...>

Stack Trace:
junit.framework.ComparisonFailure: expected:<....com/svn/tags/my-tag[]' '/home/jenkins/jen...> but was:<....com/svn/tags/my-tag[@]' '/home/jenkins/jen...>
	at org.apache.maven.scm.provider.svn.svnexe.command.update.SvnUpdateCommandTest.testCommandLine(SvnUpdateCommandTest.java:198)
	at org.apache.maven.scm.provider.svn.svnexe.command.update.SvnUpdateCommandTest.testCommandLine(SvnUpdateCommandTest.java:190)
	at org.apache.maven.scm.provider.svn.svnexe.command.update.SvnUpdateCommandTest.testCommandLineWithBranchSameAsBase(SvnUpdateCommandTest.java:163)


FAILED:  org.apache.maven.scm.provider.svn.svnexe.command.update.SvnUpdateCommandTest.testCommandLineWithAbsoluteURLTag

Error Message:
expected:<...nches/my-test-branch[]' '/home/jenkins/jen...> but was:<...nches/my-test-branch[@]' '/home/jenkins/jen...>

Stack Trace:
junit.framework.ComparisonFailure: expected:<...nches/my-test-branch[]' '/home/jenkins/jen...> but was:<...nches/my-test-branch[@]' '/home/jenkins/jen...>
	at org.apache.maven.scm.provider.svn.svnexe.command.update.SvnUpdateCommandTest.testCommandLine(SvnUpdateCommandTest.java:198)
	at org.apache.maven.scm.provider.svn.svnexe.command.update.SvnUpdateCommandTest.testCommandLine(SvnUpdateCommandTest.java:190)
	at org.apache.maven.scm.provider.svn.svnexe.command.update.SvnUpdateCommandTest.testCommandLineWithAbsoluteURLTag(SvnUpdateCommandTest.java:138)


FAILED:  org.apache.maven.scm.provider.svn.svnexe.command.update.SvnUpdateCommandTest.testCommandLineWithNonDeterminantBaseTrailingSlash

Error Message:
expected:<...nches/my-test-branch[]' '/home/jenkins/jen...> but was:<...nches/my-test-branch[@]' '/home/jenkins/jen...>

Stack Trace:
junit.framework.ComparisonFailure: expected:<...nches/my-test-branch[]' '/home/jenkins/jen...> but was:<...nches/my-test-branch[@]' '/home/jenkins/jen...>
	at org.apache.maven.scm.provider.svn.svnexe.command.update.SvnUpdateCommandTest.testCommandLine(SvnUpdateCommandTest.java:198)
	at org.apache.maven.scm.provider.svn.svnexe.command.update.SvnUpdateCommandTest.testCommandLine(SvnUpdateCommandTest.java:190)
	at org.apache.maven.scm.provider.svn.svnexe.command.update.SvnUpdateCommandTest.testCommandLineWithNonDeterminantBaseTrailingSlash(SvnUpdateCommandTest.java:155)


FAILED:  org.apache.maven.scm.provider.svn.svnexe.command.update.SvnUpdateCommandTest.testCommandLineWithNonDeterminantBase

Error Message:
expected:<...nches/my-test-branch[]' '/home/jenkins/jen...> but was:<...nches/my-test-branch[@]' '/home/jenkins/jen...>

Stack Trace:
junit.framework.ComparisonFailure: expected:<...nches/my-test-branch[]' '/home/jenkins/jen...> but was:<...nches/my-test-branch[@]' '/home/jenkins/jen...>
	at org.apache.maven.scm.provider.svn.svnexe.command.update.SvnUpdateCommandTest.testCommandLine(SvnUpdateCommandTest.java:198)
	at org.apache.maven.scm.provider.svn.svnexe.command.update.SvnUpdateCommandTest.testCommandLine(SvnUpdateCommandTest.java:190)
	at org.apache.maven.scm.provider.svn.svnexe.command.update.SvnUpdateCommandTest.testCommandLineWithNonDeterminantBase(SvnUpdateCommandTest.java:147)


FAILED:  org.apache.maven.scm.provider.svn.svnexe.command.update.SvnUpdateCommandTest.testCommandLineWithRelativeURLTag

Error Message:
expected:<...nches/my-test-branch[]' '/home/jenkins/jen...> but was:<...nches/my-test-branch[@]' '/home/jenkins/jen...>

Stack Trace:
junit.framework.ComparisonFailure: expected:<...nches/my-test-branch[]' '/home/jenkins/jen...> but was:<...nches/my-test-branch[@]' '/home/jenkins/jen...>
	at org.apache.maven.scm.provider.svn.svnexe.command.update.SvnUpdateCommandTest.testCommandLine(SvnUpdateCommandTest.java:198)
	at org.apache.maven.scm.provider.svn.svnexe.command.update.SvnUpdateCommandTest.testCommandLine(SvnUpdateCommandTest.java:190)
	at org.apache.maven.scm.provider.svn.svnexe.command.update.SvnUpdateCommandTest.testCommandLineWithRelativeURLTag(SvnUpdateCommandTest.java:130)


FAILED:  org.apache.maven.scm.provider.svn.svnexe.command.update.SvnUpdateCommandTest.testCommandLineWithBranchSameAsBase

Error Message:
expected:<....com/svn/tags/my-tag[]' '/home/jenkins/jen...> but was:<....com/svn/tags/my-tag[@]' '/home/jenkins/jen...>

Stack Trace:
junit.framework.ComparisonFailure: expected:<....com/svn/tags/my-tag[]' '/home/jenkins/jen...> but was:<....com/svn/tags/my-tag[@]' '/home/jenkins/jen...>
	at org.apache.maven.scm.provider.svn.svnexe.command.update.SvnUpdateCommandTest.testCommandLine(SvnUpdateCommandTest.java:198)
	at org.apache.maven.scm.provider.svn.svnexe.command.update.SvnUpdateCommandTest.testCommandLine(SvnUpdateCommandTest.java:190)
	at org.apache.maven.scm.provider.svn.svnexe.command.update.SvnUpdateCommandTest.testCommandLineWithBranchSameAsBase(SvnUpdateCommandTest.java:163)


FAILED:  org.apache.maven.scm.provider.svn.svnexe.command.update.SvnUpdateCommandTest.testCommandLineWithAbsoluteURLTag

Error Message:
expected:<...nches/my-test-branch[]' '/home/jenkins/jen...> but was:<...nches/my-test-branch[@]' '/home/jenkins/jen...>

Stack Trace:
junit.framework.ComparisonFailure: expected:<...nches/my-test-branch[]' '/home/jenkins/jen...> but was:<...nches/my-test-branch[@]' '/home/jenkins/jen...>
	at org.apache.maven.scm.provider.svn.svnexe.command.update.SvnUpdateCommandTest.testCommandLine(SvnUpdateCommandTest.java:198)
	at org.apache.maven.scm.provider.svn.svnexe.command.update.SvnUpdateCommandTest.testCommandLine(SvnUpdateCommandTest.java:190)
	at org.apache.maven.scm.provider.svn.svnexe.command.update.SvnUpdateCommandTest.testCommandLineWithAbsoluteURLTag(SvnUpdateCommandTest.java:138)


FAILED:  org.apache.maven.scm.provider.svn.svnexe.command.update.SvnUpdateCommandTest.testCommandLineWithNonDeterminantBaseTrailingSlash

Error Message:
expected:<...nches/my-test-branch[]' '/home/jenkins/jen...> but was:<...nches/my-test-branch[@]' '/home/jenkins/jen...>

Stack Trace:
junit.framework.ComparisonFailure: expected:<...nches/my-test-branch[]' '/home/jenkins/jen...> but was:<...nches/my-test-branch[@]' '/home/jenkins/jen...>
	at org.apache.maven.scm.provider.svn.svnexe.command.update.SvnUpdateCommandTest.testCommandLine(SvnUpdateCommandTest.java:198)
	at org.apache.maven.scm.provider.svn.svnexe.command.update.SvnUpdateCommandTest.testCommandLine(SvnUpdateCommandTest.java:190)
	at org.apache.maven.scm.provider.svn.svnexe.command.update.SvnUpdateCommandTest.testCommandLineWithNonDeterminantBaseTrailingSlash(SvnUpdateCommandTest.java:155)


FAILED:  org.apache.maven.scm.provider.svn.svnexe.command.update.SvnUpdateCommandTest.testCommandLineWithNonDeterminantBase

Error Message:
expected:<...nches/my-test-branch[]' '/home/jenkins/jen...> but was:<...nches/my-test-branch[@]' '/home/jenkins/jen...>

Stack Trace:
junit.framework.ComparisonFailure: expected:<...nches/my-test-branch[]' '/home/jenkins/jen...> but was:<...nches/my-test-branch[@]' '/home/jenkins/jen...>
	at org.apache.maven.scm.provider.svn.svnexe.command.update.SvnUpdateCommandTest.testCommandLine(SvnUpdateCommandTest.java:198)
	at org.apache.maven.scm.provider.svn.svnexe.command.update.SvnUpdateCommandTest.testCommandLine(SvnUpdateCommandTest.java:190)
	at org.apache.maven.scm.provider.svn.svnexe.command.update.SvnUpdateCommandTest.testCommandLineWithNonDeterminantBase(SvnUpdateCommandTest.java:147)


FAILED:  org.apache.maven.scm.provider.svn.svnexe.command.update.SvnUpdateCommandTest.testCommandLineWithRelativeURLTag

Error Message:
expected:<...nches/my-test-branch[]' '/home/jenkins/jen...> but was:<...nches/my-test-branch[@]' '/home/jenkins/jen...>

Stack Trace:
junit.framework.ComparisonFailure: expected:<...nches/my-test-branch[]' '/home/jenkins/jen...> but was:<...nches/my-test-branch[@]' '/home/jenkins/jen...>
	at org.apache.maven.scm.provider.svn.svnexe.command.update.SvnUpdateCommandTest.testCommandLine(SvnUpdateCommandTest.java:198)
	at org.apache.maven.scm.provider.svn.svnexe.command.update.SvnUpdateCommandTest.testCommandLine(SvnUpdateCommandTest.java:190)
	at org.apache.maven.scm.provider.svn.svnexe.command.update.SvnUpdateCommandTest.testCommandLineWithRelativeURLTag(SvnUpdateCommandTest.java:130)


FAILED:  org.apache.maven.scm.provider.svn.svnexe.command.update.SvnUpdateCommandTest.testCommandLineWithBranchSameAsBase

Error Message:
expected:<....com/svn/tags/my-tag[]' '/home/jenkins/jen...> but was:<....com/svn/tags/my-tag[@]' '/home/jenkins/jen...>

Stack Trace:
junit.framework.ComparisonFailure: expected:<....com/svn/tags/my-tag[]' '/home/jenkins/jen...> but was:<....com/svn/tags/my-tag[@]' '/home/jenkins/jen...>
	at org.apache.maven.scm.provider.svn.svnexe.command.update.SvnUpdateCommandTest.testCommandLine(SvnUpdateCommandTest.java:198)
	at org.apache.maven.scm.provider.svn.svnexe.command.update.SvnUpdateCommandTest.testCommandLine(SvnUpdateCommandTest.java:190)
	at org.apache.maven.scm.provider.svn.svnexe.command.update.SvnUpdateCommandTest.testCommandLineWithBranchSameAsBase(SvnUpdateCommandTest.java:163)


FAILED:  org.apache.maven.scm.provider.svn.svnexe.command.update.SvnUpdateCommandTest.testCommandLineWithAbsoluteURLTag

Error Message:
expected:<...nches/my-test-branch[]' '/home/jenkins/jen...> but was:<...nches/my-test-branch[@]' '/home/jenkins/jen...>

Stack Trace:
junit.framework.ComparisonFailure: expected:<...nches/my-test-branch[]' '/home/jenkins/jen...> but was:<...nches/my-test-branch[@]' '/home/jenkins/jen...>
	at org.apache.maven.scm.provider.svn.svnexe.command.update.SvnUpdateCommandTest.testCommandLine(SvnUpdateCommandTest.java:198)
	at org.apache.maven.scm.provider.svn.svnexe.command.update.SvnUpdateCommandTest.testCommandLine(SvnUpdateCommandTest.java:190)
	at org.apache.maven.scm.provider.svn.svnexe.command.update.SvnUpdateCommandTest.testCommandLineWithAbsoluteURLTag(SvnUpdateCommandTest.java:138)


FAILED:  org.apache.maven.scm.provider.svn.svnexe.command.update.SvnUpdateCommandTest.testCommandLineWithNonDeterminantBaseTrailingSlash

Error Message:
expected:<...nches/my-test-branch[]' '/home/jenkins/jen...> but was:<...nches/my-test-branch[@]' '/home/jenkins/jen...>

Stack Trace:
junit.framework.ComparisonFailure: expected:<...nches/my-test-branch[]' '/home/jenkins/jen...> but was:<...nches/my-test-branch[@]' '/home/jenkins/jen...>
	at org.apache.maven.scm.provider.svn.svnexe.command.update.SvnUpdateCommandTest.testCommandLine(SvnUpdateCommandTest.java:198)
	at org.apache.maven.scm.provider.svn.svnexe.command.update.SvnUpdateCommandTest.testCommandLine(SvnUpdateCommandTest.java:190)
	at org.apache.maven.scm.provider.svn.svnexe.command.update.SvnUpdateCommandTest.testCommandLineWithNonDeterminantBaseTrailingSlash(SvnUpdateCommandTest.java:155)


FAILED:  org.apache.maven.scm.provider.svn.svnexe.command.update.SvnUpdateCommandTest.testCommandLineWithNonDeterminantBase

Error Message:
expected:<...nches/my-test-branch[] F:\jenkins\jenkins-...> but was:<...nches/my-test-branch[@] F:\jenkins\jenkins-...>

Stack Trace:
junit.framework.ComparisonFailure: expected:<...nches/my-test-branch[] F:\jenkins\jenkins-...> but was:<...nches/my-test-branch[@] F:\jenkins\jenkins-...>
	at org.apache.maven.scm.provider.svn.svnexe.command.update.SvnUpdateCommandTest.testCommandLine(SvnUpdateCommandTest.java:198)
	at org.apache.maven.scm.provider.svn.svnexe.command.update.SvnUpdateCommandTest.testCommandLine(SvnUpdateCommandTest.java:190)
	at org.apache.maven.scm.provider.svn.svnexe.command.update.SvnUpdateCommandTest.testCommandLineWithNonDeterminantBase(SvnUpdateCommandTest.java:147)


FAILED:  org.apache.maven.scm.provider.svn.svnexe.command.update.SvnUpdateCommandTest.testCommandLineWithRelativeURLTag

Error Message:
expected:<...nches/my-test-branch[] F:\jenkins\jenkins-...> but was:<...nches/my-test-branch[@] F:\jenkins\jenkins-...>

Stack Trace:
junit.framework.ComparisonFailure: expected:<...nches/my-test-branch[] F:\jenkins\jenkins-...> but was:<...nches/my-test-branch[@] F:\jenkins\jenkins-...>
	at org.apache.maven.scm.provider.svn.svnexe.command.update.SvnUpdateCommandTest.testCommandLine(SvnUpdateCommandTest.java:198)
	at org.apache.maven.scm.provider.svn.svnexe.command.update.SvnUpdateCommandTest.testCommandLine(SvnUpdateCommandTest.java:190)
	at org.apache.maven.scm.provider.svn.svnexe.command.update.SvnUpdateCommandTest.testCommandLineWithRelativeURLTag(SvnUpdateCommandTest.java:130)


FAILED:  org.apache.maven.scm.provider.svn.svnexe.command.update.SvnUpdateCommandTest.testCommandLineWithBranchSameAsBase

Error Message:
expected:<....com/svn/tags/my-tag[] F:\jenkins\jenkins-...> but was:<....com/svn/tags/my-tag[@] F:\jenkins\jenkins-...>

Stack Trace:
junit.framework.ComparisonFailure: expected:<....com/svn/tags/my-tag[] F:\jenkins\jenkins-...> but was:<....com/svn/tags/my-tag[@] F:\jenkins\jenkins-...>
	at org.apache.maven.scm.provider.svn.svnexe.command.update.SvnUpdateCommandTest.testCommandLine(SvnUpdateCommandTest.java:198)
	at org.apache.maven.scm.provider.svn.svnexe.command.update.SvnUpdateCommandTest.testCommandLine(SvnUpdateCommandTest.java:190)
	at org.apache.maven.scm.provider.svn.svnexe.command.update.SvnUpdateCommandTest.testCommandLineWithBranchSameAsBase(SvnUpdateCommandTest.java:163)


FAILED:  org.apache.maven.scm.provider.svn.svnexe.command.update.SvnUpdateCommandTest.testCommandLineWithAbsoluteURLTag

Error Message:
expected:<...nches/my-test-branch[] F:\jenkins\jenkins-...> but was:<...nches/my-test-branch[@] F:\jenkins\jenkins-...>

Stack Trace:
junit.framework.ComparisonFailure: expected:<...nches/my-test-branch[] F:\jenkins\jenkins-...> but was:<...nches/my-test-branch[@] F:\jenkins\jenkins-...>
	at org.apache.maven.scm.provider.svn.svnexe.command.update.SvnUpdateCommandTest.testCommandLine(SvnUpdateCommandTest.java:198)
	at org.apache.maven.scm.provider.svn.svnexe.command.update.SvnUpdateCommandTest.testCommandLine(SvnUpdateCommandTest.java:190)
	at org.apache.maven.scm.provider.svn.svnexe.command.update.SvnUpdateCommandTest.testCommandLineWithAbsoluteURLTag(SvnUpdateCommandTest.java:138)


FAILED:  org.apache.maven.scm.provider.svn.svnexe.command.update.SvnUpdateCommandTest.testCommandLineWithNonDeterminantBaseTrailingSlash

Error Message:
expected:<...nches/my-test-branch[] F:\jenkins\jenkins-...> but was:<...nches/my-test-branch[@] F:\jenkins\jenkins-...>

Stack Trace:
junit.framework.ComparisonFailure: expected:<...nches/my-test-branch[] F:\jenkins\jenkins-...> but was:<...nches/my-test-branch[@] F:\jenkins\jenkins-...>
	at org.apache.maven.scm.provider.svn.svnexe.command.update.SvnUpdateCommandTest.testCommandLine(SvnUpdateCommandTest.java:198)
	at org.apache.maven.scm.provider.svn.svnexe.command.update.SvnUpdateCommandTest.testCommandLine(SvnUpdateCommandTest.java:190)
	at org.apache.maven.scm.provider.svn.svnexe.command.update.SvnUpdateCommandTest.testCommandLineWithNonDeterminantBaseTrailingSlash(SvnUpdateCommandTest.java:155)


FAILED:  org.apache.maven.scm.provider.svn.svnexe.command.update.SvnUpdateCommandTest.testCommandLineWithNonDeterminantBase

Error Message:
expected:<...nches/my-test-branch[]' '/home/jenkins/jen...> but was:<...nches/my-test-branch[@]' '/home/jenkins/jen...>

Stack Trace:
junit.framework.ComparisonFailure: expected:<...nches/my-test-branch[]' '/home/jenkins/jen...> but was:<...nches/my-test-branch[@]' '/home/jenkins/jen...>
	at org.apache.maven.scm.provider.svn.svnexe.command.update.SvnUpdateCommandTest.testCommandLine(SvnUpdateCommandTest.java:198)
	at org.apache.maven.scm.provider.svn.svnexe.command.update.SvnUpdateCommandTest.testCommandLine(SvnUpdateCommandTest.java:190)
	at org.apache.maven.scm.provider.svn.svnexe.command.update.SvnUpdateCommandTest.testCommandLineWithNonDeterminantBase(SvnUpdateCommandTest.java:147)


FAILED:  org.apache.maven.scm.provider.svn.svnexe.command.update.SvnUpdateCommandTest.testCommandLineWithRelativeURLTag

Error Message:
expected:<...nches/my-test-branch[]' '/home/jenkins/jen...> but was:<...nches/my-test-branch[@]' '/home/jenkins/jen...>

Stack Trace:
junit.framework.ComparisonFailure: expected:<...nches/my-test-branch[]' '/home/jenkins/jen...> but was:<...nches/my-test-branch[@]' '/home/jenkins/jen...>
	at org.apache.maven.scm.provider.svn.svnexe.command.update.SvnUpdateCommandTest.testCommandLine(SvnUpdateCommandTest.java:198)
	at org.apache.maven.scm.provider.svn.svnexe.command.update.SvnUpdateCommandTest.testCommandLine(SvnUpdateCommandTest.java:190)
	at org.apache.maven.scm.provider.svn.svnexe.command.update.SvnUpdateCommandTest.testCommandLineWithRelativeURLTag(SvnUpdateCommandTest.java:130)


FAILED:  org.apache.maven.scm.provider.svn.svnexe.command.update.SvnUpdateCommandTest.testCommandLineWithBranchSameAsBase

Error Message:
expected:<....com/svn/tags/my-tag[]' '/home/jenkins/jen...> but was:<....com/svn/tags/my-tag[@]' '/home/jenkins/jen...>

Stack Trace:
junit.framework.ComparisonFailure: expected:<....com/svn/tags/my-tag[]' '/home/jenkins/jen...> but was:<....com/svn/tags/my-tag[@]' '/home/jenkins/jen...>
	at org.apache.maven.scm.provider.svn.svnexe.command.update.SvnUpdateCommandTest.testCommandLine(SvnUpdateCommandTest.java:198)
	at org.apache.maven.scm.provider.svn.svnexe.command.update.SvnUpdateCommandTest.testCommandLine(SvnUpdateCommandTest.java:190)
	at org.apache.maven.scm.provider.svn.svnexe.command.update.SvnUpdateCommandTest.testCommandLineWithBranchSameAsBase(SvnUpdateCommandTest.java:163)


FAILED:  org.apache.maven.scm.provider.svn.svnexe.command.update.SvnUpdateCommandTest.testCommandLineWithAbsoluteURLTag

Error Message:
expected:<...nches/my-test-branch[]' '/home/jenkins/jen...> but was:<...nches/my-test-branch[@]' '/home/jenkins/jen...>

Stack Trace:
junit.framework.ComparisonFailure: expected:<...nches/my-test-branch[]' '/home/jenkins/jen...> but was:<...nches/my-test-branch[@]' '/home/jenkins/jen...>
	at org.apache.maven.scm.provider.svn.svnexe.command.update.SvnUpdateCommandTest.testCommandLine(SvnUpdateCommandTest.java:198)
	at org.apache.maven.scm.provider.svn.svnexe.command.update.SvnUpdateCommandTest.testCommandLine(SvnUpdateCommandTest.java:190)
	at org.apache.maven.scm.provider.svn.svnexe.command.update.SvnUpdateCommandTest.testCommandLineWithAbsoluteURLTag(SvnUpdateCommandTest.java:138)


FAILED:  org.apache.maven.scm.provider.svn.svnexe.command.update.SvnUpdateCommandTest.testCommandLineWithNonDeterminantBaseTrailingSlash

Error Message:
expected:<...nches/my-test-branch[]' '/home/jenkins/jen...> but was:<...nches/my-test-branch[@]' '/home/jenkins/jen...>

Stack Trace:
junit.framework.ComparisonFailure: expected:<...nches/my-test-branch[]' '/home/jenkins/jen...> but was:<...nches/my-test-branch[@]' '/home/jenkins/jen...>
	at org.apache.maven.scm.provider.svn.svnexe.command.update.SvnUpdateCommandTest.testCommandLine(SvnUpdateCommandTest.java:198)
	at org.apache.maven.scm.provider.svn.svnexe.command.update.SvnUpdateCommandTest.testCommandLine(SvnUpdateCommandTest.java:190)
	at org.apache.maven.scm.provider.svn.svnexe.command.update.SvnUpdateCommandTest.testCommandLineWithNonDeterminantBaseTrailingSlash(SvnUpdateCommandTest.java:155)


FAILED:  org.apache.maven.scm.provider.svn.svnexe.command.update.SvnUpdateCommandTest.testCommandLineWithNonDeterminantBase

Error Message:
expected:<...nches/my-test-branch[] F:\jenkins\jenkins-...> but was:<...nches/my-test-branch[@] F:\jenkins\jenkins-...>

Stack Trace:
junit.framework.ComparisonFailure: expected:<...nches/my-test-branch[] F:\jenkins\jenkins-...> but was:<...nches/my-test-branch[@] F:\jenkins\jenkins-...>
	at org.apache.maven.scm.provider.svn.svnexe.command.update.SvnUpdateCommandTest.testCommandLine(SvnUpdateCommandTest.java:198)
	at org.apache.maven.scm.provider.svn.svnexe.command.update.SvnUpdateCommandTest.testCommandLine(SvnUpdateCommandTest.java:190)
	at org.apache.maven.scm.provider.svn.svnexe.command.update.SvnUpdateCommandTest.testCommandLineWithNonDeterminantBase(SvnUpdateCommandTest.java:147)


FAILED:  org.apache.maven.scm.provider.svn.svnexe.command.update.SvnUpdateCommandTest.testCommandLineWithRelativeURLTag

Error Message:
expected:<...nches/my-test-branch[] F:\jenkins\jenkins-...> but was:<...nches/my-test-branch[@] F:\jenkins\jenkins-...>

Stack Trace:
junit.framework.ComparisonFailure: expected:<...nches/my-test-branch[] F:\jenkins\jenkins-...> but was:<...nches/my-test-branch[@] F:\jenkins\jenkins-...>
	at org.apache.maven.scm.provider.svn.svnexe.command.update.SvnUpdateCommandTest.testCommandLine(SvnUpdateCommandTest.java:198)
	at org.apache.maven.scm.provider.svn.svnexe.command.update.SvnUpdateCommandTest.testCommandLine(SvnUpdateCommandTest.java:190)
	at org.apache.maven.scm.provider.svn.svnexe.command.update.SvnUpdateCommandTest.testCommandLineWithRelativeURLTag(SvnUpdateCommandTest.java:130)


FAILED:  org.apache.maven.scm.provider.svn.svnexe.command.update.SvnUpdateCommandTest.testCommandLineWithBranchSameAsBase

Error Message:
expected:<....com/svn/tags/my-tag[] F:\jenkins\jenkins-...> but was:<....com/svn/tags/my-tag[@] F:\jenkins\jenkins-...>

Stack Trace:
junit.framework.ComparisonFailure: expected:<....com/svn/tags/my-tag[] F:\jenkins\jenkins-...> but was:<....com/svn/tags/my-tag[@] F:\jenkins\jenkins-...>
	at org.apache.maven.scm.provider.svn.svnexe.command.update.SvnUpdateCommandTest.testCommandLine(SvnUpdateCommandTest.java:198)
	at org.apache.maven.scm.provider.svn.svnexe.command.update.SvnUpdateCommandTest.testCommandLine(SvnUpdateCommandTest.java:190)
	at org.apache.maven.scm.provider.svn.svnexe.command.update.SvnUpdateCommandTest.testCommandLineWithBranchSameAsBase(SvnUpdateCommandTest.java:163)


FAILED:  org.apache.maven.scm.provider.svn.svnexe.command.update.SvnUpdateCommandTest.testCommandLineWithAbsoluteURLTag

Error Message:
expected:<...nches/my-test-branch[] F:\jenkins\jenkins-...> but was:<...nches/my-test-branch[@] F:\jenkins\jenkins-...>

Stack Trace:
junit.framework.ComparisonFailure: expected:<...nches/my-test-branch[] F:\jenkins\jenkins-...> but was:<...nches/my-test-branch[@] F:\jenkins\jenkins-...>
	at org.apache.maven.scm.provider.svn.svnexe.command.update.SvnUpdateCommandTest.testCommandLine(SvnUpdateCommandTest.java:198)
	at org.apache.maven.scm.provider.svn.svnexe.command.update.SvnUpdateCommandTest.testCommandLine(SvnUpdateCommandTest.java:190)
	at org.apache.maven.scm.provider.svn.svnexe.command.update.SvnUpdateCommandTest.testCommandLineWithAbsoluteURLTag(SvnUpdateCommandTest.java:138)


FAILED:  org.apache.maven.scm.provider.svn.svnexe.command.update.SvnUpdateCommandTest.testCommandLineWithNonDeterminantBaseTrailingSlash

Error Message:
expected:<...nches/my-test-branch[] F:\jenkins\jenkins-...> but was:<...nches/my-test-branch[@] F:\jenkins\jenkins-...>

Stack Trace:
junit.framework.ComparisonFailure: expected:<...nches/my-test-branch[] F:\jenkins\jenkins-...> but was:<...nches/my-test-branch[@] F:\jenkins\jenkins-...>
	at org.apache.maven.scm.provider.svn.svnexe.command.update.SvnUpdateCommandTest.testCommandLine(SvnUpdateCommandTest.java:198)
	at org.apache.maven.scm.provider.svn.svnexe.command.update.SvnUpdateCommandTest.testCommandLine(SvnUpdateCommandTest.java:190)
	at org.apache.maven.scm.provider.svn.svnexe.command.update.SvnUpdateCommandTest.testCommandLineWithNonDeterminantBaseTrailingSlash(SvnUpdateCommandTest.java:155)


FAILED:  org.apache.maven.scm.provider.svn.svnexe.command.update.SvnUpdateCommandTest.testCommandLineWithNonDeterminantBase

Error Message:
expected:<...nches/my-test-branch[] F:\jenkins\jenkins-...> but was:<...nches/my-test-branch[@] F:\jenkins\jenkins-...>

Stack Trace:
junit.framework.ComparisonFailure: expected:<...nches/my-test-branch[] F:\jenkins\jenkins-...> but was:<...nches/my-test-branch[@] F:\jenkins\jenkins-...>
	at org.apache.maven.scm.provider.svn.svnexe.command.update.SvnUpdateCommandTest.testCommandLine(SvnUpdateCommandTest.java:198)
	at org.apache.maven.scm.provider.svn.svnexe.command.update.SvnUpdateCommandTest.testCommandLine(SvnUpdateCommandTest.java:190)
	at org.apache.maven.scm.provider.svn.svnexe.command.update.SvnUpdateCommandTest.testCommandLineWithNonDeterminantBase(SvnUpdateCommandTest.java:147)


FAILED:  org.apache.maven.scm.provider.svn.svnexe.command.update.SvnUpdateCommandTest.testCommandLineWithRelativeURLTag

Error Message:
expected:<...nches/my-test-branch[] F:\jenkins\jenkins-...> but was:<...nches/my-test-branch[@] F:\jenkins\jenkins-...>

Stack Trace:
junit.framework.ComparisonFailure: expected:<...nches/my-test-branch[] F:\jenkins\jenkins-...> but was:<...nches/my-test-branch[@] F:\jenkins\jenkins-...>
	at org.apache.maven.scm.provider.svn.svnexe.command.update.SvnUpdateCommandTest.testCommandLine(SvnUpdateCommandTest.java:198)
	at org.apache.maven.scm.provider.svn.svnexe.command.update.SvnUpdateCommandTest.testCommandLine(SvnUpdateCommandTest.java:190)
	at org.apache.maven.scm.provider.svn.svnexe.command.update.SvnUpdateCommandTest.testCommandLineWithRelativeURLTag(SvnUpdateCommandTest.java:130)


FAILED:  org.apache.maven.scm.provider.svn.svnexe.command.update.SvnUpdateCommandTest.testCommandLineWithBranchSameAsBase

Error Message:
expected:<....com/svn/tags/my-tag[] F:\jenkins\jenkins-...> but was:<....com/svn/tags/my-tag[@] F:\jenkins\jenkins-...>

Stack Trace:
junit.framework.ComparisonFailure: expected:<....com/svn/tags/my-tag[] F:\jenkins\jenkins-...> but was:<....com/svn/tags/my-tag[@] F:\jenkins\jenkins-...>
	at org.apache.maven.scm.provider.svn.svnexe.command.update.SvnUpdateCommandTest.testCommandLine(SvnUpdateCommandTest.java:198)
	at org.apache.maven.scm.provider.svn.svnexe.command.update.SvnUpdateCommandTest.testCommandLine(SvnUpdateCommandTest.java:190)
	at org.apache.maven.scm.provider.svn.svnexe.command.update.SvnUpdateCommandTest.testCommandLineWithBranchSameAsBase(SvnUpdateCommandTest.java:163)


FAILED:  org.apache.maven.scm.provider.svn.svnexe.command.update.SvnUpdateCommandTest.testCommandLineWithAbsoluteURLTag

Error Message:
expected:<...nches/my-test-branch[] F:\jenkins\jenkins-...> but was:<...nches/my-test-branch[@] F:\jenkins\jenkins-...>

Stack Trace:
junit.framework.ComparisonFailure: expected:<...nches/my-test-branch[] F:\jenkins\jenkins-...> but was:<...nches/my-test-branch[@] F:\jenkins\jenkins-...>
	at org.apache.maven.scm.provider.svn.svnexe.command.update.SvnUpdateCommandTest.testCommandLine(SvnUpdateCommandTest.java:198)
	at org.apache.maven.scm.provider.svn.svnexe.command.update.SvnUpdateCommandTest.testCommandLine(SvnUpdateCommandTest.java:190)
	at org.apache.maven.scm.provider.svn.svnexe.command.update.SvnUpdateCommandTest.testCommandLineWithAbsoluteURLTag(SvnUpdateCommandTest.java:138)


FAILED:  org.apache.maven.scm.provider.svn.svnexe.command.update.SvnUpdateCommandTest.testCommandLineWithNonDeterminantBaseTrailingSlash

Error Message:
expected:<...nches/my-test-branch[] F:\jenkins\jenkins-...> but was:<...nches/my-test-branch[@] F:\jenkins\jenkins-...>

Stack Trace:
junit.framework.ComparisonFailure: expected:<...nches/my-test-branch[] F:\jenkins\jenkins-...> but was:<...nches/my-test-branch[@] F:\jenkins\jenkins-...>
	at org.apache.maven.scm.provider.svn.svnexe.command.update.SvnUpdateCommandTest.testCommandLine(SvnUpdateCommandTest.java:198)
	at org.apache.maven.scm.provider.svn.svnexe.command.update.SvnUpdateCommandTest.testCommandLine(SvnUpdateCommandTest.java:190)
	at org.apache.maven.scm.provider.svn.svnexe.command.update.SvnUpdateCommandTest.testCommandLineWithNonDeterminantBaseTrailingSlash(SvnUpdateCommandTest.java:155)




Build log:
[...truncated 8.13 MB...]
[linux-jdk8] [withMaven] junitPublisher - Archive test results for Maven artifact org.apache.maven.scm:maven-scm-provider-cvsexe:1.11.1-SNAPSHOT generated by maven-surefire-plugin:test (default-test): m/maven-scm-providers/maven-scm-providers-cvs/maven-scm-provider-cvsexe/target/surefire-reports/*.xml
[linux-jdk8] Recording test results
[linux-jdk8] [withMaven] junitPublisher - Archive test results for Maven artifact org.apache.maven.scm:maven-scm-provider-cvsjava:1.11.1-SNAPSHOT generated by maven-surefire-plugin:test (default-test): m/maven-scm-providers/maven-scm-providers-cvs/maven-scm-provider-cvsjava/target/surefire-reports/*.xml
[linux-jdk8] Recording test results
[linux-jdk8] [withMaven] junitPublisher - Archive test results for Maven artifact org.apache.maven.scm:maven-scm-provider-hg:1.11.1-SNAPSHOT generated by maven-surefire-plugin:test (default-test): m/maven-scm-providers/maven-scm-provider-hg/target/surefire-reports/*.xml
[linux-jdk8] Recording test results
[linux-jdk8] [withMaven] junitPublisher - Archive test results for Maven artifact org.apache.maven.scm:maven-scm-provider-git-commons:1.11.1-SNAPSHOT generated by maven-surefire-plugin:test (default-test): m/maven-scm-providers/maven-scm-providers-git/maven-scm-provider-git-commons/target/surefire-reports/*.xml
[linux-jdk8] Recording test results
[linux-jdk8] [withMaven] junitPublisher - Archive test results for Maven artifact org.apache.maven.scm:maven-scm-provider-gittest:1.11.1-SNAPSHOT generated by maven-surefire-plugin:test (default-test): m/maven-scm-providers/maven-scm-providers-git/maven-scm-provider-gittest/target/surefire-reports/*.xml
[linux-jdk8] Recording test results
[linux-jdk8] None of the test reports contained any result
[linux-jdk8] [withMaven] junitPublisher - Archive test results for Maven artifact org.apache.maven.scm:maven-scm-provider-gitexe:1.11.1-SNAPSHOT generated by maven-surefire-plugin:test (default-test): m/maven-scm-providers/maven-scm-providers-git/maven-scm-provider-gitexe/target/surefire-reports/*.xml
[linux-jdk8] Recording test results
[linux-jdk8] [withMaven] junitPublisher - Archive test results for Maven artifact org.apache.maven.scm:maven-scm-provider-jgit:1.11.1-SNAPSHOT generated by maven-surefire-plugin:test (default-test): m/maven-scm-providers/maven-scm-providers-git/maven-scm-provider-jgit/target/surefire-reports/*.xml
[linux-jdk8] Recording test results
[linux-jdk8] [withMaven] junitPublisher - Archive test results for Maven artifact org.apache.maven.scm:maven-scm-provider-local:1.11.1-SNAPSHOT generated by maven-surefire-plugin:test (default-test): m/maven-scm-providers/maven-scm-provider-local/target/surefire-reports/*.xml
[linux-jdk8] Recording test results
[linux-jdk8] [withMaven] junitPublisher - Archive test results for Maven artifact org.apache.maven.scm:maven-scm-provider-perforce:1.11.1-SNAPSHOT generated by maven-surefire-plugin:test (default-test): m/maven-scm-providers/maven-scm-provider-perforce/target/surefire-reports/*.xml
[linux-jdk8] Recording test results
[linux-jdk8] [withMaven] junitPublisher - Archive test results for Maven artifact org.apache.maven.scm:maven-scm-provider-starteam:1.11.1-SNAPSHOT generated by maven-surefire-plugin:test (default-test): m/maven-scm-providers/maven-scm-provider-starteam/target/surefire-reports/*.xml
[linux-jdk8] Recording test results
[linux-jdk8] [withMaven] junitPublisher - Archive test results for Maven artifact org.apache.maven.scm:maven-scm-provider-svn-commons:1.11.1-SNAPSHOT generated by maven-surefire-plugin:test (default-test): m/maven-scm-providers/maven-scm-providers-svn/maven-scm-provider-svn-commons/target/surefire-reports/*.xml
[linux-jdk8] Recording test results
[linux-jdk8] [withMaven] junitPublisher - Archive test results for Maven artifact org.apache.maven.scm:maven-scm-provider-svntest:1.11.1-SNAPSHOT generated by maven-surefire-plugin:test (default-test): m/maven-scm-providers/maven-scm-providers-svn/maven-scm-provider-svntest/target/surefire-reports/*.xml
[linux-jdk8] Recording test results
[linux-jdk8] None of the test reports contained any result
[linux-jdk8] [withMaven] junitPublisher - Archive test results for Maven artifact org.apache.maven.scm:maven-scm-provider-svnexe:1.11.1-SNAPSHOT generated by maven-surefire-plugin:test (default-test): m/maven-scm-providers/maven-scm-providers-svn/maven-scm-provider-svnexe/target/surefire-reports/*.xml
[linux-jdk8] Recording test results
[linux-jdk8] [withMaven] junitPublisher - Archive test results for Maven artifact org.apache.maven.scm:maven-scm-provider-synergy:1.11.1-SNAPSHOT generated by maven-surefire-plugin:test (default-test): m/maven-scm-providers/maven-scm-provider-synergy/target/surefire-reports/*.xml
[linux-jdk8] Recording test results
[linux-jdk8] [withMaven] junitPublisher - Archive test results for Maven artifact org.apache.maven.scm:maven-scm-provider-vss:1.11.1-SNAPSHOT generated by maven-surefire-plugin:test (default-test): m/maven-scm-providers/maven-scm-provider-vss/target/surefire-reports/*.xml
[linux-jdk8] Recording test results
[linux-jdk8] [withMaven] junitPublisher - Archive test results for Maven artifact org.apache.maven.scm:maven-scm-provider-tfs:1.11.1-SNAPSHOT generated by maven-surefire-plugin:test (default-test): m/maven-scm-providers/maven-scm-provider-tfs/target/surefire-reports/*.xml
[linux-jdk8] Recording test results
[linux-jdk8] [withMaven] junitPublisher - Archive test results for Maven artifact org.apache.maven.scm:maven-scm-provider-integrity:1.11.1-SNAPSHOT generated by maven-surefire-plugin:test (default-test): m/maven-scm-providers/maven-scm-provider-integrity/target/surefire-reports/*.xml
[linux-jdk8] Recording test results
[linux-jdk8] [withMaven] junitPublisher - Archive test results for Maven artifact org.apache.maven.scm:maven-scm-provider-jazz:1.11.1-SNAPSHOT generated by maven-surefire-plugin:test (default-test): m/maven-scm-providers/maven-scm-provider-jazz/target/surefire-reports/*.xml
[linux-jdk8] Recording test results
[linux-jdk8] [withMaven] junitPublisher - Archive test results for Maven artifact org.apache.maven.scm:maven-scm-client:1.11.1-SNAPSHOT generated by maven-surefire-plugin:test (default-test): m/maven-scm-client/target/surefire-reports/*.xml
[linux-jdk8] Recording test results
[linux-jdk8] None of the test reports contained any result
[linux-jdk8] [withMaven] junitPublisher - Archive test results for Maven artifact org.apache.maven.plugins:maven-scm-plugin:1.11.1-SNAPSHOT generated by maven-surefire-plugin:test (default-test): m/maven-scm-plugin/target/surefire-reports/*.xml
[linux-jdk8] Recording test results
[Pipeline] [linux-jdk9] // withMaven
[Pipeline] [linux-jdk7] // withMaven
[Pipeline] [linux-jdk10] // withMaven
[Pipeline] [windows-jdk7] // withMaven
[Pipeline] [linux-jdk8] // withMaven
[Pipeline] [linux-jdk9] cleanWs
[Pipeline] [linux-jdk7] cleanWs
[Pipeline] [linux-jdk10] cleanWs
[Pipeline] [windows-jdk7] cleanWs
[Pipeline] [windows-jdk10] }
[Pipeline] [linux-jdk8] cleanWs
[Pipeline] [windows-jdk8] }
[Pipeline] [windows-jdk9] }
[Pipeline] [windows-jdk10] // stage
[Pipeline] [windows-jdk8] // dir
[Pipeline] [windows-jdk9] // dir
[linux-jdk9] [WS-CLEANUP] Deleting project workspace...[WS-CLEANUP] done
[linux-jdk7] [WS-CLEANUP] Deleting project workspace...[WS-CLEANUP] done
[linux-jdk10] [WS-CLEANUP] Deleting project workspace...[WS-CLEANUP] done
[windows-jdk7] [WS-CLEANUP] Deleting project workspace...[WS-CLEANUP] done
[linux-jdk8] [WS-CLEANUP] Deleting project workspace...[WS-CLEANUP] done
[Pipeline] [windows-jdk10] }
[Pipeline] [windows-jdk8] }
[windows-jdk8] [withMaven] invokerPublisher - Archive invoker results for Maven artifact MavenArtifact{org.apache.maven.plugins:maven-scm-plugin::1.11.1-SNAPSHOT(version: 1.11.1-SNAPSHOT, snapshot:false) } generated by PluginInvocation{org.apache.maven.plugins:maven-invoker-plugin:3.1.0@run  integration-test}: m\maven-scm-plugin\target\invoker-reports\*.xml
[windows-jdk8] performing MavenInvokerRecorder, reportsFilenamePattern:'**/m\maven-scm-plugin\target\invoker-reports/BUILD*.xml', invokerBuildDir:'**/m\maven-scm-plugin\target\it'
[windows-jdk8] Found reports:[]
[windows-jdk8] Found logs:[]
[windows-jdk8] Finished parsing Maven Invoker results (found 0)
[windows-jdk8] [withMaven] junitPublisher - Archive test results for Maven artifact org.apache.maven.scm:maven-scm-api:1.11.1-SNAPSHOT generated by maven-surefire-plugin:test (default-test): m\maven-scm-api\target\surefire-reports\*.xml
[windows-jdk8] Recording test results
[windows-jdk8] [withMaven] junitPublisher - Archive test results for Maven artifact org.apache.maven.scm:maven-scm-manager-plexus:1.11.1-SNAPSHOT generated by maven-surefire-plugin:test (default-test): m\maven-scm-managers\maven-scm-manager-plexus\target\surefire-reports\*.xml
[windows-jdk8] Recording test results
[windows-jdk8] None of the test reports contained any result
[windows-jdk8] [withMaven] junitPublisher - Archive test results for Maven artifact org.apache.maven.scm:maven-scm-test:1.11.1-SNAPSHOT generated by maven-surefire-plugin:test (default-test): m\maven-scm-test\target\surefire-reports\*.xml
[windows-jdk8] Recording test results
[windows-jdk8] [withMaven] junitPublisher - Archive test results for Maven artifact org.apache.maven.scm:maven-scm-provider-accurev:1.11.1-SNAPSHOT generated by maven-surefire-plugin:test (default-test): m\maven-scm-providers\maven-scm-provider-accurev\target\surefire-reports\*.xml
[windows-jdk8] Recording test results
[windows-jdk8] [withMaven] junitPublisher - Archive test results for Maven artifact org.apache.maven.scm:maven-scm-provider-bazaar:1.11.1-SNAPSHOT generated by maven-surefire-plugin:test (default-test): m\maven-scm-providers\maven-scm-provider-bazaar\target\surefire-reports\*.xml
[windows-jdk8] Recording test results
[windows-jdk8] [withMaven] junitPublisher - Archive test results for Maven artifact org.apache.maven.scm:maven-scm-provider-clearcase:1.11.1-SNAPSHOT generated by maven-surefire-plugin:test (default-test): m\maven-scm-providers\maven-scm-provider-clearcase\target\surefire-reports\*.xml
[windows-jdk8] Recording test results
[windows-jdk8] [withMaven] junitPublisher - Archive test results for Maven artifact org.apache.maven.scm:maven-scm-provider-cvstest:1.11.1-SNAPSHOT generated by maven-surefire-plugin:test (default-test): m\maven-scm-providers\maven-scm-providers-cvs\maven-scm-provider-cvstest\target\surefire-reports\*.xml
[windows-jdk8] Recording test results
[windows-jdk8] None of the test reports contained any result
[windows-jdk8] [withMaven] junitPublisher - Archive test results for Maven artifact org.apache.maven.scm:maven-scm-provider-cvs-commons:1.11.1-SNAPSHOT generated by maven-surefire-plugin:test (default-test): m\maven-scm-providers\maven-scm-providers-cvs\maven-scm-provider-cvs-commons\target\surefire-reports\*.xml
[windows-jdk8] Recording test results
[windows-jdk8] [withMaven] junitPublisher - Archive test results for Maven artifact org.apache.maven.scm:maven-scm-provider-cvsexe:1.11.1-SNAPSHOT generated by maven-surefire-plugin:test (default-test): m\maven-scm-providers\maven-scm-providers-cvs\maven-scm-provider-cvsexe\target\surefire-reports\*.xml
[windows-jdk8] Recording test results
[windows-jdk8] [withMaven] junitPublisher - Archive test results for Maven artifact org.apache.maven.scm:maven-scm-provider-cvsjava:1.11.1-SNAPSHOT generated by maven-surefire-plugin:test (default-test): m\maven-scm-providers\maven-scm-providers-cvs\maven-scm-provider-cvsjava\target\surefire-reports\*.xml
[windows-jdk8] Recording test results
[windows-jdk8] [withMaven] junitPublisher - Archive test results for Maven artifact org.apache.maven.scm:maven-scm-provider-hg:1.11.1-SNAPSHOT generated by maven-surefire-plugin:test (default-test): m\maven-scm-providers\maven-scm-provider-hg\target\surefire-reports\*.xml
[windows-jdk8] Recording test results
[windows-jdk8] [withMaven] junitPublisher - Archive test results for Maven artifact org.apache.maven.scm:maven-scm-provider-git-commons:1.11.1-SNAPSHOT generated by maven-surefire-plugin:test (default-test): m\maven-scm-providers\maven-scm-providers-git\maven-scm-provider-git-commons\target\surefire-reports\*.xml
[windows-jdk8] Recording test results
[windows-jdk8] [withMaven] junitPublisher - Archive test results for Maven artifact org.apache.maven.scm:maven-scm-provider-gittest:1.11.1-SNAPSHOT generated by maven-surefire-plugin:test (default-test): m\maven-scm-providers\maven-scm-providers-git\maven-scm-provider-gittest\target\surefire-reports\*.xml
[windows-jdk8] Recording test results
[windows-jdk8] None of the test reports contained any result
[windows-jdk8] [withMaven] junitPublisher - Archive test results for Maven artifact org.apache.maven.scm:maven-scm-provider-gitexe:1.11.1-SNAPSHOT generated by maven-surefire-plugin:test (default-test): m\maven-scm-providers\maven-scm-providers-git\maven-scm-provider-gitexe\target\surefire-reports\*.xml
[windows-jdk8] Recording test results
[windows-jdk8] [withMaven] junitPublisher - Archive test results for Maven artifact org.apache.maven.scm:maven-scm-provider-jgit:1.11.1-SNAPSHOT generated by maven-surefire-plugin:test (default-test): m\maven-scm-providers\maven-scm-providers-git\maven-scm-provider-jgit\target\surefire-reports\*.xml
[windows-jdk8] Recording test results
[windows-jdk8] [withMaven] junitPublisher - Archive test results for Maven artifact org.apache.maven.scm:maven-scm-provider-local:1.11.1-SNAPSHOT generated by maven-surefire-plugin:test (default-test): m\maven-scm-providers\maven-scm-provider-local\target\surefire-reports\*.xml
[windows-jdk8] Recording test results
[windows-jdk8] [withMaven] junitPublisher - Archive test results for Maven artifact org.apache.maven.scm:maven-scm-provider-perforce:1.11.1-SNAPSHOT generated by maven-surefire-plugin:test (default-test): m\maven-scm-providers\maven-scm-provider-perforce\target\surefire-reports\*.xml
[windows-jdk8] Recording test results
[windows-jdk8] [withMaven] junitPublisher - Archive test results for Maven artifact org.apache.maven.scm:maven-scm-provider-starteam:1.11.1-SNAPSHOT generated by maven-surefire-plugin:test (default-test): m\maven-scm-providers\maven-scm-provider-starteam\target\surefire-reports\*.xml
[windows-jdk8] Recording test results
[windows-jdk8] [withMaven] junitPublisher - Archive test results for Maven artifact org.apache.maven.scm:maven-scm-provider-svn-commons:1.11.1-SNAPSHOT generated by maven-surefire-plugin:test (default-test): m\maven-scm-providers\maven-scm-providers-svn\maven-scm-provider-svn-commons\target\surefire-reports\*.xml
[windows-jdk8] Recording test results
[windows-jdk8] [withMaven] junitPublisher - Archive test results for Maven artifact org.apache.maven.scm:maven-scm-provider-svntest:1.11.1-SNAPSHOT generated by maven-surefire-plugin:test (default-test): m\maven-scm-providers\maven-scm-providers-svn\maven-scm-provider-svntest\target\surefire-reports\*.xml
[windows-jdk8] Recording test results
[windows-jdk8] None of the test reports contained any result
[windows-jdk8] [withMaven] junitPublisher - Archive test results for Maven artifact org.apache.maven.scm:maven-scm-provider-svnexe:1.11.1-SNAPSHOT generated by maven-surefire-plugin:test (default-test): m\maven-scm-providers\maven-scm-providers-svn\maven-scm-provider-svnexe\target\surefire-reports\*.xml
[windows-jdk8] Recording test results
[windows-jdk8] [withMaven] junitPublisher - Archive test results for Maven artifact org.apache.maven.scm:maven-scm-provider-synergy:1.11.1-SNAPSHOT generated by maven-surefire-plugin:test (default-test): m\maven-scm-providers\maven-scm-provider-synergy\target\surefire-reports\*.xml
[windows-jdk8] Recording test results
[windows-jdk8] [withMaven] junitPublisher - Archive test results for Maven artifact org.apache.maven.scm:maven-scm-provider-vss:1.11.1-SNAPSHOT generated by maven-surefire-plugin:test (default-test): m\maven-scm-providers\maven-scm-provider-vss\target\surefire-reports\*.xml
[windows-jdk8] Recording test results
[windows-jdk8] [withMaven] junitPublisher - Archive test results for Maven artifact org.apache.maven.scm:maven-scm-provider-tfs:1.11.1-SNAPSHOT generated by maven-surefire-plugin:test (default-test): m\maven-scm-providers\maven-scm-provider-tfs\target\surefire-reports\*.xml
[windows-jdk8] Recording test results
[windows-jdk8] [withMaven] junitPublisher - Archive test results for Maven artifact org.apache.maven.scm:maven-scm-provider-integrity:1.11.1-SNAPSHOT generated by maven-surefire-plugin:test (default-test): m\maven-scm-providers\maven-scm-provider-integrity\target\surefire-reports\*.xml
[windows-jdk8] Recording test results
[windows-jdk8] [withMaven] junitPublisher - Archive test results for Maven artifact org.apache.maven.scm:maven-scm-provider-jazz:1.11.1-SNAPSHOT generated by maven-surefire-plugin:test (default-test): m\maven-scm-providers\maven-scm-provider-jazz\target\surefire-reports\*.xml
[windows-jdk8] Recording test results
[windows-jdk8] [withMaven] junitPublisher - Archive test results for Maven artifact org.apache.maven.scm:maven-scm-client:1.11.1-SNAPSHOT generated by maven-surefire-plugin:test (default-test): m\maven-scm-client\target\surefire-reports\*.xml
[windows-jdk8] Recording test results
[windows-jdk8] None of the test reports contained any result
[windows-jdk8] [withMaven] junitPublisher - Archive test results for Maven artifact org.apache.maven.plugins:maven-scm-plugin:1.11.1-SNAPSHOT generated by maven-surefire-plugin:test (default-test): m\maven-scm-plugin\target\surefire-reports\*.xml
[windows-jdk8] Recording test results
[Pipeline] [windows-jdk9] }
[windows-jdk9] [withMaven] invokerPublisher - Archive invoker results for Maven artifact MavenArtifact{org.apache.maven.plugins:maven-scm-plugin::1.11.1-SNAPSHOT(version: 1.11.1-SNAPSHOT, snapshot:false) } generated by PluginInvocation{org.apache.maven.plugins:maven-invoker-plugin:3.1.0@run  integration-test}: m\maven-scm-plugin\target\invoker-reports\*.xml
[windows-jdk9] performing MavenInvokerRecorder, reportsFilenamePattern:'**/m\maven-scm-plugin\target\invoker-reports/BUILD*.xml', invokerBuildDir:'**/m\maven-scm-plugin\target\it'
[windows-jdk9] Found reports:[]
[windows-jdk9] Found logs:[]
[windows-jdk9] Finished parsing Maven Invoker results (found 0)
[windows-jdk9] [withMaven] junitPublisher - Archive test results for Maven artifact org.apache.maven.scm:maven-scm-api:1.11.1-SNAPSHOT generated by maven-surefire-plugin:test (default-test): m\maven-scm-api\target\surefire-reports\*.xml
[windows-jdk9] Recording test results
[windows-jdk9] [withMaven] junitPublisher - Archive test results for Maven artifact org.apache.maven.scm:maven-scm-manager-plexus:1.11.1-SNAPSHOT generated by maven-surefire-plugin:test (default-test): m\maven-scm-managers\maven-scm-manager-plexus\target\surefire-reports\*.xml
[windows-jdk9] Recording test results
[windows-jdk9] None of the test reports contained any result
[windows-jdk9] [withMaven] junitPublisher - Archive test results for Maven artifact org.apache.maven.scm:maven-scm-test:1.11.1-SNAPSHOT generated by maven-surefire-plugin:test (default-test): m\maven-scm-test\target\surefire-reports\*.xml
[windows-jdk9] Recording test results
[windows-jdk9] [withMaven] junitPublisher - Archive test results for Maven artifact org.apache.maven.scm:maven-scm-provider-accurev:1.11.1-SNAPSHOT generated by maven-surefire-plugin:test (default-test): m\maven-scm-providers\maven-scm-provider-accurev\target\surefire-reports\*.xml
[windows-jdk9] Recording test results
[windows-jdk9] [withMaven] junitPublisher - Archive test results for Maven artifact org.apache.maven.scm:maven-scm-provider-bazaar:1.11.1-SNAPSHOT generated by maven-surefire-plugin:test (default-test): m\maven-scm-providers\maven-scm-provider-bazaar\target\surefire-reports\*.xml
[windows-jdk9] Recording test results
[windows-jdk9] [withMaven] junitPublisher - Archive test results for Maven artifact org.apache.maven.scm:maven-scm-provider-clearcase:1.11.1-SNAPSHOT generated by maven-surefire-plugin:test (default-test): m\maven-scm-providers\maven-scm-provider-clearcase\target\surefire-reports\*.xml
[windows-jdk9] Recording test results
[windows-jdk9] [withMaven] junitPublisher - Archive test results for Maven artifact org.apache.maven.scm:maven-scm-provider-cvstest:1.11.1-SNAPSHOT generated by maven-surefire-plugin:test (default-test): m\maven-scm-providers\maven-scm-providers-cvs\maven-scm-provider-cvstest\target\surefire-reports\*.xml
[windows-jdk9] Recording test results
[windows-jdk9] None of the test reports contained any result
[windows-jdk9] [withMaven] junitPublisher - Archive test results for Maven artifact org.apache.maven.scm:maven-scm-provider-cvs-commons:1.11.1-SNAPSHOT generated by maven-surefire-plugin:test (default-test): m\maven-scm-providers\maven-scm-providers-cvs\maven-scm-provider-cvs-commons\target\surefire-reports\*.xml
[windows-jdk9] Recording test results
[windows-jdk9] [withMaven] junitPublisher - Archive test results for Maven artifact org.apache.maven.scm:maven-scm-provider-cvsexe:1.11.1-SNAPSHOT generated by maven-surefire-plugin:test (default-test): m\maven-scm-providers\maven-scm-providers-cvs\maven-scm-provider-cvsexe\target\surefire-reports\*.xml
[windows-jdk9] Recording test results
[windows-jdk9] [withMaven] junitPublisher - Archive test results for Maven artifact org.apache.maven.scm:maven-scm-provider-cvsjava:1.11.1-SNAPSHOT generated by maven-surefire-plugin:test (default-test): m\maven-scm-providers\maven-scm-providers-cvs\maven-scm-provider-cvsjava\target\surefire-reports\*.xml
[windows-jdk9] Recording test results
[windows-jdk9] [withMaven] junitPublisher - Archive test results for Maven artifact org.apache.maven.scm:maven-scm-provider-hg:1.11.1-SNAPSHOT generated by maven-surefire-plugin:test (default-test): m\maven-scm-providers\maven-scm-provider-hg\target\surefire-reports\*.xml
[windows-jdk9] Recording test results
[windows-jdk9] [withMaven] junitPublisher - Archive test results for Maven artifact org.apache.maven.scm:maven-scm-provider-git-commons:1.11.1-SNAPSHOT generated by maven-surefire-plugin:test (default-test): m\maven-scm-providers\maven-scm-providers-git\maven-scm-provider-git-commons\target\surefire-reports\*.xml
[windows-jdk9] Recording test results
[windows-jdk9] [withMaven] junitPublisher - Archive test results for Maven artifact org.apache.maven.scm:maven-scm-provider-gittest:1.11.1-SNAPSHOT generated by maven-surefire-plugin:test (default-test): m\maven-scm-providers\maven-scm-providers-git\maven-scm-provider-gittest\target\surefire-reports\*.xml
[windows-jdk9] Recording test results
[windows-jdk9] None of the test reports contained any result
[windows-jdk9] [withMaven] junitPublisher - Archive test results for Maven artifact org.apache.maven.scm:maven-scm-provider-gitexe:1.11.1-SNAPSHOT generated by maven-surefire-plugin:test (default-test): m\maven-scm-providers\maven-scm-providers-git\maven-scm-provider-gitexe\target\surefire-reports\*.xml
[windows-jdk9] Recording test results
[windows-jdk9] [withMaven] junitPublisher - Archive test results for Maven artifact org.apache.maven.scm:maven-scm-provider-jgit:1.11.1-SNAPSHOT generated by maven-surefire-plugin:test (default-test): m\maven-scm-providers\maven-scm-providers-git\maven-scm-provider-jgit\target\surefire-reports\*.xml
[windows-jdk9] Recording test results
[windows-jdk9] [withMaven] junitPublisher - Archive test results for Maven artifact org.apache.maven.scm:maven-scm-provider-local:1.11.1-SNAPSHOT generated by maven-surefire-plugin:test (default-test): m\maven-scm-providers\maven-scm-provider-local\target\surefire-reports\*.xml
[windows-jdk9] Recording test results
[windows-jdk9] [withMaven] junitPublisher - Archive test results for Maven artifact org.apache.maven.scm:maven-scm-provider-perforce:1.11.1-SNAPSHOT generated by maven-surefire-plugin:test (default-test): m\maven-scm-providers\maven-scm-provider-perforce\target\surefire-reports\*.xml
[windows-jdk9] Recording test results
[windows-jdk9] [withMaven] junitPublisher - Archive test results for Maven artifact org.apache.maven.scm:maven-scm-provider-starteam:1.11.1-SNAPSHOT generated by maven-surefire-plugin:test (default-test): m\maven-scm-providers\maven-scm-provider-starteam\target\surefire-reports\*.xml
[windows-jdk9] Recording test results
[windows-jdk9] [withMaven] junitPublisher - Archive test results for Maven artifact org.apache.maven.scm:maven-scm-provider-svn-commons:1.11.1-SNAPSHOT generated by maven-surefire-plugin:test (default-test): m\maven-scm-providers\maven-scm-providers-svn\maven-scm-provider-svn-commons\target\surefire-reports\*.xml
[windows-jdk9] Recording test results
[windows-jdk9] [withMaven] junitPublisher - Archive test results for Maven artifact org.apache.maven.scm:maven-scm-provider-svntest:1.11.1-SNAPSHOT generated by maven-surefire-plugin:test (default-test): m\maven-scm-providers\maven-scm-providers-svn\maven-scm-provider-svntest\target\surefire-reports\*.xml
[windows-jdk9] Recording test results
[windows-jdk9] None of the test reports contained any result
[windows-jdk9] [withMaven] junitPublisher - Archive test results for Maven artifact org.apache.maven.scm:maven-scm-provider-svnexe:1.11.1-SNAPSHOT generated by maven-surefire-plugin:test (default-test): m\maven-scm-providers\maven-scm-providers-svn\maven-scm-provider-svnexe\target\surefire-reports\*.xml
[windows-jdk9] Recording test results
[windows-jdk9] [withMaven] junitPublisher - Archive test results for Maven artifact org.apache.maven.scm:maven-scm-provider-synergy:1.11.1-SNAPSHOT generated by maven-surefire-plugin:test (default-test): m\maven-scm-providers\maven-scm-provider-synergy\target\surefire-reports\*.xml
[windows-jdk9] Recording test results
[windows-jdk9] [withMaven] junitPublisher - Archive test results for Maven artifact org.apache.maven.scm:maven-scm-provider-vss:1.11.1-SNAPSHOT generated by maven-surefire-plugin:test (default-test): m\maven-scm-providers\maven-scm-provider-vss\target\surefire-reports\*.xml
[windows-jdk9] Recording test results
[windows-jdk9] [withMaven] junitPublisher - Archive test results for Maven artifact org.apache.maven.scm:maven-scm-provider-tfs:1.11.1-SNAPSHOT generated by maven-surefire-plugin:test (default-test): m\maven-scm-providers\maven-scm-provider-tfs\target\surefire-reports\*.xml
[windows-jdk9] Recording test results
[windows-jdk9] [withMaven] junitPublisher - Archive test results for Maven artifact org.apache.maven.scm:maven-scm-provider-integrity:1.11.1-SNAPSHOT generated by maven-surefire-plugin:test (default-test): m\maven-scm-providers\maven-scm-provider-integrity\target\surefire-reports\*.xml
[windows-jdk9] Recording test results
[windows-jdk9] [withMaven] junitPublisher - Archive test results for Maven artifact org.apache.maven.scm:maven-scm-provider-jazz:1.11.1-SNAPSHOT generated by maven-surefire-plugin:test (default-test): m\maven-scm-providers\maven-scm-provider-jazz\target\surefire-reports\*.xml
[windows-jdk9] Recording test results
[windows-jdk9] [withMaven] junitPublisher - Archive test results for Maven artifact org.apache.maven.scm:maven-scm-client:1.11.1-SNAPSHOT generated by maven-surefire-plugin:test (default-test): m\maven-scm-client\target\surefire-reports\*.xml
[windows-jdk9] Recording test results
[windows-jdk9] None of the test reports contained any result
[windows-jdk9] [withMaven] junitPublisher - Archive test results for Maven artifact org.apache.maven.plugins:maven-scm-plugin:1.11.1-SNAPSHOT generated by maven-surefire-plugin:test (default-test): m\maven-scm-plugin\target\surefire-reports\*.xml
[windows-jdk9] Recording test results
[Pipeline] [windows-jdk10] // node
[Pipeline] [windows-jdk8] // withMaven
[Pipeline] [windows-jdk9] // withMaven
[Pipeline] [windows-jdk10] }
[Pipeline] [linux-jdk9] }
[Pipeline] [linux-jdk7] }
[Pipeline] [linux-jdk10] }
[Pipeline] [windows-jdk7] }
[Pipeline] [linux-jdk8] }
[Pipeline] [windows-jdk8] cleanWs
[Pipeline] [windows-jdk9] cleanWs
[Pipeline] [linux-jdk9] // stage
[Pipeline] [linux-jdk7] // stage
[Pipeline] [linux-jdk10] // stage
[Pipeline] [windows-jdk7] // stage
[Pipeline] [linux-jdk8] // stage
[Pipeline] [linux-jdk7] }
[Pipeline] [linux-jdk8] }
[windows-jdk8] [WS-CLEANUP] Deleting project workspace...[WS-CLEANUP] done
[Pipeline] [linux-jdk9] }
[Pipeline] [linux-jdk10] }
[Pipeline] [windows-jdk7] }
[windows-jdk9] [WS-CLEANUP] Deleting project workspace...[WS-CLEANUP] done
[Pipeline] [linux-jdk7] // node
[Pipeline] [linux-jdk8] // node
[Pipeline] [linux-jdk9] // node
[Pipeline] [linux-jdk10] // node
[Pipeline] [windows-jdk7] // node
[Pipeline] [linux-jdk7] }
[Pipeline] [linux-jdk8] }
[Pipeline] [linux-jdk9] }
[Pipeline] [linux-jdk10] }
[Pipeline] [windows-jdk7] }
[Pipeline] [windows-jdk8] }
[Pipeline] [windows-jdk9] }
[Pipeline] [windows-jdk8] // stage
[Pipeline] [windows-jdk9] // stage
[Pipeline] [windows-jdk8] }
[Pipeline] [windows-jdk9] }
[Pipeline] [windows-jdk8] // node
[Pipeline] [windows-jdk9] // node
[Pipeline] [windows-jdk8] }
[Pipeline] [windows-jdk9] }
[Pipeline] // parallel
[Pipeline] stage
[Pipeline] { (Notifications)
[Pipeline] echo
Build result: UNSTABLE
[Pipeline] jiraIssueSelector
[Pipeline] emailext
Mime
  • Unnamed multipart/mixed (inline, None, 0 bytes)
View raw message