maven-notifications mailing list archives

Site index · List index
Message view « Date » · « Thread »
Top « Date » · « Thread »
From Apache Jenkins Server <jenk...@builds.apache.org>
Subject Build failed in Jenkins: Maven TLP » maven-compiler-plugin » plexus-java-1.0.0 #1
Date Fri, 07 Sep 2018 11:16:40 GMT
See https://builds.apache.org/job/maven-box/job/maven-compiler-plugin/job/plexus-java-1.0.0/1/

No changes.

No tests ran.

Build log:
[...truncated 1.82 MB...]
[windows-jdk7-m3.3.x_build] [INFO] Downloaded: https://repo.maven.apache.org/maven2/org/apache/maven/shared/maven-shared-utils/3.2.1/maven-shared-utils-3.2.1.jar
(163 KB at 382.7 KB/sec)
[windows-jdk7-m3.3.x_build] [INFO] Downloading: https://repo.maven.apache.org/maven2/org/apache/maven/shared/maven-shared-incremental/1.1/maven-shared-incremental-1.1.jar
[windows-jdk7-m3.3.x_build] [INFO] Downloaded: https://repo.maven.apache.org/maven2/commons-io/commons-io/2.5/commons-io-2.5.jar
(204 KB at 475.1 KB/sec)
[windows-jdk7-m3.3.x_build] [INFO] Downloading: https://repo.maven.apache.org/maven2/org/codehaus/plexus/plexus-compiler-api/2.8.4/plexus-compiler-api-2.8.4.jar
[windows-jdk7-m3.3.x_build] [INFO] Downloaded: https://repo.maven.apache.org/maven2/org/apache/maven/shared/maven-shared-incremental/1.1/maven-shared-incremental-1.1.jar
(14 KB at 26.5 KB/sec)
[windows-jdk7-m3.3.x_build] [INFO] Downloading: https://repo.maven.apache.org/maven2/org/codehaus/plexus/plexus-compiler-manager/2.8.4/plexus-compiler-manager-2.8.4.jar
[windows-jdk7-m3.3.x_build] [INFO] Downloaded: https://repo.maven.apache.org/maven2/org/sonatype/plexus/plexus-sec-dispatcher/1.3/plexus-sec-dispatcher-1.3.jar
(28 KB at 54.7 KB/sec)
[windows-jdk7-m3.3.x_build] [INFO] Downloading: https://repo.maven.apache.org/maven2/org/codehaus/plexus/plexus-compiler-javac/2.8.4/plexus-compiler-javac-2.8.4.jar
[windows-jdk7-m3.3.x_build] [INFO] Downloaded: https://repo.maven.apache.org/maven2/org/codehaus/plexus/plexus-compiler-manager/2.8.4/plexus-compiler-manager-2.8.4.jar
(5 KB at 8.8 KB/sec)
[windows-jdk7-m3.3.x_build] [INFO] Downloading: https://repo.maven.apache.org/maven2/org/apache/maven/plugin-testing/maven-plugin-testing-harness/2.1/maven-plugin-testing-harness-2.1.jar
[windows-jdk7-m3.3.x_build] [INFO] Downloaded: https://repo.maven.apache.org/maven2/org/sonatype/plexus/plexus-cipher/1.4/plexus-cipher-1.4.jar
(14 KB at 24.7 KB/sec)
[windows-jdk7-m3.3.x_build] [INFO] Downloading: https://repo.maven.apache.org/maven2/org/codehaus/plexus/plexus-archiver/2.2/plexus-archiver-2.2.jar
[windows-jdk7-m3.3.x_build] [INFO] Downloaded: https://repo.maven.apache.org/maven2/org/codehaus/plexus/plexus-archiver/2.2/plexus-archiver-2.2.jar
(181 KB at 310.4 KB/sec)
[windows-jdk7-m3.3.x_build] [INFO] Downloading: https://repo.maven.apache.org/maven2/org/codehaus/plexus/plexus-io/2.0.4/plexus-io-2.0.4.jar
[windows-jdk7-m3.3.x_build] [INFO] Downloaded: https://repo.maven.apache.org/maven2/org/codehaus/plexus/plexus-classworlds/2.2.3/plexus-classworlds-2.2.3.jar
(46 KB at 77.0 KB/sec)
[windows-jdk7-m3.3.x_build] [INFO] Downloading: https://repo.maven.apache.org/maven2/org/apache/maven/maven-compat/3.0/maven-compat-3.0.jar
[windows-jdk7-m3.3.x_build] [INFO] Downloaded: https://repo.maven.apache.org/maven2/org/codehaus/plexus/plexus-compiler-javac/2.8.4/plexus-compiler-javac-2.8.4.jar
(21 KB at 34.1 KB/sec)
[windows-jdk7-m3.3.x_build] [INFO] Downloading: https://repo.maven.apache.org/maven2/org/apache/maven/wagon/wagon-provider-api/1.0-beta-6/wagon-provider-api-1.0-beta-6.jar
[windows-jdk7-m3.3.x_build] [INFO] Downloaded: https://repo.maven.apache.org/maven2/org/codehaus/plexus/plexus-compiler-api/2.8.4/plexus-compiler-api-2.8.4.jar
(27 KB at 42.6 KB/sec)
[windows-jdk7-m3.3.x_build] [INFO] Downloading: https://repo.maven.apache.org/maven2/org/mockito/mockito-core/1.9.5/mockito-core-1.9.5.jar
[windows-jdk7-m3.3.x_build] [INFO] Downloaded: https://repo.maven.apache.org/maven2/org/apache/maven/maven-compat/3.0/maven-compat-3.0.jar
(279 KB at 440.9 KB/sec)
[windows-jdk7-m3.3.x_build] [INFO] Downloading: https://repo.maven.apache.org/maven2/org/hamcrest/hamcrest-core/1.1/hamcrest-core-1.1.jar
[windows-jdk7-m3.3.x_build] [INFO] Downloaded: https://repo.maven.apache.org/maven2/org/codehaus/plexus/plexus-io/2.0.4/plexus-io-2.0.4.jar
(57 KB at 90.2 KB/sec)
[windows-jdk7-m3.3.x_build] [INFO] Downloading: https://repo.maven.apache.org/maven2/org/objenesis/objenesis/1.0/objenesis-1.0.jar
[windows-jdk7-m3.3.x_build] [INFO] Downloaded: https://repo.maven.apache.org/maven2/org/apache/maven/wagon/wagon-provider-api/1.0-beta-6/wagon-provider-api-1.0-beta-6.jar
(52 KB at 79.7 KB/sec)
[windows-jdk7-m3.3.x_build] [INFO] Downloading: https://repo.maven.apache.org/maven2/junit/junit/4.12/junit-4.12.jar
[windows-jdk7-m3.3.x_build] [INFO] Downloaded: https://repo.maven.apache.org/maven2/org/hamcrest/hamcrest-core/1.1/hamcrest-core-1.1.jar
(75 KB at 112.4 KB/sec)
[windows-jdk7-m3.3.x_build] [INFO] Downloading: https://repo.maven.apache.org/maven2/org/codehaus/groovy/groovy-eclipse-compiler/2.7.0-01/groovy-eclipse-compiler-2.7.0-01.jar
[linux-jdk10-m3.5.x_build] [Fast Archiver] No prior successful build to compare, so performing
full copy of artifacts
[linux-jdk10-m3.5.x_build] [withMaven] openTasksPublisher - Scan Tasks for Maven artifact
org.apache.maven.plugins:maven-compiler-plugin:3.8.1-SNAPSHOT in source directory linux-jdk10-m3.5.x_build/src/main/java
[linux-jdk10-m3.5.x_build] [TASKS] Scanning folder '/home/jenkins/jenkins-slave/workspace/er-plugin_plexus-java-1.0.0-3I6TWBJVQ3OMFTSPCIESPQFZ2YP4RGQDI4CTSWCIDO4BTCM54GJA'
for files matching the pattern 'linux-jdk10-m3.5.x_build/src/main/java/**/*' - excludes: null
[linux-jdk10-m3.5.x_build] [TASKS] Found 9 files to scan for tasks
[linux-jdk10-m3.5.x_build] [TASKS] Found 6 open tasks.
[linux-jdk10-m3.5.x_build] Skipping warnings blame since pipelines do not have an SCM link.%n
[Pipeline] [linux-jdk7-m3.3.x_build] // withMaven
[Pipeline] [linux-jdk7-m3.0.x_build] // withMaven
[Pipeline] [linux-jdk7-m3.3.x_build] cleanWs
[Pipeline] [linux-jdk7-m3.0.x_build] cleanWs
[Pipeline] [windows-jdk9-m3.5.x_build] }
[Pipeline] [linux-jdk7-m3.5.x_build] // stage
[Pipeline] [windows-jdk10-m3.5.x_build] // stage
[windows-jdk7-m3.3.x_build] [INFO] Downloaded: https://repo.maven.apache.org/maven2/org/mockito/mockito-core/1.9.5/mockito-core-1.9.5.jar
(1465 KB at 2086.7 KB/sec)
[windows-jdk7-m3.3.x_build] [INFO] Downloading: https://repo.maven.apache.org/maven2/org/codehaus/plexus/plexus-container-default/1.5.4/plexus-container-default-1.5.4.jar
[windows-jdk7-m3.3.x_build] [INFO] Downloaded: https://repo.maven.apache.org/maven2/org/apache/maven/plugin-testing/maven-plugin-testing-harness/2.1/maven-plugin-testing-harness-2.1.jar
(39 KB at 53.9 KB/sec)
[windows-jdk7-m3.3.x_build] [INFO] Downloading: https://repo.maven.apache.org/maven2/org/apache/xbean/xbean-reflect/3.4/xbean-reflect-3.4.jar
[windows-jdk7-m3.3.x_build] [INFO] Downloaded: https://repo.maven.apache.org/maven2/junit/junit/4.12/junit-4.12.jar
(308 KB at 417.3 KB/sec)
[windows-jdk7-m3.3.x_build] [INFO] Downloading: https://repo.maven.apache.org/maven2/log4j/log4j/1.2.12/log4j-1.2.12.jar
[windows-jdk7-m3.3.x_build] [INFO] Downloaded: https://repo.maven.apache.org/maven2/org/codehaus/plexus/plexus-container-default/1.5.4/plexus-container-default-1.5.4.jar
(212 KB at 281.3 KB/sec)
[windows-jdk7-m3.3.x_build] [INFO] Downloading: https://repo.maven.apache.org/maven2/commons-logging/commons-logging-api/1.1/commons-logging-api-1.1.jar
[windows-jdk7-m3.3.x_build] [INFO] Downloaded: https://repo.maven.apache.org/maven2/org/apache/xbean/xbean-reflect/3.4/xbean-reflect-3.4.jar
(131 KB at 172.9 KB/sec)
[windows-jdk7-m3.3.x_build] [INFO] Downloading: https://repo.maven.apache.org/maven2/com/google/collections/google-collections/1.0/google-collections-1.0.jar
[windows-jdk7-m3.3.x_build] [INFO] Downloaded: https://repo.maven.apache.org/maven2/log4j/log4j/1.2.12/log4j-1.2.12.jar
(350 KB at 448.9 KB/sec)
[windows-jdk7-m3.3.x_build] [INFO] Downloading: https://repo.maven.apache.org/maven2/org/codehaus/groovy/groovy-eclipse-batch/2.0.4-04/groovy-eclipse-batch-2.0.4-04.jar
[windows-jdk7-m3.3.x_build] [INFO] Downloaded: https://repo.maven.apache.org/maven2/org/codehaus/groovy/groovy-eclipse-compiler/2.7.0-01/groovy-eclipse-compiler-2.7.0-01.jar
(19 KB at 22.9 KB/sec)
[windows-jdk7-m3.3.x_build] [INFO] Downloading: https://repo.maven.apache.org/maven2/org/codehaus/groovy/groovy-all/1.8.0/groovy-all-1.8.0.jar
[windows-jdk7-m3.3.x_build] [INFO] Downloaded: https://repo.maven.apache.org/maven2/com/google/collections/google-collections/1.0/google-collections-1.0.jar
(625 KB at 756.2 KB/sec)
[windows-jdk7-m3.3.x_build] [INFO] Downloading: https://repo.maven.apache.org/maven2/org/apache/openjpa/openjpa/2.4.2/openjpa-2.4.2.jar
[windows-jdk7-m3.3.x_build] [INFO] Downloaded: https://repo.maven.apache.org/maven2/commons-logging/commons-logging-api/1.1/commons-logging-api-1.1.jar
(44 KB at 41.9 KB/sec)
[windows-jdk7-m3.3.x_build] [INFO] Downloading: https://repo.maven.apache.org/maven2/commons-lang/commons-lang/2.6/commons-lang-2.6.jar
[windows-jdk7-m3.3.x_build] [INFO] Downloaded: https://repo.maven.apache.org/maven2/org/objenesis/objenesis/1.0/objenesis-1.0.jar
(28 KB at 26.6 KB/sec)
[windows-jdk7-m3.3.x_build] [INFO] Downloading: https://repo.maven.apache.org/maven2/commons-collections/commons-collections/3.2.2/commons-collections-3.2.2.jar
[windows-jdk7-m3.3.x_build] [INFO] Downloaded: https://repo.maven.apache.org/maven2/commons-lang/commons-lang/2.6/commons-lang-2.6.jar
(278 KB at 255.8 KB/sec)
[windows-jdk7-m3.3.x_build] [INFO] Downloading: https://repo.maven.apache.org/maven2/net/sourceforge/serp/serp/1.15.1/serp-1.15.1.jar
[windows-jdk7-m3.3.x_build] [INFO] Downloaded: https://repo.maven.apache.org/maven2/org/apache/openjpa/openjpa/2.4.2/openjpa-2.4.2.jar
(4387 KB at 3976.5 KB/sec)
[windows-jdk7-m3.3.x_build] [INFO] Downloading: https://repo.maven.apache.org/maven2/org/apache/geronimo/specs/geronimo-jms_1.1_spec/1.1.1/geronimo-jms_1.1_spec-1.1.1.jar
[windows-jdk7-m3.3.x_build] [INFO] Downloaded: https://repo.maven.apache.org/maven2/commons-collections/commons-collections/3.2.2/commons-collections-3.2.2.jar
(575 KB at 520.0 KB/sec)
[windows-jdk7-m3.3.x_build] [INFO] Downloading: https://repo.maven.apache.org/maven2/org/apache/geronimo/specs/geronimo-jta_1.1_spec/1.1.1/geronimo-jta_1.1_spec-1.1.1.jar
[windows-jdk7-m3.3.x_build] [INFO] Downloaded: https://repo.maven.apache.org/maven2/org/codehaus/groovy/groovy-all/1.8.0/groovy-all-1.8.0.jar
(5817 KB at 5240.3 KB/sec)
[windows-jdk7-m3.3.x_build] [INFO] Downloading: https://repo.maven.apache.org/maven2/commons-pool/commons-pool/1.6/commons-pool-1.6.jar
[windows-jdk7-m3.3.x_build] [INFO] Downloaded: https://repo.maven.apache.org/maven2/net/sourceforge/serp/serp/1.15.1/serp-1.15.1.jar
(212 KB at 186.9 KB/sec)
[windows-jdk7-m3.3.x_build] [INFO] Downloading: https://repo.maven.apache.org/maven2/org/apache/xbean/xbean-asm5-shaded/3.17/xbean-asm5-shaded-3.17.jar
[windows-jdk7-m3.3.x_build] [INFO] Downloaded: https://repo.maven.apache.org/maven2/commons-pool/commons-pool/1.6/commons-pool-1.6.jar
(109 KB at 94.0 KB/sec)
[windows-jdk7-m3.3.x_build] [INFO] Downloading: https://repo.maven.apache.org/maven2/org/apache/geronimo/specs/geronimo-jpa_2.0_spec/1.1/geronimo-jpa_2.0_spec-1.1.jar
[windows-jdk7-m3.3.x_build] [INFO] Downloaded: https://repo.maven.apache.org/maven2/org/apache/xbean/xbean-asm5-shaded/3.17/xbean-asm5-shaded-3.17.jar
(141 KB at 116.9 KB/sec)
[windows-jdk7-m3.3.x_build] [INFO] Downloaded: https://repo.maven.apache.org/maven2/org/apache/geronimo/specs/geronimo-jpa_2.0_spec/1.1/geronimo-jpa_2.0_spec-1.1.jar
(118 KB at 97.1 KB/sec)
[windows-jdk7-m3.3.x_build] [INFO] Downloaded: https://repo.maven.apache.org/maven2/org/apache/geronimo/specs/geronimo-jta_1.1_spec/1.1.1/geronimo-jta_1.1_spec-1.1.1.jar
(16 KB at 12.1 KB/sec)
[Pipeline] [linux-jdk8-m3.5.x_build] // withMaven
[windows-jdk7-m3.3.x_build] [INFO] Downloaded: https://repo.maven.apache.org/maven2/org/codehaus/groovy/groovy-eclipse-batch/2.0.4-04/groovy-eclipse-batch-2.0.4-04.jar
(12354 KB at 8736.3 KB/sec)
[windows-jdk7-m3.3.x_build] [INFO] Downloaded: https://repo.maven.apache.org/maven2/org/apache/geronimo/specs/geronimo-jms_1.1_spec/1.1.1/geronimo-jms_1.1_spec-1.1.1.jar
(32 KB at 21.5 KB/sec)
[linux-jdk7-m3.3.x_build] [WS-CLEANUP] Deleting project workspace...[WS-CLEANUP] done
[linux-jdk7-m3.0.x_build] [WS-CLEANUP] Deleting project workspace...[WS-CLEANUP] done
[Pipeline] [linux-jdk10-m3.5.x_build] // withMaven
[Pipeline] [linux-jdk7-m3.5.x_build] }
[Pipeline] [windows-jdk10-m3.5.x_build] }
[Pipeline] [linux-jdk7-m3.2.x_build] }
[Pipeline] [linux-jdk9-m3.5.x_build] }
[Pipeline] [windows-jdk8-m3.5.x_build] cleanWs
[Pipeline] [linux-jdk8-m3.5.x_build] cleanWs
[Pipeline] [linux-jdk10-m3.5.x_build] cleanWs
[Pipeline] [windows-jdk7-m3.0.x_build] }
[Pipeline] [windows-jdk7-m3.2.x_build] }
[Pipeline] [windows-jdk7-m3.5.x_build] }
[Pipeline] [windows-jdk9-m3.5.x_build] // stage
[Pipeline] [windows-jdk9-m3.5.x_build] }
[Pipeline] [linux-jdk7-m3.3.x_build] cleanWs
[Pipeline] [linux-jdk7-m3.0.x_build] cleanWs
[Pipeline] [linux-jdk7-m3.5.x_build] // node
[Pipeline] [windows-jdk10-m3.5.x_build] // node
[Pipeline] [linux-jdk7-m3.2.x_build] // stage
[Pipeline] [linux-jdk9-m3.5.x_build] // stage
[Pipeline] [windows-jdk7-m3.0.x_build] // dir
[Pipeline] [windows-jdk7-m3.2.x_build] // dir
[Pipeline] [windows-jdk7-m3.5.x_build] // dir
[windows-jdk7-m3.3.x_build] [INFO] Downloading: http://repository.apache.org/snapshots/org/codehaus/plexus/plexus-java/1.0.0-SNAPSHOT/plexus-java-1.0.0-SNAPSHOT.jar
[windows-jdk7-m3.3.x_build] [INFO] ------------------------------------------------------------------------
[windows-jdk7-m3.3.x_build] [INFO] BUILD FAILURE
[windows-jdk7-m3.3.x_build] [INFO] ------------------------------------------------------------------------
[windows-jdk7-m3.3.x_build] [INFO] Total time: 20.579 s
[windows-jdk7-m3.3.x_build] [INFO] Finished at: 2018-09-07T04:16:37-07:00
[windows-jdk7-m3.3.x_build] [INFO] Final Memory: 13M/186M
[windows-jdk7-m3.3.x_build] [INFO] ------------------------------------------------------------------------
[windows-jdk7-m3.3.x_build] [INFO] [jenkins-event-spy] Generated F:\jenkins\jenkins-slave\workspace\er-plugin_plexus-java-1.0.0-3I6TWBJVQ3OMFTSPCIESPQFZ2YP4RGQDI4CTSWCIDO4BTCM54GJA@tmp\withMaven9b7ee176\maven-spy-20180907-041616-3074861387465816893463.log
[windows-jdk7-m3.3.x_build] [ERROR] Failed to execute goal on project maven-compiler-plugin:
Could not resolve dependencies for project org.apache.maven.plugins:maven-compiler-plugin:maven-plugin:3.8.1-SNAPSHOT:
Could not find artifact org.codehaus.plexus:plexus-java:jar:1.0.0-SNAPSHOT in apache-snapshots
(http://repository.apache.org/snapshots/) -> [Help 1]
[windows-jdk7-m3.3.x_build] [ERROR] 
[windows-jdk7-m3.3.x_build] [ERROR] To see the full stack trace of the errors, re-run Maven
with the -e switch.
[windows-jdk7-m3.3.x_build] [ERROR] Re-run Maven using the -X switch to enable full debug
logging.
[windows-jdk7-m3.3.x_build] [ERROR] 
[windows-jdk7-m3.3.x_build] [ERROR] For more information about the errors and possible solutions,
please read the following articles:
[windows-jdk7-m3.3.x_build] [ERROR] [Help 1] http://cwiki.apache.org/confluence/display/MAVEN/DependencyResolutionException
[windows-jdk7-m3.3.x_build] Picked up JAVA_TOOL_OPTIONS: -Dmaven.ext.class.path="f:\jenkins\jenkins-slave\workspace\er-plugin_plexus-java-1.0.0-3I6TWBJVQ3OMFTSPCIESPQFZ2YP4RGQDI4CTSWCIDO4BTCM54GJA@tmp\withMaven9b7ee176\pipeline-maven-spy.jar"
-Dorg.jenkinsci.plugins.pipeline.maven.reportsFolder="f:\jenkins\jenkins-slave\workspace\er-plugin_plexus-java-1.0.0-3I6TWBJVQ3OMFTSPCIESPQFZ2YP4RGQDI4CTSWCIDO4BTCM54GJA@tmp\withMaven9b7ee176"

[windows-jdk8-m3.5.x_build] [WS-CLEANUP] Deleting project workspace...[WS-CLEANUP] done
[linux-jdk8-m3.5.x_build] [WS-CLEANUP] Deleting project workspace...[WS-CLEANUP] done
[linux-jdk10-m3.5.x_build] [WS-CLEANUP] Deleting project workspace...[WS-CLEANUP] done
[linux-jdk7-m3.3.x_build] [WS-CLEANUP] Deleting project workspace...[WS-CLEANUP] done
[linux-jdk7-m3.0.x_build] [WS-CLEANUP] Deleting project workspace...[WS-CLEANUP] done
[Pipeline] [linux-jdk7-m3.5.x_build] }
[linux-jdk7-m3.5.x_build] Failed in branch linux-jdk7-m3.5.x_build
[Pipeline] [windows-jdk10-m3.5.x_build] }
[windows-jdk10-m3.5.x_build] Failed in branch windows-jdk10-m3.5.x_build
[Pipeline] [linux-jdk7-m3.2.x_build] }
[Pipeline] [linux-jdk9-m3.5.x_build] }
[Pipeline] [windows-jdk7-m3.0.x_build] }
[Pipeline] [windows-jdk7-m3.2.x_build] }
[windows-jdk7-m3.2.x_build] [Fast Archiver] No prior successful build to compare, so performing
full copy of artifacts
[windows-jdk7-m3.2.x_build] [withMaven] openTasksPublisher - Scan Tasks for Maven artifact
org.apache.maven.plugins:maven-compiler-plugin:3.8.1-SNAPSHOT in source directory windows-jdk7-m3.2.x_build\src\main\java
[windows-jdk7-m3.2.x_build] [TASKS] Scanning folder 'f:\jenkins\jenkins-slave\workspace\er-plugin_plexus-java-1.0.0-3I6TWBJVQ3OMFTSPCIESPQFZ2YP4RGQDI4CTSWCIDO4BTCM54GJA@2'
for files matching the pattern 'windows-jdk7-m3.2.x_build\src\main\java\**\*' - excludes:
null
[windows-jdk7-m3.2.x_build] [TASKS] Found 9 files to scan for tasks
[windows-jdk7-m3.2.x_build] [TASKS] Found 6 open tasks.
[windows-jdk7-m3.2.x_build] Skipping warnings blame since pipelines do not have an SCM link.%n
[Pipeline] [windows-jdk7-m3.5.x_build] }
[windows-jdk7-m3.5.x_build] [Fast Archiver] No prior successful build to compare, so performing
full copy of artifacts
[windows-jdk7-m3.5.x_build] [withMaven] openTasksPublisher - Scan Tasks for Maven artifact
org.apache.maven.plugins:maven-compiler-plugin:3.8.1-SNAPSHOT in source directory windows-jdk7-m3.5.x_build\src\main\java
[windows-jdk7-m3.5.x_build] [TASKS] Scanning folder 'f:\jenkins\jenkins-slave\workspace\er-plugin_plexus-java-1.0.0-3I6TWBJVQ3OMFTSPCIESPQFZ2YP4RGQDI4CTSWCIDO4BTCM54GJA@2'
for files matching the pattern 'windows-jdk7-m3.5.x_build\src\main\java\**\*' - excludes:
null
[windows-jdk7-m3.5.x_build] [TASKS] Found 9 files to scan for tasks
[windows-jdk7-m3.5.x_build] [TASKS] Found 6 open tasks.
[windows-jdk7-m3.5.x_build] Skipping warnings blame since pipelines do not have an SCM link.%n
[Pipeline] [windows-jdk9-m3.5.x_build] // node
[Pipeline] [windows-jdk9-m3.5.x_build] }
[windows-jdk9-m3.5.x_build] Failed in branch windows-jdk9-m3.5.x_build
[Pipeline] [linux-jdk7-m3.2.x_build] // node
[Pipeline] [linux-jdk9-m3.5.x_build] // node
[Pipeline] [windows-jdk7-m3.0.x_build] // withMaven
[Pipeline] [windows-jdk7-m3.2.x_build] // withMaven
[Pipeline] [windows-jdk7-m3.5.x_build] // withMaven
[Pipeline] [linux-jdk7-m3.2.x_build] }
[linux-jdk7-m3.2.x_build] Failed in branch linux-jdk7-m3.2.x_build
[Pipeline] [linux-jdk9-m3.5.x_build] }
[linux-jdk9-m3.5.x_build] Failed in branch linux-jdk9-m3.5.x_build
[Pipeline] [windows-jdk8-m3.5.x_build] }
[Pipeline] [linux-jdk7-m3.3.x_build] }
[Pipeline] [linux-jdk7-m3.0.x_build] }
[Pipeline] [linux-jdk8-m3.5.x_build] cleanWs
[Pipeline] [linux-jdk10-m3.5.x_build] cleanWs
[Pipeline] [windows-jdk7-m3.0.x_build] cleanWs
[Pipeline] [windows-jdk7-m3.2.x_build] cleanWs
[Pipeline] [windows-jdk7-m3.5.x_build] cleanWs
[Pipeline] [windows-jdk7-m3.3.x_build] }
[Pipeline] [windows-jdk8-m3.5.x_build] // stage
[windows-jdk7-m3.0.x_build] [WS-CLEANUP] Deleting project workspace...[WS-CLEANUP] done
[windows-jdk7-m3.2.x_build] [WS-CLEANUP] Deleting project workspace...[WS-CLEANUP] done
[windows-jdk7-m3.5.x_build] [WS-CLEANUP] Deleting project workspace...[WS-CLEANUP] done
[Pipeline] [linux-jdk7-m3.3.x_build] // stage
[Pipeline] [linux-jdk7-m3.0.x_build] // stage
[Pipeline] [windows-jdk7-m3.3.x_build] // dir
[linux-jdk8-m3.5.x_build] [WS-CLEANUP] Deleting project workspace...[WS-CLEANUP] done
[linux-jdk10-m3.5.x_build] [WS-CLEANUP] Deleting project workspace...[WS-CLEANUP] done
[Pipeline] [linux-jdk7-m3.0.x_build] }
[Pipeline] [linux-jdk7-m3.3.x_build] }
[Pipeline] [windows-jdk8-m3.5.x_build] }
[Pipeline] [windows-jdk7-m3.3.x_build] }
[windows-jdk7-m3.3.x_build] [Fast Archiver] No prior successful build to compare, so performing
full copy of artifacts
[windows-jdk7-m3.3.x_build] [withMaven] openTasksPublisher - Scan Tasks for Maven artifact
org.apache.maven.plugins:maven-compiler-plugin:3.8.1-SNAPSHOT in source directory windows-jdk7-m3.3.x_build\src\main\java
[windows-jdk7-m3.3.x_build] [TASKS] Scanning folder 'f:\jenkins\jenkins-slave\workspace\er-plugin_plexus-java-1.0.0-3I6TWBJVQ3OMFTSPCIESPQFZ2YP4RGQDI4CTSWCIDO4BTCM54GJA'
for files matching the pattern 'windows-jdk7-m3.3.x_build\src\main\java\**\*' - excludes:
null
[windows-jdk7-m3.3.x_build] [TASKS] Found 9 files to scan for tasks
[windows-jdk7-m3.3.x_build] [TASKS] Found 6 open tasks.
[windows-jdk7-m3.3.x_build] Skipping warnings blame since pipelines do not have an SCM link.%n
[Pipeline] [windows-jdk7-m3.0.x_build] cleanWs
[Pipeline] [windows-jdk7-m3.2.x_build] cleanWs
[Pipeline] [windows-jdk7-m3.5.x_build] cleanWs
[Pipeline] [linux-jdk7-m3.0.x_build] // node
[Pipeline] [linux-jdk7-m3.3.x_build] // node
[windows-jdk7-m3.0.x_build] [WS-CLEANUP] Deleting project workspace...[WS-CLEANUP] done
[windows-jdk7-m3.2.x_build] [WS-CLEANUP] Deleting project workspace...[WS-CLEANUP] done
[Pipeline] [windows-jdk8-m3.5.x_build] // node
[windows-jdk7-m3.5.x_build] [WS-CLEANUP] Deleting project workspace...[WS-CLEANUP] done
[Pipeline] [windows-jdk7-m3.3.x_build] // withMaven
[Pipeline] [linux-jdk7-m3.0.x_build] }
[linux-jdk7-m3.0.x_build] Failed in branch linux-jdk7-m3.0.x_build
[Pipeline] [linux-jdk7-m3.3.x_build] }
[linux-jdk7-m3.3.x_build] Failed in branch linux-jdk7-m3.3.x_build
[Pipeline] [windows-jdk8-m3.5.x_build] }
[windows-jdk8-m3.5.x_build] Failed in branch windows-jdk8-m3.5.x_build
[Pipeline] [linux-jdk8-m3.5.x_build] }
[Pipeline] [linux-jdk10-m3.5.x_build] }
[Pipeline] [windows-jdk7-m3.3.x_build] cleanWs
[Pipeline] [windows-jdk7-m3.0.x_build] }
[Pipeline] [windows-jdk7-m3.2.x_build] }
[Pipeline] [windows-jdk7-m3.5.x_build] }
[Pipeline] [linux-jdk8-m3.5.x_build] // stage
[windows-jdk7-m3.3.x_build] [WS-CLEANUP] Deleting project workspace...[WS-CLEANUP] done
[Pipeline] [linux-jdk10-m3.5.x_build] // stage
[Pipeline] [linux-jdk8-m3.5.x_build] }
[Pipeline] [linux-jdk10-m3.5.x_build] }
[Pipeline] [windows-jdk7-m3.0.x_build] // stage
[Pipeline] [windows-jdk7-m3.2.x_build] // stage
[Pipeline] [windows-jdk7-m3.0.x_build] }
[Pipeline] [windows-jdk7-m3.2.x_build] }
[Pipeline] [windows-jdk7-m3.5.x_build] // stage
[Pipeline] [windows-jdk7-m3.5.x_build] }
[Pipeline] [windows-jdk7-m3.3.x_build] cleanWs
[Pipeline] [linux-jdk8-m3.5.x_build] // node
[Pipeline] [linux-jdk10-m3.5.x_build] // node
[Pipeline] [linux-jdk8-m3.5.x_build] }
[linux-jdk8-m3.5.x_build] Failed in branch linux-jdk8-m3.5.x_build
[Pipeline] [linux-jdk10-m3.5.x_build] }
[windows-jdk7-m3.3.x_build] [WS-CLEANUP] Deleting project workspace...[WS-CLEANUP] done
[linux-jdk10-m3.5.x_build] Failed in branch linux-jdk10-m3.5.x_build
[Pipeline] [windows-jdk7-m3.0.x_build] // node
[Pipeline] [windows-jdk7-m3.2.x_build] // node
[Pipeline] [windows-jdk7-m3.0.x_build] }
[windows-jdk7-m3.0.x_build] Failed in branch windows-jdk7-m3.0.x_build
[Pipeline] [windows-jdk7-m3.2.x_build] }
[windows-jdk7-m3.2.x_build] Failed in branch windows-jdk7-m3.2.x_build
[Pipeline] [windows-jdk7-m3.5.x_build] // node
[Pipeline] [windows-jdk7-m3.5.x_build] }
[windows-jdk7-m3.5.x_build] Failed in branch windows-jdk7-m3.5.x_build
[Pipeline] [windows-jdk7-m3.3.x_build] }
[Pipeline] [windows-jdk7-m3.3.x_build] // stage
[Pipeline] [windows-jdk7-m3.3.x_build] }
[Pipeline] [windows-jdk7-m3.3.x_build] // node
[Pipeline] [windows-jdk7-m3.3.x_build] }
[windows-jdk7-m3.3.x_build] Failed in branch windows-jdk7-m3.3.x_build
[Pipeline] // parallel
[Pipeline] stage
[Pipeline] { (Notifications)
[Pipeline] echo
Build result: FAILURE
[Pipeline] jiraIssueSelector
[Pipeline] emailext
Mime
  • Unnamed multipart/mixed (inline, None, 0 bytes)
View raw message