maven-notifications mailing list archives

Site index · List index
Message view « Date » · « Thread »
Top « Date » · « Thread »
From Apache Jenkins Server <jenk...@builds.apache.org>
Subject Build unstable in Jenkins: Maven TLP » maven-scm » SCM-859 #6
Date Sun, 09 Sep 2018 09:17:01 GMT
See https://builds.apache.org/job/maven-box/job/maven-scm/job/SCM-859/6/

No changes.

10 tests failed.
FAILED:  org.apache.maven.scm.provider.git.gitexe.command.checkin.GitCheckInCommandNoBranchTest.testCheckinNoBranch

Error Message:
The command result success flag was false.

Stack Trace:
junit.framework.AssertionFailedError: The command result success flag was false.
	at org.apache.maven.scm.provider.git.gitexe.command.checkin.GitCheckInCommandNoBranchTest.checkoutRepo(GitCheckInCommandNoBranchTest.java:100)
	at org.apache.maven.scm.provider.git.gitexe.command.checkin.GitCheckInCommandNoBranchTest.testCheckinNoBranch(GitCheckInCommandNoBranchTest.java:86)


FAILED:  org.apache.maven.scm.provider.git.gitexe.command.checkin.GitCheckInCommandNoBranchTest.testCheckinNoBranch

Error Message:
The command result success flag was false.

Stack Trace:
junit.framework.AssertionFailedError: The command result success flag was false.
	at org.apache.maven.scm.provider.git.gitexe.command.checkin.GitCheckInCommandNoBranchTest.checkoutRepo(GitCheckInCommandNoBranchTest.java:100)
	at org.apache.maven.scm.provider.git.gitexe.command.checkin.GitCheckInCommandNoBranchTest.testCheckinNoBranch(GitCheckInCommandNoBranchTest.java:86)


FAILED:  org.apache.maven.scm.provider.git.gitexe.command.checkin.GitCheckInCommandTest.testCheckinWithFileSet

Error Message:
The command result success flag was false.

Stack Trace:
junit.framework.AssertionFailedError: The command result success flag was false.
	at org.apache.maven.scm.provider.git.gitexe.command.checkin.GitCheckInCommandTest.checkoutRepoInto(GitCheckInCommandTest.java:185)
	at org.apache.maven.scm.provider.git.gitexe.command.checkin.GitCheckInCommandTest.testCheckinWithFileSet(GitCheckInCommandTest.java:144)


FAILED:  org.apache.maven.scm.provider.git.gitexe.command.checkin.GitCheckInCommandTest.testCheckinAfterRename

Error Message:
The command result success flag was false.

Stack Trace:
junit.framework.AssertionFailedError: The command result success flag was false.
	at org.apache.maven.scm.provider.git.gitexe.command.checkin.GitCheckInCommandTest.checkoutRepoInto(GitCheckInCommandTest.java:185)
	at org.apache.maven.scm.provider.git.gitexe.command.checkin.GitCheckInCommandTest.testCheckinAfterRename(GitCheckInCommandTest.java:100)


FAILED:  org.apache.maven.scm.provider.git.gitexe.command.checkin.GitCheckInCommandTest.testCheckinWithFileSet

Error Message:
The command result success flag was false.

Stack Trace:
junit.framework.AssertionFailedError: The command result success flag was false.
	at org.apache.maven.scm.provider.git.gitexe.command.checkin.GitCheckInCommandTest.checkoutRepoInto(GitCheckInCommandTest.java:185)
	at org.apache.maven.scm.provider.git.gitexe.command.checkin.GitCheckInCommandTest.testCheckinWithFileSet(GitCheckInCommandTest.java:144)


FAILED:  org.apache.maven.scm.provider.git.gitexe.command.checkin.GitCheckInCommandTest.testCheckinAfterRename

Error Message:
The command result success flag was false.

Stack Trace:
junit.framework.AssertionFailedError: The command result success flag was false.
	at org.apache.maven.scm.provider.git.gitexe.command.checkin.GitCheckInCommandTest.checkoutRepoInto(GitCheckInCommandTest.java:185)
	at org.apache.maven.scm.provider.git.gitexe.command.checkin.GitCheckInCommandTest.testCheckinAfterRename(GitCheckInCommandTest.java:100)


FAILED:  org.apache.maven.scm.provider.git.gitexe.command.checkin.GitCheckInCommandTest.testCheckinWithFileSet

Error Message:
The command result success flag was false.

Stack Trace:
junit.framework.AssertionFailedError: The command result success flag was false.
	at org.apache.maven.scm.provider.git.gitexe.command.checkin.GitCheckInCommandTest.checkoutRepoInto(GitCheckInCommandTest.java:185)
	at org.apache.maven.scm.provider.git.gitexe.command.checkin.GitCheckInCommandTest.testCheckinWithFileSet(GitCheckInCommandTest.java:144)


FAILED:  org.apache.maven.scm.provider.git.gitexe.command.checkin.GitCheckInCommandTest.testCheckinAfterRename

Error Message:
The command result success flag was false.

Stack Trace:
junit.framework.AssertionFailedError: The command result success flag was false.
	at org.apache.maven.scm.provider.git.gitexe.command.checkin.GitCheckInCommandTest.checkoutRepoInto(GitCheckInCommandTest.java:185)
	at org.apache.maven.scm.provider.git.gitexe.command.checkin.GitCheckInCommandTest.testCheckinAfterRename(GitCheckInCommandTest.java:100)


FAILED:  org.apache.maven.scm.provider.git.gitexe.command.checkin.GitCheckInCommandTest.testCheckinWithFileSet

Error Message:
The command result success flag was false.

Stack Trace:
junit.framework.AssertionFailedError: The command result success flag was false.
	at org.apache.maven.scm.provider.git.gitexe.command.checkin.GitCheckInCommandTest.checkoutRepoInto(GitCheckInCommandTest.java:185)
	at org.apache.maven.scm.provider.git.gitexe.command.checkin.GitCheckInCommandTest.testCheckinWithFileSet(GitCheckInCommandTest.java:144)


FAILED:  org.apache.maven.scm.provider.git.gitexe.command.checkin.GitCheckInCommandTest.testCheckinAfterRename

Error Message:
The command result success flag was false.

Stack Trace:
junit.framework.AssertionFailedError: The command result success flag was false.
	at org.apache.maven.scm.provider.git.gitexe.command.checkin.GitCheckInCommandTest.checkoutRepoInto(GitCheckInCommandTest.java:185)
	at org.apache.maven.scm.provider.git.gitexe.command.checkin.GitCheckInCommandTest.testCheckinAfterRename(GitCheckInCommandTest.java:100)




Build log:
[...truncated 7.78 MB...]
[windows-jdk10] [withMaven] junitPublisher - Archive test results for Maven artifact org.apache.maven.scm:maven-scm-provider-cvsexe:1.11.1-SNAPSHOT
generated by maven-surefire-plugin:test (default-test): m\maven-scm-providers\maven-scm-providers-cvs\maven-scm-provider-cvsexe\target\surefire-reports\*.xml
[windows-jdk10] Recording test results
[windows-jdk10] [withMaven] junitPublisher - Archive test results for Maven artifact org.apache.maven.scm:maven-scm-provider-cvsjava:1.11.1-SNAPSHOT
generated by maven-surefire-plugin:test (default-test): m\maven-scm-providers\maven-scm-providers-cvs\maven-scm-provider-cvsjava\target\surefire-reports\*.xml
[windows-jdk10] Recording test results
[windows-jdk10] [withMaven] junitPublisher - Archive test results for Maven artifact org.apache.maven.scm:maven-scm-provider-hg:1.11.1-SNAPSHOT
generated by maven-surefire-plugin:test (default-test): m\maven-scm-providers\maven-scm-provider-hg\target\surefire-reports\*.xml
[windows-jdk10] Recording test results
[windows-jdk10] [withMaven] junitPublisher - Archive test results for Maven artifact org.apache.maven.scm:maven-scm-provider-git-commons:1.11.1-SNAPSHOT
generated by maven-surefire-plugin:test (default-test): m\maven-scm-providers\maven-scm-providers-git\maven-scm-provider-git-commons\target\surefire-reports\*.xml
[windows-jdk10] Recording test results
[windows-jdk10] [withMaven] junitPublisher - Archive test results for Maven artifact org.apache.maven.scm:maven-scm-provider-gittest:1.11.1-SNAPSHOT
generated by maven-surefire-plugin:test (default-test): m\maven-scm-providers\maven-scm-providers-git\maven-scm-provider-gittest\target\surefire-reports\*.xml
[windows-jdk10] Recording test results
[windows-jdk10] None of the test reports contained any result
[windows-jdk10] [withMaven] junitPublisher - Archive test results for Maven artifact org.apache.maven.scm:maven-scm-provider-gitexe:1.11.1-SNAPSHOT
generated by maven-surefire-plugin:test (default-test): m\maven-scm-providers\maven-scm-providers-git\maven-scm-provider-gitexe\target\surefire-reports\*.xml
[windows-jdk10] Recording test results
[windows-jdk10] [withMaven] junitPublisher - Archive test results for Maven artifact org.apache.maven.scm:maven-scm-provider-jgit:1.11.1-SNAPSHOT
generated by maven-surefire-plugin:test (default-test): m\maven-scm-providers\maven-scm-providers-git\maven-scm-provider-jgit\target\surefire-reports\*.xml
[windows-jdk10] Recording test results
[windows-jdk10] [withMaven] junitPublisher - Archive test results for Maven artifact org.apache.maven.scm:maven-scm-provider-local:1.11.1-SNAPSHOT
generated by maven-surefire-plugin:test (default-test): m\maven-scm-providers\maven-scm-provider-local\target\surefire-reports\*.xml
[windows-jdk10] Recording test results
[windows-jdk10] [withMaven] junitPublisher - Archive test results for Maven artifact org.apache.maven.scm:maven-scm-provider-perforce:1.11.1-SNAPSHOT
generated by maven-surefire-plugin:test (default-test): m\maven-scm-providers\maven-scm-provider-perforce\target\surefire-reports\*.xml
[windows-jdk10] Recording test results
[windows-jdk10] [withMaven] junitPublisher - Archive test results for Maven artifact org.apache.maven.scm:maven-scm-provider-starteam:1.11.1-SNAPSHOT
generated by maven-surefire-plugin:test (default-test): m\maven-scm-providers\maven-scm-provider-starteam\target\surefire-reports\*.xml
[windows-jdk10] Recording test results
[windows-jdk10] [withMaven] junitPublisher - Archive test results for Maven artifact org.apache.maven.scm:maven-scm-provider-svn-commons:1.11.1-SNAPSHOT
generated by maven-surefire-plugin:test (default-test): m\maven-scm-providers\maven-scm-providers-svn\maven-scm-provider-svn-commons\target\surefire-reports\*.xml
[windows-jdk10] Recording test results
[windows-jdk10] [withMaven] junitPublisher - Archive test results for Maven artifact org.apache.maven.scm:maven-scm-provider-svntest:1.11.1-SNAPSHOT
generated by maven-surefire-plugin:test (default-test): m\maven-scm-providers\maven-scm-providers-svn\maven-scm-provider-svntest\target\surefire-reports\*.xml
[windows-jdk10] Recording test results
[windows-jdk10] None of the test reports contained any result
[windows-jdk10] [withMaven] junitPublisher - Archive test results for Maven artifact org.apache.maven.scm:maven-scm-provider-svnexe:1.11.1-SNAPSHOT
generated by maven-surefire-plugin:test (default-test): m\maven-scm-providers\maven-scm-providers-svn\maven-scm-provider-svnexe\target\surefire-reports\*.xml
[windows-jdk10] Recording test results
[windows-jdk10] [withMaven] junitPublisher - Archive test results for Maven artifact org.apache.maven.scm:maven-scm-provider-synergy:1.11.1-SNAPSHOT
generated by maven-surefire-plugin:test (default-test): m\maven-scm-providers\maven-scm-provider-synergy\target\surefire-reports\*.xml
[windows-jdk10] Recording test results
[windows-jdk10] [withMaven] junitPublisher - Archive test results for Maven artifact org.apache.maven.scm:maven-scm-provider-vss:1.11.1-SNAPSHOT
generated by maven-surefire-plugin:test (default-test): m\maven-scm-providers\maven-scm-provider-vss\target\surefire-reports\*.xml
[windows-jdk10] Recording test results
[windows-jdk10] [withMaven] junitPublisher - Archive test results for Maven artifact org.apache.maven.scm:maven-scm-provider-tfs:1.11.1-SNAPSHOT
generated by maven-surefire-plugin:test (default-test): m\maven-scm-providers\maven-scm-provider-tfs\target\surefire-reports\*.xml
[windows-jdk10] Recording test results
[windows-jdk10] [withMaven] junitPublisher - Archive test results for Maven artifact org.apache.maven.scm:maven-scm-provider-integrity:1.11.1-SNAPSHOT
generated by maven-surefire-plugin:test (default-test): m\maven-scm-providers\maven-scm-provider-integrity\target\surefire-reports\*.xml
[windows-jdk10] Recording test results
[windows-jdk10] [withMaven] junitPublisher - Archive test results for Maven artifact org.apache.maven.scm:maven-scm-provider-jazz:1.11.1-SNAPSHOT
generated by maven-surefire-plugin:test (default-test): m\maven-scm-providers\maven-scm-provider-jazz\target\surefire-reports\*.xml
[windows-jdk10] Recording test results
[windows-jdk10] [withMaven] junitPublisher - Archive test results for Maven artifact org.apache.maven.scm:maven-scm-client:1.11.1-SNAPSHOT
generated by maven-surefire-plugin:test (default-test): m\maven-scm-client\target\surefire-reports\*.xml
[windows-jdk10] Recording test results
[windows-jdk10] None of the test reports contained any result
[windows-jdk10] [withMaven] junitPublisher - Archive test results for Maven artifact org.apache.maven.plugins:maven-scm-plugin:1.11.1-SNAPSHOT
generated by maven-surefire-plugin:test (default-test): m\maven-scm-plugin\target\surefire-reports\*.xml
[windows-jdk10] Recording test results
[Pipeline] [linux-jdk7] // withMaven
[Pipeline] [linux-jdk9] // withMaven
[Pipeline] [linux-jdk10] // withMaven
[Pipeline] [windows-jdk7] // withMaven
[Pipeline] [windows-jdk10] // withMaven
[Pipeline] [linux-jdk7] cleanWs
[Pipeline] [linux-jdk8] }
[Pipeline] [linux-jdk9] cleanWs
[Pipeline] [linux-jdk10] cleanWs
[Pipeline] [windows-jdk7] cleanWs
[Pipeline] [windows-jdk10] cleanWs
[Pipeline] [windows-jdk8] }
[Pipeline] [windows-jdk9] }
[Pipeline] [linux-jdk8] // stage
[Pipeline] [windows-jdk8] // dir
[Pipeline] [windows-jdk9] // dir
[windows-jdk7] [WS-CLEANUP] Deleting project workspace...[WS-CLEANUP] done
[linux-jdk7] [WS-CLEANUP] Deleting project workspace...[WS-CLEANUP] done
[linux-jdk9] [WS-CLEANUP] Deleting project workspace...[WS-CLEANUP] done
[linux-jdk10] [WS-CLEANUP] Deleting project workspace...[WS-CLEANUP] done
[windows-jdk10] [WS-CLEANUP] Deleting project workspace...[WS-CLEANUP] done
[Pipeline] [linux-jdk8] }
[Pipeline] [windows-jdk8] }
[windows-jdk8] [withMaven] invokerPublisher - Archive invoker results for Maven artifact MavenArtifact{org.apache.maven.plugins:maven-scm-plugin::1.11.1-SNAPSHOT(version:
1.11.1-SNAPSHOT, snapshot:false) } generated by PluginInvocation{org.apache.maven.plugins:maven-invoker-plugin:3.1.0@run
 integration-test}: m\maven-scm-plugin\target\invoker-reports\*.xml
[windows-jdk8] performing MavenInvokerRecorder, reportsFilenamePattern:'**/m\maven-scm-plugin\target\invoker-reports/BUILD*.xml',
invokerBuildDir:'**/m\maven-scm-plugin\target\it'
[windows-jdk8] Found reports:[]
[windows-jdk8] Found logs:[]
[windows-jdk8] Finished parsing Maven Invoker results (found 0)
[windows-jdk8] [withMaven] junitPublisher - Archive test results for Maven artifact org.apache.maven.scm:maven-scm-api:1.11.1-SNAPSHOT
generated by maven-surefire-plugin:test (default-test): m\maven-scm-api\target\surefire-reports\*.xml
[windows-jdk8] Recording test results
[windows-jdk8] [withMaven] junitPublisher - Archive test results for Maven artifact org.apache.maven.scm:maven-scm-manager-plexus:1.11.1-SNAPSHOT
generated by maven-surefire-plugin:test (default-test): m\maven-scm-managers\maven-scm-manager-plexus\target\surefire-reports\*.xml
[windows-jdk8] Recording test results
[windows-jdk8] None of the test reports contained any result
[windows-jdk8] [withMaven] junitPublisher - Archive test results for Maven artifact org.apache.maven.scm:maven-scm-test:1.11.1-SNAPSHOT
generated by maven-surefire-plugin:test (default-test): m\maven-scm-test\target\surefire-reports\*.xml
[windows-jdk8] Recording test results
[windows-jdk8] [withMaven] junitPublisher - Archive test results for Maven artifact org.apache.maven.scm:maven-scm-provider-accurev:1.11.1-SNAPSHOT
generated by maven-surefire-plugin:test (default-test): m\maven-scm-providers\maven-scm-provider-accurev\target\surefire-reports\*.xml
[windows-jdk8] Recording test results
[windows-jdk8] [withMaven] junitPublisher - Archive test results for Maven artifact org.apache.maven.scm:maven-scm-provider-bazaar:1.11.1-SNAPSHOT
generated by maven-surefire-plugin:test (default-test): m\maven-scm-providers\maven-scm-provider-bazaar\target\surefire-reports\*.xml
[windows-jdk8] Recording test results
[windows-jdk8] [withMaven] junitPublisher - Archive test results for Maven artifact org.apache.maven.scm:maven-scm-provider-clearcase:1.11.1-SNAPSHOT
generated by maven-surefire-plugin:test (default-test): m\maven-scm-providers\maven-scm-provider-clearcase\target\surefire-reports\*.xml
[windows-jdk8] Recording test results
[windows-jdk8] [withMaven] junitPublisher - Archive test results for Maven artifact org.apache.maven.scm:maven-scm-provider-cvstest:1.11.1-SNAPSHOT
generated by maven-surefire-plugin:test (default-test): m\maven-scm-providers\maven-scm-providers-cvs\maven-scm-provider-cvstest\target\surefire-reports\*.xml
[windows-jdk8] Recording test results
[windows-jdk8] None of the test reports contained any result
[windows-jdk8] [withMaven] junitPublisher - Archive test results for Maven artifact org.apache.maven.scm:maven-scm-provider-cvs-commons:1.11.1-SNAPSHOT
generated by maven-surefire-plugin:test (default-test): m\maven-scm-providers\maven-scm-providers-cvs\maven-scm-provider-cvs-commons\target\surefire-reports\*.xml
[windows-jdk8] Recording test results
[windows-jdk8] [withMaven] junitPublisher - Archive test results for Maven artifact org.apache.maven.scm:maven-scm-provider-cvsexe:1.11.1-SNAPSHOT
generated by maven-surefire-plugin:test (default-test): m\maven-scm-providers\maven-scm-providers-cvs\maven-scm-provider-cvsexe\target\surefire-reports\*.xml
[windows-jdk8] Recording test results
[windows-jdk8] [withMaven] junitPublisher - Archive test results for Maven artifact org.apache.maven.scm:maven-scm-provider-cvsjava:1.11.1-SNAPSHOT
generated by maven-surefire-plugin:test (default-test): m\maven-scm-providers\maven-scm-providers-cvs\maven-scm-provider-cvsjava\target\surefire-reports\*.xml
[windows-jdk8] Recording test results
[windows-jdk8] [withMaven] junitPublisher - Archive test results for Maven artifact org.apache.maven.scm:maven-scm-provider-hg:1.11.1-SNAPSHOT
generated by maven-surefire-plugin:test (default-test): m\maven-scm-providers\maven-scm-provider-hg\target\surefire-reports\*.xml
[windows-jdk8] Recording test results
[windows-jdk8] [withMaven] junitPublisher - Archive test results for Maven artifact org.apache.maven.scm:maven-scm-provider-git-commons:1.11.1-SNAPSHOT
generated by maven-surefire-plugin:test (default-test): m\maven-scm-providers\maven-scm-providers-git\maven-scm-provider-git-commons\target\surefire-reports\*.xml
[windows-jdk8] Recording test results
[windows-jdk8] [withMaven] junitPublisher - Archive test results for Maven artifact org.apache.maven.scm:maven-scm-provider-gittest:1.11.1-SNAPSHOT
generated by maven-surefire-plugin:test (default-test): m\maven-scm-providers\maven-scm-providers-git\maven-scm-provider-gittest\target\surefire-reports\*.xml
[windows-jdk8] Recording test results
[windows-jdk8] None of the test reports contained any result
[windows-jdk8] [withMaven] junitPublisher - Archive test results for Maven artifact org.apache.maven.scm:maven-scm-provider-gitexe:1.11.1-SNAPSHOT
generated by maven-surefire-plugin:test (default-test): m\maven-scm-providers\maven-scm-providers-git\maven-scm-provider-gitexe\target\surefire-reports\*.xml
[windows-jdk8] Recording test results
[windows-jdk8] [withMaven] junitPublisher - Archive test results for Maven artifact org.apache.maven.scm:maven-scm-provider-jgit:1.11.1-SNAPSHOT
generated by maven-surefire-plugin:test (default-test): m\maven-scm-providers\maven-scm-providers-git\maven-scm-provider-jgit\target\surefire-reports\*.xml
[windows-jdk8] Recording test results
[windows-jdk8] [withMaven] junitPublisher - Archive test results for Maven artifact org.apache.maven.scm:maven-scm-provider-local:1.11.1-SNAPSHOT
generated by maven-surefire-plugin:test (default-test): m\maven-scm-providers\maven-scm-provider-local\target\surefire-reports\*.xml
[windows-jdk8] Recording test results
[windows-jdk8] [withMaven] junitPublisher - Archive test results for Maven artifact org.apache.maven.scm:maven-scm-provider-perforce:1.11.1-SNAPSHOT
generated by maven-surefire-plugin:test (default-test): m\maven-scm-providers\maven-scm-provider-perforce\target\surefire-reports\*.xml
[windows-jdk8] Recording test results
[windows-jdk8] [withMaven] junitPublisher - Archive test results for Maven artifact org.apache.maven.scm:maven-scm-provider-starteam:1.11.1-SNAPSHOT
generated by maven-surefire-plugin:test (default-test): m\maven-scm-providers\maven-scm-provider-starteam\target\surefire-reports\*.xml
[windows-jdk8] Recording test results
[windows-jdk8] [withMaven] junitPublisher - Archive test results for Maven artifact org.apache.maven.scm:maven-scm-provider-svn-commons:1.11.1-SNAPSHOT
generated by maven-surefire-plugin:test (default-test): m\maven-scm-providers\maven-scm-providers-svn\maven-scm-provider-svn-commons\target\surefire-reports\*.xml
[windows-jdk8] Recording test results
[windows-jdk8] [withMaven] junitPublisher - Archive test results for Maven artifact org.apache.maven.scm:maven-scm-provider-svntest:1.11.1-SNAPSHOT
generated by maven-surefire-plugin:test (default-test): m\maven-scm-providers\maven-scm-providers-svn\maven-scm-provider-svntest\target\surefire-reports\*.xml
[windows-jdk8] Recording test results
[windows-jdk8] None of the test reports contained any result
[windows-jdk8] [withMaven] junitPublisher - Archive test results for Maven artifact org.apache.maven.scm:maven-scm-provider-svnexe:1.11.1-SNAPSHOT
generated by maven-surefire-plugin:test (default-test): m\maven-scm-providers\maven-scm-providers-svn\maven-scm-provider-svnexe\target\surefire-reports\*.xml
[windows-jdk8] Recording test results
[windows-jdk8] [withMaven] junitPublisher - Archive test results for Maven artifact org.apache.maven.scm:maven-scm-provider-synergy:1.11.1-SNAPSHOT
generated by maven-surefire-plugin:test (default-test): m\maven-scm-providers\maven-scm-provider-synergy\target\surefire-reports\*.xml
[windows-jdk8] Recording test results
[windows-jdk8] [withMaven] junitPublisher - Archive test results for Maven artifact org.apache.maven.scm:maven-scm-provider-vss:1.11.1-SNAPSHOT
generated by maven-surefire-plugin:test (default-test): m\maven-scm-providers\maven-scm-provider-vss\target\surefire-reports\*.xml
[windows-jdk8] Recording test results
[windows-jdk8] [withMaven] junitPublisher - Archive test results for Maven artifact org.apache.maven.scm:maven-scm-provider-tfs:1.11.1-SNAPSHOT
generated by maven-surefire-plugin:test (default-test): m\maven-scm-providers\maven-scm-provider-tfs\target\surefire-reports\*.xml
[windows-jdk8] Recording test results
[windows-jdk8] [withMaven] junitPublisher - Archive test results for Maven artifact org.apache.maven.scm:maven-scm-provider-integrity:1.11.1-SNAPSHOT
generated by maven-surefire-plugin:test (default-test): m\maven-scm-providers\maven-scm-provider-integrity\target\surefire-reports\*.xml
[windows-jdk8] Recording test results
[windows-jdk8] [withMaven] junitPublisher - Archive test results for Maven artifact org.apache.maven.scm:maven-scm-provider-jazz:1.11.1-SNAPSHOT
generated by maven-surefire-plugin:test (default-test): m\maven-scm-providers\maven-scm-provider-jazz\target\surefire-reports\*.xml
[windows-jdk8] Recording test results
[windows-jdk8] [withMaven] junitPublisher - Archive test results for Maven artifact org.apache.maven.scm:maven-scm-client:1.11.1-SNAPSHOT
generated by maven-surefire-plugin:test (default-test): m\maven-scm-client\target\surefire-reports\*.xml
[windows-jdk8] Recording test results
[windows-jdk8] None of the test reports contained any result
[windows-jdk8] [withMaven] junitPublisher - Archive test results for Maven artifact org.apache.maven.plugins:maven-scm-plugin:1.11.1-SNAPSHOT
generated by maven-surefire-plugin:test (default-test): m\maven-scm-plugin\target\surefire-reports\*.xml
[windows-jdk8] Recording test results
[Pipeline] [windows-jdk9] }
[windows-jdk9] [withMaven] invokerPublisher - Archive invoker results for Maven artifact MavenArtifact{org.apache.maven.plugins:maven-scm-plugin::1.11.1-SNAPSHOT(version:
1.11.1-SNAPSHOT, snapshot:false) } generated by PluginInvocation{org.apache.maven.plugins:maven-invoker-plugin:3.1.0@run
 integration-test}: m\maven-scm-plugin\target\invoker-reports\*.xml
[windows-jdk9] performing MavenInvokerRecorder, reportsFilenamePattern:'**/m\maven-scm-plugin\target\invoker-reports/BUILD*.xml',
invokerBuildDir:'**/m\maven-scm-plugin\target\it'
[windows-jdk9] Found reports:[]
[windows-jdk9] Found logs:[]
[windows-jdk9] Finished parsing Maven Invoker results (found 0)
[windows-jdk9] [withMaven] junitPublisher - Archive test results for Maven artifact org.apache.maven.scm:maven-scm-api:1.11.1-SNAPSHOT
generated by maven-surefire-plugin:test (default-test): m\maven-scm-api\target\surefire-reports\*.xml
[windows-jdk9] Recording test results
[windows-jdk9] [withMaven] junitPublisher - Archive test results for Maven artifact org.apache.maven.scm:maven-scm-manager-plexus:1.11.1-SNAPSHOT
generated by maven-surefire-plugin:test (default-test): m\maven-scm-managers\maven-scm-manager-plexus\target\surefire-reports\*.xml
[windows-jdk9] Recording test results
[windows-jdk9] None of the test reports contained any result
[windows-jdk9] [withMaven] junitPublisher - Archive test results for Maven artifact org.apache.maven.scm:maven-scm-test:1.11.1-SNAPSHOT
generated by maven-surefire-plugin:test (default-test): m\maven-scm-test\target\surefire-reports\*.xml
[windows-jdk9] Recording test results
[windows-jdk9] [withMaven] junitPublisher - Archive test results for Maven artifact org.apache.maven.scm:maven-scm-provider-accurev:1.11.1-SNAPSHOT
generated by maven-surefire-plugin:test (default-test): m\maven-scm-providers\maven-scm-provider-accurev\target\surefire-reports\*.xml
[windows-jdk9] Recording test results
[windows-jdk9] [withMaven] junitPublisher - Archive test results for Maven artifact org.apache.maven.scm:maven-scm-provider-bazaar:1.11.1-SNAPSHOT
generated by maven-surefire-plugin:test (default-test): m\maven-scm-providers\maven-scm-provider-bazaar\target\surefire-reports\*.xml
[windows-jdk9] Recording test results
[windows-jdk9] [withMaven] junitPublisher - Archive test results for Maven artifact org.apache.maven.scm:maven-scm-provider-clearcase:1.11.1-SNAPSHOT
generated by maven-surefire-plugin:test (default-test): m\maven-scm-providers\maven-scm-provider-clearcase\target\surefire-reports\*.xml
[windows-jdk9] Recording test results
[windows-jdk9] [withMaven] junitPublisher - Archive test results for Maven artifact org.apache.maven.scm:maven-scm-provider-cvstest:1.11.1-SNAPSHOT
generated by maven-surefire-plugin:test (default-test): m\maven-scm-providers\maven-scm-providers-cvs\maven-scm-provider-cvstest\target\surefire-reports\*.xml
[windows-jdk9] Recording test results
[windows-jdk9] None of the test reports contained any result
[windows-jdk9] [withMaven] junitPublisher - Archive test results for Maven artifact org.apache.maven.scm:maven-scm-provider-cvs-commons:1.11.1-SNAPSHOT
generated by maven-surefire-plugin:test (default-test): m\maven-scm-providers\maven-scm-providers-cvs\maven-scm-provider-cvs-commons\target\surefire-reports\*.xml
[windows-jdk9] Recording test results
[windows-jdk9] [withMaven] junitPublisher - Archive test results for Maven artifact org.apache.maven.scm:maven-scm-provider-cvsexe:1.11.1-SNAPSHOT
generated by maven-surefire-plugin:test (default-test): m\maven-scm-providers\maven-scm-providers-cvs\maven-scm-provider-cvsexe\target\surefire-reports\*.xml
[windows-jdk9] Recording test results
[windows-jdk9] [withMaven] junitPublisher - Archive test results for Maven artifact org.apache.maven.scm:maven-scm-provider-cvsjava:1.11.1-SNAPSHOT
generated by maven-surefire-plugin:test (default-test): m\maven-scm-providers\maven-scm-providers-cvs\maven-scm-provider-cvsjava\target\surefire-reports\*.xml
[windows-jdk9] Recording test results
[windows-jdk9] [withMaven] junitPublisher - Archive test results for Maven artifact org.apache.maven.scm:maven-scm-provider-hg:1.11.1-SNAPSHOT
generated by maven-surefire-plugin:test (default-test): m\maven-scm-providers\maven-scm-provider-hg\target\surefire-reports\*.xml
[windows-jdk9] Recording test results
[windows-jdk9] [withMaven] junitPublisher - Archive test results for Maven artifact org.apache.maven.scm:maven-scm-provider-git-commons:1.11.1-SNAPSHOT
generated by maven-surefire-plugin:test (default-test): m\maven-scm-providers\maven-scm-providers-git\maven-scm-provider-git-commons\target\surefire-reports\*.xml
[windows-jdk9] Recording test results
[windows-jdk9] [withMaven] junitPublisher - Archive test results for Maven artifact org.apache.maven.scm:maven-scm-provider-gittest:1.11.1-SNAPSHOT
generated by maven-surefire-plugin:test (default-test): m\maven-scm-providers\maven-scm-providers-git\maven-scm-provider-gittest\target\surefire-reports\*.xml
[windows-jdk9] Recording test results
[windows-jdk9] None of the test reports contained any result
[windows-jdk9] [withMaven] junitPublisher - Archive test results for Maven artifact org.apache.maven.scm:maven-scm-provider-gitexe:1.11.1-SNAPSHOT
generated by maven-surefire-plugin:test (default-test): m\maven-scm-providers\maven-scm-providers-git\maven-scm-provider-gitexe\target\surefire-reports\*.xml
[windows-jdk9] Recording test results
[windows-jdk9] [withMaven] junitPublisher - Archive test results for Maven artifact org.apache.maven.scm:maven-scm-provider-jgit:1.11.1-SNAPSHOT
generated by maven-surefire-plugin:test (default-test): m\maven-scm-providers\maven-scm-providers-git\maven-scm-provider-jgit\target\surefire-reports\*.xml
[windows-jdk9] Recording test results
[windows-jdk9] [withMaven] junitPublisher - Archive test results for Maven artifact org.apache.maven.scm:maven-scm-provider-local:1.11.1-SNAPSHOT
generated by maven-surefire-plugin:test (default-test): m\maven-scm-providers\maven-scm-provider-local\target\surefire-reports\*.xml
[windows-jdk9] Recording test results
[windows-jdk9] [withMaven] junitPublisher - Archive test results for Maven artifact org.apache.maven.scm:maven-scm-provider-perforce:1.11.1-SNAPSHOT
generated by maven-surefire-plugin:test (default-test): m\maven-scm-providers\maven-scm-provider-perforce\target\surefire-reports\*.xml
[windows-jdk9] Recording test results
[windows-jdk9] [withMaven] junitPublisher - Archive test results for Maven artifact org.apache.maven.scm:maven-scm-provider-starteam:1.11.1-SNAPSHOT
generated by maven-surefire-plugin:test (default-test): m\maven-scm-providers\maven-scm-provider-starteam\target\surefire-reports\*.xml
[windows-jdk9] Recording test results
[windows-jdk9] [withMaven] junitPublisher - Archive test results for Maven artifact org.apache.maven.scm:maven-scm-provider-svn-commons:1.11.1-SNAPSHOT
generated by maven-surefire-plugin:test (default-test): m\maven-scm-providers\maven-scm-providers-svn\maven-scm-provider-svn-commons\target\surefire-reports\*.xml
[windows-jdk9] Recording test results
[windows-jdk9] [withMaven] junitPublisher - Archive test results for Maven artifact org.apache.maven.scm:maven-scm-provider-svntest:1.11.1-SNAPSHOT
generated by maven-surefire-plugin:test (default-test): m\maven-scm-providers\maven-scm-providers-svn\maven-scm-provider-svntest\target\surefire-reports\*.xml
[windows-jdk9] Recording test results
[windows-jdk9] None of the test reports contained any result
[windows-jdk9] [withMaven] junitPublisher - Archive test results for Maven artifact org.apache.maven.scm:maven-scm-provider-svnexe:1.11.1-SNAPSHOT
generated by maven-surefire-plugin:test (default-test): m\maven-scm-providers\maven-scm-providers-svn\maven-scm-provider-svnexe\target\surefire-reports\*.xml
[windows-jdk9] Recording test results
[windows-jdk9] [withMaven] junitPublisher - Archive test results for Maven artifact org.apache.maven.scm:maven-scm-provider-synergy:1.11.1-SNAPSHOT
generated by maven-surefire-plugin:test (default-test): m\maven-scm-providers\maven-scm-provider-synergy\target\surefire-reports\*.xml
[windows-jdk9] Recording test results
[windows-jdk9] [withMaven] junitPublisher - Archive test results for Maven artifact org.apache.maven.scm:maven-scm-provider-vss:1.11.1-SNAPSHOT
generated by maven-surefire-plugin:test (default-test): m\maven-scm-providers\maven-scm-provider-vss\target\surefire-reports\*.xml
[windows-jdk9] Recording test results
[windows-jdk9] [withMaven] junitPublisher - Archive test results for Maven artifact org.apache.maven.scm:maven-scm-provider-tfs:1.11.1-SNAPSHOT
generated by maven-surefire-plugin:test (default-test): m\maven-scm-providers\maven-scm-provider-tfs\target\surefire-reports\*.xml
[windows-jdk9] Recording test results
[windows-jdk9] [withMaven] junitPublisher - Archive test results for Maven artifact org.apache.maven.scm:maven-scm-provider-integrity:1.11.1-SNAPSHOT
generated by maven-surefire-plugin:test (default-test): m\maven-scm-providers\maven-scm-provider-integrity\target\surefire-reports\*.xml
[windows-jdk9] Recording test results
[windows-jdk9] [withMaven] junitPublisher - Archive test results for Maven artifact org.apache.maven.scm:maven-scm-provider-jazz:1.11.1-SNAPSHOT
generated by maven-surefire-plugin:test (default-test): m\maven-scm-providers\maven-scm-provider-jazz\target\surefire-reports\*.xml
[windows-jdk9] Recording test results
[windows-jdk9] [withMaven] junitPublisher - Archive test results for Maven artifact org.apache.maven.scm:maven-scm-client:1.11.1-SNAPSHOT
generated by maven-surefire-plugin:test (default-test): m\maven-scm-client\target\surefire-reports\*.xml
[windows-jdk9] Recording test results
[windows-jdk9] None of the test reports contained any result
[windows-jdk9] [withMaven] junitPublisher - Archive test results for Maven artifact org.apache.maven.plugins:maven-scm-plugin:1.11.1-SNAPSHOT
generated by maven-surefire-plugin:test (default-test): m\maven-scm-plugin\target\surefire-reports\*.xml
[windows-jdk9] Recording test results
[Pipeline] [linux-jdk8] // node
[Pipeline] [windows-jdk8] // withMaven
[Pipeline] [windows-jdk9] // withMaven
[Pipeline] [linux-jdk8] }
[Pipeline] [linux-jdk7] }
[Pipeline] [linux-jdk9] }
[Pipeline] [linux-jdk10] }
[Pipeline] [windows-jdk7] }
[Pipeline] [windows-jdk10] }
[Pipeline] [windows-jdk8] cleanWs
[Pipeline] [windows-jdk9] cleanWs
[Pipeline] [linux-jdk7] // stage
[Pipeline] [linux-jdk9] // stage
[Pipeline] [linux-jdk10] // stage
[Pipeline] [windows-jdk7] // stage
[Pipeline] [windows-jdk10] // stage
[Pipeline] [linux-jdk7] }
[Pipeline] [linux-jdk9] }
[Pipeline] [linux-jdk10] }
[Pipeline] [windows-jdk7] }
[Pipeline] [windows-jdk10] }
[windows-jdk8] [WS-CLEANUP] Deleting project workspace...[WS-CLEANUP] done
[windows-jdk9] [WS-CLEANUP] Deleting project workspace...[WS-CLEANUP] done
[Pipeline] [linux-jdk7] // node
[Pipeline] [linux-jdk9] // node
[Pipeline] [linux-jdk10] // node
[Pipeline] [windows-jdk7] // node
[Pipeline] [windows-jdk10] // node
[Pipeline] [linux-jdk7] }
[Pipeline] [linux-jdk9] }
[Pipeline] [linux-jdk10] }
[Pipeline] [windows-jdk7] }
[Pipeline] [windows-jdk10] }
[Pipeline] [windows-jdk8] }
[Pipeline] [windows-jdk9] }
[Pipeline] [windows-jdk8] // stage
[Pipeline] [windows-jdk9] // stage
[Pipeline] [windows-jdk8] }
[Pipeline] [windows-jdk9] }
[Pipeline] [windows-jdk8] // node
[Pipeline] [windows-jdk9] // node
[Pipeline] [windows-jdk8] }
[Pipeline] [windows-jdk9] }
[Pipeline] // parallel
[Pipeline] stage
[Pipeline] { (Notifications)
[Pipeline] echo
Build result: UNSTABLE
[Pipeline] jiraIssueSelector
[Pipeline] emailext
Mime
  • Unnamed multipart/mixed (inline, None, 0 bytes)
View raw message