maven-notifications mailing list archives

Site index · List index
Message view « Date » · « Thread »
Top « Date » · « Thread »
From Apache Jenkins Server <jenk...@builds.apache.org>
Subject Build unstable in Jenkins: Maven TLP » maven-archetype » master #22
Date Mon, 10 Sep 2018 04:47:44 GMT
See https://builds.apache.org/job/maven-box/job/maven-archetype/job/master/22/

No changes.

28 tests failed.
FAILED:  org.apache.maven.archetype.creator.DefaultArchetypeCreatorIT.testIncludeFileWithNoExtension

Error Message:
Invoker process ended with result different than 0!

Stack Trace:
java.lang.Exception: Invoker process ended with result different than 0!
	at org.apache.maven.archetype.creator.DefaultArchetypeCreatorIT.createFilesetArchetype(DefaultArchetypeCreatorIT.java:136)
	at org.apache.maven.archetype.creator.DefaultArchetypeCreatorIT.testIncludeFileWithNoExtension(DefaultArchetypeCreatorIT.java:189)


FAILED:  org.apache.maven.archetype.creator.DefaultArchetypeCreatorIT.testSystemPropertiesAreIncluded

Error Message:
Invoker process ended with result different than 0!

Stack Trace:
java.lang.Exception: Invoker process ended with result different than 0!
	at org.apache.maven.archetype.creator.DefaultArchetypeCreatorIT.createFilesetArchetype(DefaultArchetypeCreatorIT.java:136)
	at org.apache.maven.archetype.creator.DefaultArchetypeCreatorIT.testSystemPropertiesAreIncluded(DefaultArchetypeCreatorIT.java:200)


FAILED:  org.apache.maven.archetype.creator.DefaultArchetypeCreatorIT.testCreateFilesetArchetype1

Error Message:
Invoker process ended with result different than 0!

Stack Trace:
java.lang.Exception: Invoker process ended with result different than 0!
	at org.apache.maven.archetype.creator.DefaultArchetypeCreatorIT.createFilesetArchetype(DefaultArchetypeCreatorIT.java:136)
	at org.apache.maven.archetype.creator.DefaultArchetypeCreatorIT.testCreateFilesetArchetype1(DefaultArchetypeCreatorIT.java:211)


FAILED:  org.apache.maven.archetype.creator.DefaultArchetypeCreatorIT.testCreateFilesetArchetype2

Error Message:
Invoker process ended with result different than 0!

Stack Trace:
java.lang.Exception: Invoker process ended with result different than 0!
	at org.apache.maven.archetype.creator.DefaultArchetypeCreatorIT.createFilesetArchetype(DefaultArchetypeCreatorIT.java:136)
	at org.apache.maven.archetype.creator.DefaultArchetypeCreatorIT.testCreateFilesetArchetype2(DefaultArchetypeCreatorIT.java:225)


FAILED:  org.apache.maven.archetype.creator.DefaultArchetypeCreatorIT.testCreateFilesetArchetype3

Error Message:
Invoker process ended with result different than 0!

Stack Trace:
java.lang.Exception: Invoker process ended with result different than 0!
	at org.apache.maven.archetype.creator.DefaultArchetypeCreatorIT.createFilesetArchetype(DefaultArchetypeCreatorIT.java:136)
	at org.apache.maven.archetype.creator.DefaultArchetypeCreatorIT.testCreateFilesetArchetype3(DefaultArchetypeCreatorIT.java:233)


FAILED:  org.apache.maven.archetype.creator.DefaultArchetypeCreatorIT.testCreateFilesetArchetype4

Error Message:
Invoker process ended with result different than 0!

Stack Trace:
java.lang.Exception: Invoker process ended with result different than 0!
	at org.apache.maven.archetype.creator.DefaultArchetypeCreatorIT.createFilesetArchetype(DefaultArchetypeCreatorIT.java:136)
	at org.apache.maven.archetype.creator.DefaultArchetypeCreatorIT.testCreateFilesetArchetype4(DefaultArchetypeCreatorIT.java:398)


FAILED:  org.apache.maven.archetype.creator.DefaultArchetypeCreatorIT.testCreateFilesetArchetype5

Error Message:
Invoker process ended with result different than 0!

Stack Trace:
java.lang.Exception: Invoker process ended with result different than 0!
	at org.apache.maven.archetype.creator.DefaultArchetypeCreatorIT.createFilesetArchetype(DefaultArchetypeCreatorIT.java:136)
	at org.apache.maven.archetype.creator.DefaultArchetypeCreatorIT.testCreateFilesetArchetype5(DefaultArchetypeCreatorIT.java:429)


FAILED:  org.apache.maven.archetype.creator.DefaultArchetypeCreatorIT.testCreateFilesetArchetype6

Error Message:
Invoker process ended with result different than 0!

Stack Trace:
java.lang.Exception: Invoker process ended with result different than 0!
	at org.apache.maven.archetype.creator.DefaultArchetypeCreatorIT.createFilesetArchetype(DefaultArchetypeCreatorIT.java:136)
	at org.apache.maven.archetype.creator.DefaultArchetypeCreatorIT.testCreateFilesetArchetype6(DefaultArchetypeCreatorIT.java:445)


FAILED:  org.apache.maven.archetype.creator.DefaultArchetypeCreatorIT.testExcludePatternsMustExcludeDirectory

Error Message:
Invoker process ended with result different than 0!

Stack Trace:
java.lang.Exception: Invoker process ended with result different than 0!
	at org.apache.maven.archetype.creator.DefaultArchetypeCreatorIT.createFilesetArchetype(DefaultArchetypeCreatorIT.java:136)
	at org.apache.maven.archetype.creator.DefaultArchetypeCreatorIT.testExcludePatternsMustExcludeDirectory(DefaultArchetypeCreatorIT.java:163)


FAILED:  org.apache.maven.archetype.creator.DefaultArchetypeCreatorIT.testExcludePatternsContainingFilesSameExtension

Error Message:
Invoker process ended with result different than 0!

Stack Trace:
java.lang.Exception: Invoker process ended with result different than 0!
	at org.apache.maven.archetype.creator.DefaultArchetypeCreatorIT.createFilesetArchetype(DefaultArchetypeCreatorIT.java:136)
	at org.apache.maven.archetype.creator.DefaultArchetypeCreatorIT.testExcludePatternsContainingFilesSameExtension(DefaultArchetypeCreatorIT.java:177)


FAILED:  org.apache.maven.archetype.creator.DefaultArchetypeCreatorIT.testChangeJavaFilenameWhenCustomPropertyEqualsClassName

Error Message:
Invoker process ended with result different than 0!

Stack Trace:
java.lang.Exception: Invoker process ended with result different than 0!
	at org.apache.maven.archetype.creator.DefaultArchetypeCreatorIT.createFilesetArchetype(DefaultArchetypeCreatorIT.java:136)
	at org.apache.maven.archetype.creator.DefaultArchetypeCreatorIT.testChangeJavaFilenameWhenCustomPropertyEqualsClassName(DefaultArchetypeCreatorIT.java:151)


FAILED:  org.apache.maven.archetype.creator.DefaultArchetypeCreatorIT.testIncludeFileWithNoExtension

Error Message:
Invoker process ended with result different than 0!

Stack Trace:
java.lang.Exception: Invoker process ended with result different than 0!
	at org.apache.maven.archetype.creator.DefaultArchetypeCreatorIT.createFilesetArchetype(DefaultArchetypeCreatorIT.java:136)
	at org.apache.maven.archetype.creator.DefaultArchetypeCreatorIT.testIncludeFileWithNoExtension(DefaultArchetypeCreatorIT.java:189)


FAILED:  org.apache.maven.archetype.creator.DefaultArchetypeCreatorIT.testSystemPropertiesAreIncluded

Error Message:
Invoker process ended with result different than 0!

Stack Trace:
java.lang.Exception: Invoker process ended with result different than 0!
	at org.apache.maven.archetype.creator.DefaultArchetypeCreatorIT.createFilesetArchetype(DefaultArchetypeCreatorIT.java:136)
	at org.apache.maven.archetype.creator.DefaultArchetypeCreatorIT.testSystemPropertiesAreIncluded(DefaultArchetypeCreatorIT.java:200)


FAILED:  org.apache.maven.archetype.creator.DefaultArchetypeCreatorIT.testCreateFilesetArchetype1

Error Message:
Invoker process ended with result different than 0!

Stack Trace:
java.lang.Exception: Invoker process ended with result different than 0!
	at org.apache.maven.archetype.creator.DefaultArchetypeCreatorIT.createFilesetArchetype(DefaultArchetypeCreatorIT.java:136)
	at org.apache.maven.archetype.creator.DefaultArchetypeCreatorIT.testCreateFilesetArchetype1(DefaultArchetypeCreatorIT.java:211)


FAILED:  org.apache.maven.archetype.creator.DefaultArchetypeCreatorIT.testCreateFilesetArchetype2

Error Message:
Invoker process ended with result different than 0!

Stack Trace:
java.lang.Exception: Invoker process ended with result different than 0!
	at org.apache.maven.archetype.creator.DefaultArchetypeCreatorIT.createFilesetArchetype(DefaultArchetypeCreatorIT.java:136)
	at org.apache.maven.archetype.creator.DefaultArchetypeCreatorIT.testCreateFilesetArchetype2(DefaultArchetypeCreatorIT.java:225)


FAILED:  org.apache.maven.archetype.creator.DefaultArchetypeCreatorIT.testCreateFilesetArchetype3

Error Message:
Invoker process ended with result different than 0!

Stack Trace:
java.lang.Exception: Invoker process ended with result different than 0!
	at org.apache.maven.archetype.creator.DefaultArchetypeCreatorIT.createFilesetArchetype(DefaultArchetypeCreatorIT.java:136)
	at org.apache.maven.archetype.creator.DefaultArchetypeCreatorIT.testCreateFilesetArchetype3(DefaultArchetypeCreatorIT.java:233)


FAILED:  org.apache.maven.archetype.creator.DefaultArchetypeCreatorIT.testCreateFilesetArchetype4

Error Message:
Invoker process ended with result different than 0!

Stack Trace:
java.lang.Exception: Invoker process ended with result different than 0!
	at org.apache.maven.archetype.creator.DefaultArchetypeCreatorIT.createFilesetArchetype(DefaultArchetypeCreatorIT.java:136)
	at org.apache.maven.archetype.creator.DefaultArchetypeCreatorIT.testCreateFilesetArchetype4(DefaultArchetypeCreatorIT.java:398)


FAILED:  org.apache.maven.archetype.creator.DefaultArchetypeCreatorIT.testCreateFilesetArchetype5

Error Message:
Invoker process ended with result different than 0!

Stack Trace:
java.lang.Exception: Invoker process ended with result different than 0!
	at org.apache.maven.archetype.creator.DefaultArchetypeCreatorIT.createFilesetArchetype(DefaultArchetypeCreatorIT.java:136)
	at org.apache.maven.archetype.creator.DefaultArchetypeCreatorIT.testCreateFilesetArchetype5(DefaultArchetypeCreatorIT.java:429)


FAILED:  org.apache.maven.archetype.creator.DefaultArchetypeCreatorIT.testCreateFilesetArchetype6

Error Message:
Invoker process ended with result different than 0!

Stack Trace:
java.lang.Exception: Invoker process ended with result different than 0!
	at org.apache.maven.archetype.creator.DefaultArchetypeCreatorIT.createFilesetArchetype(DefaultArchetypeCreatorIT.java:136)
	at org.apache.maven.archetype.creator.DefaultArchetypeCreatorIT.testCreateFilesetArchetype6(DefaultArchetypeCreatorIT.java:445)


FAILED:  org.apache.maven.archetype.creator.DefaultArchetypeCreatorIT.testExcludePatternsMustExcludeDirectory

Error Message:
Invoker process ended with result different than 0!

Stack Trace:
java.lang.Exception: Invoker process ended with result different than 0!
	at org.apache.maven.archetype.creator.DefaultArchetypeCreatorIT.createFilesetArchetype(DefaultArchetypeCreatorIT.java:136)
	at org.apache.maven.archetype.creator.DefaultArchetypeCreatorIT.testExcludePatternsMustExcludeDirectory(DefaultArchetypeCreatorIT.java:163)


FAILED:  org.apache.maven.archetype.creator.DefaultArchetypeCreatorIT.testExcludePatternsContainingFilesSameExtension

Error Message:
Invoker process ended with result different than 0!

Stack Trace:
java.lang.Exception: Invoker process ended with result different than 0!
	at org.apache.maven.archetype.creator.DefaultArchetypeCreatorIT.createFilesetArchetype(DefaultArchetypeCreatorIT.java:136)
	at org.apache.maven.archetype.creator.DefaultArchetypeCreatorIT.testExcludePatternsContainingFilesSameExtension(DefaultArchetypeCreatorIT.java:177)


FAILED:  org.apache.maven.archetype.creator.DefaultArchetypeCreatorIT.testChangeJavaFilenameWhenCustomPropertyEqualsClassName

Error Message:
Invoker process ended with result different than 0!

Stack Trace:
java.lang.Exception: Invoker process ended with result different than 0!
	at org.apache.maven.archetype.creator.DefaultArchetypeCreatorIT.createFilesetArchetype(DefaultArchetypeCreatorIT.java:136)
	at org.apache.maven.archetype.creator.DefaultArchetypeCreatorIT.testChangeJavaFilenameWhenCustomPropertyEqualsClassName(DefaultArchetypeCreatorIT.java:151)


FAILED:  org.apache.maven.archetype.test.ArchetyperRoundtripIT.testArchetyper

Error Message:
Invoker process ended with result different than 0!

Stack Trace:
java.lang.Exception: Invoker process ended with result different than 0!
	at org.apache.maven.archetype.test.ArchetyperRoundtripIT.testArchetyper(ArchetyperRoundtripIT.java:121)


FAILED:  org.apache.maven.archetype.test.ArchetyperRoundtripIT.testArchetyper

Error Message:
Invoker process ended with result different than 0!

Stack Trace:
java.lang.Exception: Invoker process ended with result different than 0!
	at org.apache.maven.archetype.test.ArchetyperRoundtripIT.testArchetyper(ArchetyperRoundtripIT.java:121)


FAILED:  org.apache.maven.archetype.test.ArchetyperRoundtripWithProxyIT.testArchetyper

Error Message:
Invoker process ended with result different than 0!

Stack Trace:
java.lang.Exception: Invoker process ended with result different than 0!
	at org.apache.maven.archetype.test.ArchetyperRoundtripWithProxyIT.testArchetyper(ArchetyperRoundtripWithProxyIT.java:126)


FAILED:  org.apache.maven.archetype.test.ArchetyperRoundtripWithProxyIT.testArchetyper

Error Message:
Invoker process ended with result different than 0!

Stack Trace:
java.lang.Exception: Invoker process ended with result different than 0!
	at org.apache.maven.archetype.test.ArchetyperRoundtripWithProxyIT.testArchetyper(ArchetyperRoundtripWithProxyIT.java:126)


FAILED:  org.apache.maven.archetype.test.RoundtripMultiModuleIT.testArchetyper

Error Message:
Invoker process ended with result different than 0!

Stack Trace:
java.lang.Exception: Invoker process ended with result different than 0!
	at org.apache.maven.archetype.test.RoundtripMultiModuleIT.testArchetyper(RoundtripMultiModuleIT.java:126)


FAILED:  org.apache.maven.archetype.test.RoundtripMultiModuleIT.testArchetyper

Error Message:
Invoker process ended with result different than 0!

Stack Trace:
java.lang.Exception: Invoker process ended with result different than 0!
	at org.apache.maven.archetype.test.RoundtripMultiModuleIT.testArchetyper(RoundtripMultiModuleIT.java:126)




Build log:
[...truncated 5.09 MB...]
[windows-jdk10]         //B   #{some}
[windows-jdk10]         //C   #{some other}
[windows-jdk10]         //D   \#{some other}
[windows-jdk10]         //E   #{}
[windows-jdk10]         //F   {some}
[windows-jdk10]         //G   ${someOtherProperty}
[windows-jdk10]         //H   ${someValue}
[windows-jdk10]         /*
[windows-jdk10]         A   #\{some}
[windows-jdk10]         B   #{some}
[windows-jdk10]         C   #{some other}
[windows-jdk10]         D   \#{some other}
[windows-jdk10]         E   #{}
[windows-jdk10]         F   {some}
[windows-jdk10]         G   ${someOtherProperty}
[windows-jdk10]         H   ${someValue}
[windows-jdk10]          */
[windows-jdk10]     }
[windows-jdk10] }
[windows-jdk10] 
[windows-jdk10] Tests run: 1, Failures: 0, Errors: 0, Skipped: 0, Time elapsed: 5.328 sec - in org.apache.maven.archetype.test.ArchetyperRoundtripIT
[windows-jdk10] Running org.apache.maven.archetype.test.ArchetyperRoundtripWithProxyIT
[windows-jdk10] Picked up JAVA_TOOL_OPTIONS: -Dmaven.ext.class.path="f:\jenkins\jenkins-slave\workspace\-box_maven-archetype_master-7AVMJNUR3VZV7RPVUBCE43H65NYTRWAOYFWSDDPCNSCWDYBAGBVQ@2@tmp\withMavenffe9b34b\pipeline-maven-spy.jar" -Dorg.jenkinsci.plugins.pipeline.maven.reportsFolder="f:\jenkins\jenkins-slave\workspace\-box_maven-archetype_master-7AVMJNUR3VZV7RPVUBCE43H65NYTRWAOYFWSDDPCNSCWDYBAGBVQ@2@tmp\withMavenffe9b34b" 
[windows-jdk10] [INFO] [jenkins-event-spy] Jenkins Maven Event Spy is disabled
[windows-jdk10] [INFO] Scanning for projects...
[windows-jdk10] [INFO] 
[windows-jdk10] [INFO] ------------------------------------------------------------------------
[windows-jdk10] [INFO] Building test-project-2 1.0
[windows-jdk10] [INFO] ------------------------------------------------------------------------
[windows-jdk10] [INFO] 
[windows-jdk10] [INFO] --- maven-resources-plugin:3.1.0:resources (default-resources) @ test-project-2 ---
[windows-jdk10] [WARNING] Using platform encoding (Cp1252 actually) to copy filtered resources, i.e. build is platform dependent!
[windows-jdk10] [INFO] Copying 4 resources
[windows-jdk10] [INFO] 
[windows-jdk10] [INFO] --- maven-resources-plugin:3.1.0:testResources (default-testResources) @ test-project-2 ---
[windows-jdk10] [WARNING] Using platform encoding (Cp1252 actually) to copy filtered resources, i.e. build is platform dependent!
[windows-jdk10] [INFO] Copying 2 resources
[windows-jdk10] [INFO] 
[windows-jdk10] [INFO] --- maven-archetype-plugin:3.0.2-SNAPSHOT:jar (default-jar) @ test-project-2 ---
[windows-jdk10] [INFO] Building archetype jar: F:\jenkins\jenkins-slave\workspace\-box_maven-archetype_master-7AVMJNUR3VZV7RPVUBCE43H65NYTRWAOYFWSDDPCNSCWDYBAGBVQ@2\m\archetype-testing\archetype-final\target\test-classes\projects\roundtrip-2-project\target\generated-sources\archetype\target\test-project-2-1.0
[windows-jdk10] [INFO] ------------------------------------------------------------------------
[windows-jdk10] [INFO] BUILD SUCCESS
[windows-jdk10] [INFO] ------------------------------------------------------------------------
[windows-jdk10] [INFO] Total time: 1.655 s
[windows-jdk10] [INFO] Finished at: 2018-09-10T04:47:21Z
[windows-jdk10] [INFO] Final Memory: 13M/50M
[windows-jdk10] [INFO] ------------------------------------------------------------------------
[windows-jdk10] [INFO] ----------------------------------------------------------------------------
[windows-jdk10] [INFO] Using following parameters for creating project from Archetype: test-project-2:1.0
[windows-jdk10] [INFO] ----------------------------------------------------------------------------
[windows-jdk10] [INFO] Parameter: groupId, Value: com.mycompany
[windows-jdk10] [INFO] Parameter: artifactId, Value: myapp
[windows-jdk10] [INFO] Parameter: version, Value: 1.0-SNAPSHOT
[windows-jdk10] [INFO] Parameter: package, Value: com.mycompany.myapp
[windows-jdk10] [INFO] Parameter: packageInPathFormat, Value: com/mycompany/myapp
[windows-jdk10] [INFO] Project created from Archetype in dir: F:\jenkins\jenkins-slave\workspace\-box_maven-archetype_master-7AVMJNUR3VZV7RPVUBCE43H65NYTRWAOYFWSDDPCNSCWDYBAGBVQ@2\m\archetype-testing\archetype-final\target\test-classes\projects\roundtrip-2-recreatedproject\myapp
[windows-jdk10] Tests run: 1, Failures: 0, Errors: 0, Skipped: 0, Time elapsed: 4.37 sec - in org.apache.maven.archetype.test.ArchetyperRoundtripWithProxyIT
[windows-jdk10] Running org.apache.maven.archetype.test.RoundtripMultiModuleIT
[windows-jdk10] Picked up JAVA_TOOL_OPTIONS: -Dmaven.ext.class.path="f:\jenkins\jenkins-slave\workspace\-box_maven-archetype_master-7AVMJNUR3VZV7RPVUBCE43H65NYTRWAOYFWSDDPCNSCWDYBAGBVQ@2@tmp\withMavenffe9b34b\pipeline-maven-spy.jar" -Dorg.jenkinsci.plugins.pipeline.maven.reportsFolder="f:\jenkins\jenkins-slave\workspace\-box_maven-archetype_master-7AVMJNUR3VZV7RPVUBCE43H65NYTRWAOYFWSDDPCNSCWDYBAGBVQ@2@tmp\withMavenffe9b34b" 
[windows-jdk10] [INFO] [jenkins-event-spy] Jenkins Maven Event Spy is disabled
[windows-jdk10] [INFO] Scanning for projects...
[windows-jdk10] [INFO] 
[windows-jdk10] [INFO] ------------------------------------------------------------------------
[windows-jdk10] [INFO] Building proficio 1.0-SNAPSHOT
[windows-jdk10] [INFO] ------------------------------------------------------------------------
[windows-jdk10] [INFO] 
[windows-jdk10] [INFO] --- maven-resources-plugin:3.1.0:resources (default-resources) @ proficio ---
[windows-jdk10] [WARNING] Using platform encoding (Cp1252 actually) to copy filtered resources, i.e. build is platform dependent!
[windows-jdk10] [INFO] Copying 30 resources
[windows-jdk10] [INFO] 
[windows-jdk10] [INFO] --- maven-resources-plugin:3.1.0:testResources (default-testResources) @ proficio ---
[windows-jdk10] [WARNING] Using platform encoding (Cp1252 actually) to copy filtered resources, i.e. build is platform dependent!
[windows-jdk10] [INFO] Copying 2 resources
[windows-jdk10] [INFO] 
[windows-jdk10] [INFO] --- maven-archetype-plugin:3.0.2-SNAPSHOT:jar (default-jar) @ proficio ---
[windows-jdk10] [INFO] Building archetype jar: F:\jenkins\jenkins-slave\workspace\-box_maven-archetype_master-7AVMJNUR3VZV7RPVUBCE43H65NYTRWAOYFWSDDPCNSCWDYBAGBVQ@2\m\archetype-testing\archetype-final\target\test-classes\projects\roundtrip-multi\target\generated-sources\archetype\target\proficio-1.0-SNAPSHOT
[windows-jdk10] [INFO] ------------------------------------------------------------------------
[windows-jdk10] [INFO] BUILD SUCCESS
[windows-jdk10] [INFO] ------------------------------------------------------------------------
[windows-jdk10] [INFO] Total time: 1.298 s
[windows-jdk10] [INFO] Finished at: 2018-09-10T04:47:25Z
[windows-jdk10] [INFO] Final Memory: 13M/47M
[windows-jdk10] [INFO] ------------------------------------------------------------------------
[windows-jdk10] F:\jenkins\jenkins-slave\workspace\-box_maven-archetype_master-7AVMJNUR3VZV7RPVUBCE43H65NYTRWAOYFWSDDPCNSCWDYBAGBVQ@2\m\archetype-testing\archetype-final\target\test-classes\projects\roundtrip-multi\target\generated-sources\archetype\pom.xml
[windows-jdk10] F:\jenkins\jenkins-slave\workspace\-box_maven-archetype_master-7AVMJNUR3VZV7RPVUBCE43H65NYTRWAOYFWSDDPCNSCWDYBAGBVQ@2\m\archetype-testing\archetype-final\target\test-classes\projects\roundtrip-multi\target\generated-sources\archetype\src\main\resources\archetype-resources\.checkstyle
[windows-jdk10] F:\jenkins\jenkins-slave\workspace\-box_maven-archetype_master-7AVMJNUR3VZV7RPVUBCE43H65NYTRWAOYFWSDDPCNSCWDYBAGBVQ@2\m\archetype-testing\archetype-final\target\test-classes\projects\roundtrip-multi\target\generated-sources\archetype\src\main\resources\archetype-resources\.classpath
[windows-jdk10] F:\jenkins\jenkins-slave\workspace\-box_maven-archetype_master-7AVMJNUR3VZV7RPVUBCE43H65NYTRWAOYFWSDDPCNSCWDYBAGBVQ@2\m\archetype-testing\archetype-final\target\test-classes\projects\roundtrip-multi\target\generated-sources\archetype\src\main\resources\archetype-resources\pom.xml
[windows-jdk10] F:\jenkins\jenkins-slave\workspace\-box_maven-archetype_master-7AVMJNUR3VZV7RPVUBCE43H65NYTRWAOYFWSDDPCNSCWDYBAGBVQ@2\m\archetype-testing\archetype-final\target\test-classes\projects\roundtrip-multi\target\generated-sources\archetype\src\main\resources\archetype-resources\src\site\site.xml
[windows-jdk10] F:\jenkins\jenkins-slave\workspace\-box_maven-archetype_master-7AVMJNUR3VZV7RPVUBCE43H65NYTRWAOYFWSDDPCNSCWDYBAGBVQ@2\m\archetype-testing\archetype-final\target\test-classes\projects\roundtrip-multi\target\generated-sources\archetype\src\main\resources\archetype-resources\__rootArtifactId__-api\.checkstyle
[windows-jdk10] F:\jenkins\jenkins-slave\workspace\-box_maven-archetype_master-7AVMJNUR3VZV7RPVUBCE43H65NYTRWAOYFWSDDPCNSCWDYBAGBVQ@2\m\archetype-testing\archetype-final\target\test-classes\projects\roundtrip-multi\target\generated-sources\archetype\src\main\resources\archetype-resources\__rootArtifactId__-api\.classpath
[windows-jdk10] F:\jenkins\jenkins-slave\workspace\-box_maven-archetype_master-7AVMJNUR3VZV7RPVUBCE43H65NYTRWAOYFWSDDPCNSCWDYBAGBVQ@2\m\archetype-testing\archetype-final\target\test-classes\projects\roundtrip-multi\target\generated-sources\archetype\src\main\resources\archetype-resources\__rootArtifactId__-api\pom.xml
[windows-jdk10] F:\jenkins\jenkins-slave\workspace\-box_maven-archetype_master-7AVMJNUR3VZV7RPVUBCE43H65NYTRWAOYFWSDDPCNSCWDYBAGBVQ@2\m\archetype-testing\archetype-final\target\test-classes\projects\roundtrip-multi\target\generated-sources\archetype\src\main\resources\archetype-resources\__rootArtifactId__-api\src\main\java\api\Api.java
[windows-jdk10] F:\jenkins\jenkins-slave\workspace\-box_maven-archetype_master-7AVMJNUR3VZV7RPVUBCE43H65NYTRWAOYFWSDDPCNSCWDYBAGBVQ@2\m\archetype-testing\archetype-final\target\test-classes\projects\roundtrip-multi\target\generated-sources\archetype\src\main\resources\archetype-resources\__rootArtifactId__-cli\.checkstyle
[windows-jdk10] F:\jenkins\jenkins-slave\workspace\-box_maven-archetype_master-7AVMJNUR3VZV7RPVUBCE43H65NYTRWAOYFWSDDPCNSCWDYBAGBVQ@2\m\archetype-testing\archetype-final\target\test-classes\projects\roundtrip-multi\target\generated-sources\archetype\src\main\resources\archetype-resources\__rootArtifactId__-cli\.classpath
[windows-jdk10] F:\jenkins\jenkins-slave\workspace\-box_maven-archetype_master-7AVMJNUR3VZV7RPVUBCE43H65NYTRWAOYFWSDDPCNSCWDYBAGBVQ@2\m\archetype-testing\archetype-final\target\test-classes\projects\roundtrip-multi\target\generated-sources\archetype\src\main\resources\archetype-resources\__rootArtifactId__-cli\pom.xml
[windows-jdk10] F:\jenkins\jenkins-slave\workspace\-box_maven-archetype_master-7AVMJNUR3VZV7RPVUBCE43H65NYTRWAOYFWSDDPCNSCWDYBAGBVQ@2\m\archetype-testing\archetype-final\target\test-classes\projects\roundtrip-multi\target\generated-sources\archetype\src\main\resources\archetype-resources\__rootArtifactId__-cli\src\main\java\cli\Cli.java
[windows-jdk10] F:\jenkins\jenkins-slave\workspace\-box_maven-archetype_master-7AVMJNUR3VZV7RPVUBCE43H65NYTRWAOYFWSDDPCNSCWDYBAGBVQ@2\m\archetype-testing\archetype-final\target\test-classes\projects\roundtrip-multi\target\generated-sources\archetype\src\main\resources\archetype-resources\__rootArtifactId__-core\.checkstyle
[windows-jdk10] F:\jenkins\jenkins-slave\workspace\-box_maven-archetype_master-7AVMJNUR3VZV7RPVUBCE43H65NYTRWAOYFWSDDPCNSCWDYBAGBVQ@2\m\archetype-testing\archetype-final\target\test-classes\projects\roundtrip-multi\target\generated-sources\archetype\src\main\resources\archetype-resources\__rootArtifactId__-core\.classpath
[windows-jdk10] F:\jenkins\jenkins-slave\workspace\-box_maven-archetype_master-7AVMJNUR3VZV7RPVUBCE43H65NYTRWAOYFWSDDPCNSCWDYBAGBVQ@2\m\archetype-testing\archetype-final\target\test-classes\projects\roundtrip-multi\target\generated-sources\archetype\src\main\resources\archetype-resources\__rootArtifactId__-core\pom.xml
[windows-jdk10] F:\jenkins\jenkins-slave\workspace\-box_maven-archetype_master-7AVMJNUR3VZV7RPVUBCE43H65NYTRWAOYFWSDDPCNSCWDYBAGBVQ@2\m\archetype-testing\archetype-final\target\test-classes\projects\roundtrip-multi\target\generated-sources\archetype\src\main\resources\archetype-resources\__rootArtifactId__-core\src\main\java\core\Core.java
[windows-jdk10] F:\jenkins\jenkins-slave\workspace\-box_maven-archetype_master-7AVMJNUR3VZV7RPVUBCE43H65NYTRWAOYFWSDDPCNSCWDYBAGBVQ@2\m\archetype-testing\archetype-final\target\test-classes\projects\roundtrip-multi\target\generated-sources\archetype\src\main\resources\archetype-resources\__rootArtifactId__-model\.checkstyle
[windows-jdk10] F:\jenkins\jenkins-slave\workspace\-box_maven-archetype_master-7AVMJNUR3VZV7RPVUBCE43H65NYTRWAOYFWSDDPCNSCWDYBAGBVQ@2\m\archetype-testing\archetype-final\target\test-classes\projects\roundtrip-multi\target\generated-sources\archetype\src\main\resources\archetype-resources\__rootArtifactId__-model\.classpath
[windows-jdk10] F:\jenkins\jenkins-slave\workspace\-box_maven-archetype_master-7AVMJNUR3VZV7RPVUBCE43H65NYTRWAOYFWSDDPCNSCWDYBAGBVQ@2\m\archetype-testing\archetype-final\target\test-classes\projects\roundtrip-multi\target\generated-sources\archetype\src\main\resources\archetype-resources\__rootArtifactId__-model\pom.xml
[windows-jdk10] F:\jenkins\jenkins-slave\workspace\-box_maven-archetype_master-7AVMJNUR3VZV7RPVUBCE43H65NYTRWAOYFWSDDPCNSCWDYBAGBVQ@2\m\archetype-testing\archetype-final\target\test-classes\projects\roundtrip-multi\target\generated-sources\archetype\src\main\resources\archetype-resources\__rootArtifactId__-model\src\main\java\org\company\__parentArtifactId__\model\Model.java
[windows-jdk10] F:\jenkins\jenkins-slave\workspace\-box_maven-archetype_master-7AVMJNUR3VZV7RPVUBCE43H65NYTRWAOYFWSDDPCNSCWDYBAGBVQ@2\m\archetype-testing\archetype-final\target\test-classes\projects\roundtrip-multi\target\generated-sources\archetype\src\main\resources\archetype-resources\__rootArtifactId__-stores\pom.xml
[windows-jdk10] F:\jenkins\jenkins-slave\workspace\-box_maven-archetype_master-7AVMJNUR3VZV7RPVUBCE43H65NYTRWAOYFWSDDPCNSCWDYBAGBVQ@2\m\archetype-testing\archetype-final\target\test-classes\projects\roundtrip-multi\target\generated-sources\archetype\src\main\resources\archetype-resources\__rootArtifactId__-stores\__rootArtifactId__-store-memory\.checkstyle
[windows-jdk10] F:\jenkins\jenkins-slave\workspace\-box_maven-archetype_master-7AVMJNUR3VZV7RPVUBCE43H65NYTRWAOYFWSDDPCNSCWDYBAGBVQ@2\m\archetype-testing\archetype-final\target\test-classes\projects\roundtrip-multi\target\generated-sources\archetype\src\main\resources\archetype-resources\__rootArtifactId__-stores\__rootArtifactId__-store-memory\.classpath
[windows-jdk10] F:\jenkins\jenkins-slave\workspace\-box_maven-archetype_master-7AVMJNUR3VZV7RPVUBCE43H65NYTRWAOYFWSDDPCNSCWDYBAGBVQ@2\m\archetype-testing\archetype-final\target\test-classes\projects\roundtrip-multi\target\generated-sources\archetype\src\main\resources\archetype-resources\__rootArtifactId__-stores\__rootArtifactId__-store-memory\pom.xml
[windows-jdk10] F:\jenkins\jenkins-slave\workspace\-box_maven-archetype_master-7AVMJNUR3VZV7RPVUBCE43H65NYTRWAOYFWSDDPCNSCWDYBAGBVQ@2\m\archetype-testing\archetype-final\target\test-classes\projects\roundtrip-multi\target\generated-sources\archetype\src\main\resources\archetype-resources\__rootArtifactId__-stores\__rootArtifactId__-store-memory\src\main\java\store\memory\Memory.java
[windows-jdk10] F:\jenkins\jenkins-slave\workspace\-box_maven-archetype_master-7AVMJNUR3VZV7RPVUBCE43H65NYTRWAOYFWSDDPCNSCWDYBAGBVQ@2\m\archetype-testing\archetype-final\target\test-classes\projects\roundtrip-multi\target\generated-sources\archetype\src\main\resources\archetype-resources\__rootArtifactId__-stores\__rootArtifactId__-store-xstream\.checkstyle
[windows-jdk10] F:\jenkins\jenkins-slave\workspace\-box_maven-archetype_master-7AVMJNUR3VZV7RPVUBCE43H65NYTRWAOYFWSDDPCNSCWDYBAGBVQ@2\m\archetype-testing\archetype-final\target\test-classes\projects\roundtrip-multi\target\generated-sources\archetype\src\main\resources\archetype-resources\__rootArtifactId__-stores\__rootArtifactId__-store-xstream\.classpath
[windows-jdk10] F:\jenkins\jenkins-slave\workspace\-box_maven-archetype_master-7AVMJNUR3VZV7RPVUBCE43H65NYTRWAOYFWSDDPCNSCWDYBAGBVQ@2\m\archetype-testing\archetype-final\target\test-classes\projects\roundtrip-multi\target\generated-sources\archetype\src\main\resources\archetype-resources\__rootArtifactId__-stores\__rootArtifactId__-store-xstream\pom.xml
[windows-jdk10] F:\jenkins\jenkins-slave\workspace\-box_maven-archetype_master-7AVMJNUR3VZV7RPVUBCE43H65NYTRWAOYFWSDDPCNSCWDYBAGBVQ@2\m\archetype-testing\archetype-final\target\test-classes\projects\roundtrip-multi\target\generated-sources\archetype\src\main\resources\archetype-resources\__rootArtifactId__-stores\__rootArtifactId__-store-xstream\src\main\java\store\xstream\XStream.java
[windows-jdk10] F:\jenkins\jenkins-slave\workspace\-box_maven-archetype_master-7AVMJNUR3VZV7RPVUBCE43H65NYTRWAOYFWSDDPCNSCWDYBAGBVQ@2\m\archetype-testing\archetype-final\target\test-classes\projects\roundtrip-multi\target\generated-sources\archetype\src\main\resources\META-INF\maven\archetype-metadata.xml
[windows-jdk10] F:\jenkins\jenkins-slave\workspace\-box_maven-archetype_master-7AVMJNUR3VZV7RPVUBCE43H65NYTRWAOYFWSDDPCNSCWDYBAGBVQ@2\m\archetype-testing\archetype-final\target\test-classes\projects\roundtrip-multi\target\generated-sources\archetype\src\test\resources\projects\basic\archetype.properties
[windows-jdk10] F:\jenkins\jenkins-slave\workspace\-box_maven-archetype_master-7AVMJNUR3VZV7RPVUBCE43H65NYTRWAOYFWSDDPCNSCWDYBAGBVQ@2\m\archetype-testing\archetype-final\target\test-classes\projects\roundtrip-multi\target\generated-sources\archetype\src\test\resources\projects\basic\goal.txt
[windows-jdk10] F:\jenkins\jenkins-slave\workspace\-box_maven-archetype_master-7AVMJNUR3VZV7RPVUBCE43H65NYTRWAOYFWSDDPCNSCWDYBAGBVQ@2\m\archetype-testing\archetype-final\target\test-classes\projects\roundtrip-multi\target\generated-sources\archetype\target\classes\archetype-resources\.checkstyle
[windows-jdk10] F:\jenkins\jenkins-slave\workspace\-box_maven-archetype_master-7AVMJNUR3VZV7RPVUBCE43H65NYTRWAOYFWSDDPCNSCWDYBAGBVQ@2\m\archetype-testing\archetype-final\target\test-classes\projects\roundtrip-multi\target\generated-sources\archetype\target\classes\archetype-resources\.classpath
[windows-jdk10] F:\jenkins\jenkins-slave\workspace\-box_maven-archetype_master-7AVMJNUR3VZV7RPVUBCE43H65NYTRWAOYFWSDDPCNSCWDYBAGBVQ@2\m\archetype-testing\archetype-final\target\test-classes\projects\roundtrip-multi\target\generated-sources\archetype\target\classes\archetype-resources\pom.xml
[windows-jdk10] F:\jenkins\jenkins-slave\workspace\-box_maven-archetype_master-7AVMJNUR3VZV7RPVUBCE43H65NYTRWAOYFWSDDPCNSCWDYBAGBVQ@2\m\archetype-testing\archetype-final\target\test-classes\projects\roundtrip-multi\target\generated-sources\archetype\target\classes\archetype-resources\src\site\site.xml
[windows-jdk10] F:\jenkins\jenkins-slave\workspace\-box_maven-archetype_master-7AVMJNUR3VZV7RPVUBCE43H65NYTRWAOYFWSDDPCNSCWDYBAGBVQ@2\m\archetype-testing\archetype-final\target\test-classes\projects\roundtrip-multi\target\generated-sources\archetype\target\classes\archetype-resources\__rootArtifactId__-api\.checkstyle
[windows-jdk10] F:\jenkins\jenkins-slave\workspace\-box_maven-archetype_master-7AVMJNUR3VZV7RPVUBCE43H65NYTRWAOYFWSDDPCNSCWDYBAGBVQ@2\m\archetype-testing\archetype-final\target\test-classes\projects\roundtrip-multi\target\generated-sources\archetype\target\classes\archetype-resources\__rootArtifactId__-api\.classpath
[windows-jdk10] F:\jenkins\jenkins-slave\workspace\-box_maven-archetype_master-7AVMJNUR3VZV7RPVUBCE43H65NYTRWAOYFWSDDPCNSCWDYBAGBVQ@2\m\archetype-testing\archetype-final\target\test-classes\projects\roundtrip-multi\target\generated-sources\archetype\target\classes\archetype-resources\__rootArtifactId__-api\pom.xml
[windows-jdk10] F:\jenkins\jenkins-slave\workspace\-box_maven-archetype_master-7AVMJNUR3VZV7RPVUBCE43H65NYTRWAOYFWSDDPCNSCWDYBAGBVQ@2\m\archetype-testing\archetype-final\target\test-classes\projects\roundtrip-multi\target\generated-sources\archetype\target\classes\archetype-resources\__rootArtifactId__-api\src\main\java\api\Api.java
[windows-jdk10] F:\jenkins\jenkins-slave\workspace\-box_maven-archetype_master-7AVMJNUR3VZV7RPVUBCE43H65NYTRWAOYFWSDDPCNSCWDYBAGBVQ@2\m\archetype-testing\archetype-final\target\test-classes\projects\roundtrip-multi\target\generated-sources\archetype\target\classes\archetype-resources\__rootArtifactId__-cli\.checkstyle
[windows-jdk10] F:\jenkins\jenkins-slave\workspace\-box_maven-archetype_master-7AVMJNUR3VZV7RPVUBCE43H65NYTRWAOYFWSDDPCNSCWDYBAGBVQ@2\m\archetype-testing\archetype-final\target\test-classes\projects\roundtrip-multi\target\generated-sources\archetype\target\classes\archetype-resources\__rootArtifactId__-cli\.classpath
[windows-jdk10] F:\jenkins\jenkins-slave\workspace\-box_maven-archetype_master-7AVMJNUR3VZV7RPVUBCE43H65NYTRWAOYFWSDDPCNSCWDYBAGBVQ@2\m\archetype-testing\archetype-final\target\test-classes\projects\roundtrip-multi\target\generated-sources\archetype\target\classes\archetype-resources\__rootArtifactId__-cli\pom.xml
[windows-jdk10] F:\jenkins\jenkins-slave\workspace\-box_maven-archetype_master-7AVMJNUR3VZV7RPVUBCE43H65NYTRWAOYFWSDDPCNSCWDYBAGBVQ@2\m\archetype-testing\archetype-final\target\test-classes\projects\roundtrip-multi\target\generated-sources\archetype\target\classes\archetype-resources\__rootArtifactId__-cli\src\main\java\cli\Cli.java
[windows-jdk10] F:\jenkins\jenkins-slave\workspace\-box_maven-archetype_master-7AVMJNUR3VZV7RPVUBCE43H65NYTRWAOYFWSDDPCNSCWDYBAGBVQ@2\m\archetype-testing\archetype-final\target\test-classes\projects\roundtrip-multi\target\generated-sources\archetype\target\classes\archetype-resources\__rootArtifactId__-core\.checkstyle
[windows-jdk10] F:\jenkins\jenkins-slave\workspace\-box_maven-archetype_master-7AVMJNUR3VZV7RPVUBCE43H65NYTRWAOYFWSDDPCNSCWDYBAGBVQ@2\m\archetype-testing\archetype-final\target\test-classes\projects\roundtrip-multi\target\generated-sources\archetype\target\classes\archetype-resources\__rootArtifactId__-core\.classpath
[windows-jdk10] F:\jenkins\jenkins-slave\workspace\-box_maven-archetype_master-7AVMJNUR3VZV7RPVUBCE43H65NYTRWAOYFWSDDPCNSCWDYBAGBVQ@2\m\archetype-testing\archetype-final\target\test-classes\projects\roundtrip-multi\target\generated-sources\archetype\target\classes\archetype-resources\__rootArtifactId__-core\pom.xml
[windows-jdk10] F:\jenkins\jenkins-slave\workspace\-box_maven-archetype_master-7AVMJNUR3VZV7RPVUBCE43H65NYTRWAOYFWSDDPCNSCWDYBAGBVQ@2\m\archetype-testing\archetype-final\target\test-classes\projects\roundtrip-multi\target\generated-sources\archetype\target\classes\archetype-resources\__rootArtifactId__-core\src\main\java\core\Core.java
[windows-jdk10] F:\jenkins\jenkins-slave\workspace\-box_maven-archetype_master-7AVMJNUR3VZV7RPVUBCE43H65NYTRWAOYFWSDDPCNSCWDYBAGBVQ@2\m\archetype-testing\archetype-final\target\test-classes\projects\roundtrip-multi\target\generated-sources\archetype\target\classes\archetype-resources\__rootArtifactId__-model\.checkstyle
[windows-jdk10] F:\jenkins\jenkins-slave\workspace\-box_maven-archetype_master-7AVMJNUR3VZV7RPVUBCE43H65NYTRWAOYFWSDDPCNSCWDYBAGBVQ@2\m\archetype-testing\archetype-final\target\test-classes\projects\roundtrip-multi\target\generated-sources\archetype\target\classes\archetype-resources\__rootArtifactId__-model\.classpath
[windows-jdk10] F:\jenkins\jenkins-slave\workspace\-box_maven-archetype_master-7AVMJNUR3VZV7RPVUBCE43H65NYTRWAOYFWSDDPCNSCWDYBAGBVQ@2\m\archetype-testing\archetype-final\target\test-classes\projects\roundtrip-multi\target\generated-sources\archetype\target\classes\archetype-resources\__rootArtifactId__-model\pom.xml
[windows-jdk10] F:\jenkins\jenkins-slave\workspace\-box_maven-archetype_master-7AVMJNUR3VZV7RPVUBCE43H65NYTRWAOYFWSDDPCNSCWDYBAGBVQ@2\m\archetype-testing\archetype-final\target\test-classes\projects\roundtrip-multi\target\generated-sources\archetype\target\classes\archetype-resources\__rootArtifactId__-model\src\main\java\org\company\__parentArtifactId__\model\Model.java
[windows-jdk10] F:\jenkins\jenkins-slave\workspace\-box_maven-archetype_master-7AVMJNUR3VZV7RPVUBCE43H65NYTRWAOYFWSDDPCNSCWDYBAGBVQ@2\m\archetype-testing\archetype-final\target\test-classes\projects\roundtrip-multi\target\generated-sources\archetype\target\classes\archetype-resources\__rootArtifactId__-stores\pom.xml
[windows-jdk10] F:\jenkins\jenkins-slave\workspace\-box_maven-archetype_master-7AVMJNUR3VZV7RPVUBCE43H65NYTRWAOYFWSDDPCNSCWDYBAGBVQ@2\m\archetype-testing\archetype-final\target\test-classes\projects\roundtrip-multi\target\generated-sources\archetype\target\classes\archetype-resources\__rootArtifactId__-stores\__rootArtifactId__-store-memory\.checkstyle
[windows-jdk10] F:\jenkins\jenkins-slave\workspace\-box_maven-archetype_master-7AVMJNUR3VZV7RPVUBCE43H65NYTRWAOYFWSDDPCNSCWDYBAGBVQ@2\m\archetype-testing\archetype-final\target\test-classes\projects\roundtrip-multi\target\generated-sources\archetype\target\classes\archetype-resources\__rootArtifactId__-stores\__rootArtifactId__-store-memory\.classpath
[windows-jdk10] F:\jenkins\jenkins-slave\workspace\-box_maven-archetype_master-7AVMJNUR3VZV7RPVUBCE43H65NYTRWAOYFWSDDPCNSCWDYBAGBVQ@2\m\archetype-testing\archetype-final\target\test-classes\projects\roundtrip-multi\target\generated-sources\archetype\target\classes\archetype-resources\__rootArtifactId__-stores\__rootArtifactId__-store-memory\pom.xml
[windows-jdk10] F:\jenkins\jenkins-slave\workspace\-box_maven-archetype_master-7AVMJNUR3VZV7RPVUBCE43H65NYTRWAOYFWSDDPCNSCWDYBAGBVQ@2\m\archetype-testing\archetype-final\target\test-classes\projects\roundtrip-multi\target\generated-sources\archetype\target\classes\archetype-resources\__rootArtifactId__-stores\__rootArtifactId__-store-memory\src\main\java\store\memory\Memory.java
[windows-jdk10] F:\jenkins\jenkins-slave\workspace\-box_maven-archetype_master-7AVMJNUR3VZV7RPVUBCE43H65NYTRWAOYFWSDDPCNSCWDYBAGBVQ@2\m\archetype-testing\archetype-final\target\test-classes\projects\roundtrip-multi\target\generated-sources\archetype\target\classes\archetype-resources\__rootArtifactId__-stores\__rootArtifactId__-store-xstream\.checkstyle
[windows-jdk10] F:\jenkins\jenkins-slave\workspace\-box_maven-archetype_master-7AVMJNUR3VZV7RPVUBCE43H65NYTRWAOYFWSDDPCNSCWDYBAGBVQ@2\m\archetype-testing\archetype-final\target\test-classes\projects\roundtrip-multi\target\generated-sources\archetype\target\classes\archetype-resources\__rootArtifactId__-stores\__rootArtifactId__-store-xstream\.classpath
[windows-jdk10] F:\jenkins\jenkins-slave\workspace\-box_maven-archetype_master-7AVMJNUR3VZV7RPVUBCE43H65NYTRWAOYFWSDDPCNSCWDYBAGBVQ@2\m\archetype-testing\archetype-final\target\test-classes\projects\roundtrip-multi\target\generated-sources\archetype\target\classes\archetype-resources\__rootArtifactId__-stores\__rootArtifactId__-store-xstream\pom.xml
[windows-jdk10] F:\jenkins\jenkins-slave\workspace\-box_maven-archetype_master-7AVMJNUR3VZV7RPVUBCE43H65NYTRWAOYFWSDDPCNSCWDYBAGBVQ@2\m\archetype-testing\archetype-final\target\test-classes\projects\roundtrip-multi\target\generated-sources\archetype\target\classes\archetype-resources\__rootArtifactId__-stores\__rootArtifactId__-store-xstream\src\main\java\store\xstream\XStream.java
[windows-jdk10] F:\jenkins\jenkins-slave\workspace\-box_maven-archetype_master-7AVMJNUR3VZV7RPVUBCE43H65NYTRWAOYFWSDDPCNSCWDYBAGBVQ@2\m\archetype-testing\archetype-final\target\test-classes\projects\roundtrip-multi\target\generated-sources\archetype\target\classes\META-INF\maven\archetype-metadata.xml
[windows-jdk10] F:\jenkins\jenkins-slave\workspace\-box_maven-archetype_master-7AVMJNUR3VZV7RPVUBCE43H65NYTRWAOYFWSDDPCNSCWDYBAGBVQ@2\m\archetype-testing\archetype-final\target\test-classes\projects\roundtrip-multi\target\generated-sources\archetype\target\proficio-1.0-SNAPSHOT.jar
[windows-jdk10] F:\jenkins\jenkins-slave\workspace\-box_maven-archetype_master-7AVMJNUR3VZV7RPVUBCE43H65NYTRWAOYFWSDDPCNSCWDYBAGBVQ@2\m\archetype-testing\archetype-final\target\test-classes\projects\roundtrip-multi\target\generated-sources\archetype\target\test-classes\projects\basic\archetype.properties
[windows-jdk10] F:\jenkins\jenkins-slave\workspace\-box_maven-archetype_master-7AVMJNUR3VZV7RPVUBCE43H65NYTRWAOYFWSDDPCNSCWDYBAGBVQ@2\m\archetype-testing\archetype-final\target\test-classes\projects\roundtrip-multi\target\generated-sources\archetype\target\test-classes\projects\basic\goal.txt
[windows-jdk10] [INFO] ----------------------------------------------------------------------------
[windows-jdk10] [INFO] Using following parameters for creating project from Archetype: proficio:1.0-SNAPSHOT
[windows-jdk10] [INFO] ----------------------------------------------------------------------------
[windows-jdk10] [INFO] Parameter: groupId, Value: com.mycompany
[windows-jdk10] [INFO] Parameter: artifactId, Value: myapp
[windows-jdk10] [INFO] Parameter: version, Value: 1.0-SNAPSHOT
[windows-jdk10] [INFO] Parameter: package, Value: com.mycompany.myapp
[windows-jdk10] [INFO] Parameter: packageInPathFormat, Value: com/mycompany/myapp
[windows-jdk10] WARNING: An illegal reflective access operation has occurred
[windows-jdk10] WARNING: Illegal reflective access by org.dom4j.io.SAXContentHandler (file:/f:/jenkins/jenkins-slave/workspace/-box_maven-archetype_master-7AVMJNUR3VZV7RPVUBCE43H65NYTRWAOYFWSDDPCNSCWDYBAGBVQ%402/.repository/dom4j/dom4j/1.6.1/dom4j-1.6.1.jar) to method com.sun.org.apache.xerces.internal.parsers.AbstractSAXParser$LocatorProxy.getEncoding()
[windows-jdk10] WARNING: Please consider reporting this to the maintainers of org.dom4j.io.SAXContentHandler
[windows-jdk10] WARNING: Use --illegal-access=warn to enable warnings of further illegal reflective access operations
[windows-jdk10] WARNING: All illegal access operations will be denied in a future release
[windows-jdk10] [INFO] Parent element not overwritten in F:\jenkins\jenkins-slave\workspace\-box_maven-archetype_master-7AVMJNUR3VZV7RPVUBCE43H65NYTRWAOYFWSDDPCNSCWDYBAGBVQ@2\m\archetype-testing\archetype-final\target\test-classes\projects\roundtrip-multi-recreated\myapp\myapp-api\pom.xml
[windows-jdk10] [INFO] Parent element not overwritten in F:\jenkins\jenkins-slave\workspace\-box_maven-archetype_master-7AVMJNUR3VZV7RPVUBCE43H65NYTRWAOYFWSDDPCNSCWDYBAGBVQ@2\m\archetype-testing\archetype-final\target\test-classes\projects\roundtrip-multi-recreated\myapp\myapp-cli\pom.xml
[windows-jdk10] [INFO] Parent element not overwritten in F:\jenkins\jenkins-slave\workspace\-box_maven-archetype_master-7AVMJNUR3VZV7RPVUBCE43H65NYTRWAOYFWSDDPCNSCWDYBAGBVQ@2\m\archetype-testing\archetype-final\target\test-classes\projects\roundtrip-multi-recreated\myapp\myapp-core\pom.xml
[windows-jdk10] [INFO] Parent element not overwritten in F:\jenkins\jenkins-slave\workspace\-box_maven-archetype_master-7AVMJNUR3VZV7RPVUBCE43H65NYTRWAOYFWSDDPCNSCWDYBAGBVQ@2\m\archetype-testing\archetype-final\target\test-classes\projects\roundtrip-multi-recreated\myapp\myapp-model\pom.xml
[windows-jdk10] [INFO] Parent element not overwritten in F:\jenkins\jenkins-slave\workspace\-box_maven-archetype_master-7AVMJNUR3VZV7RPVUBCE43H65NYTRWAOYFWSDDPCNSCWDYBAGBVQ@2\m\archetype-testing\archetype-final\target\test-classes\projects\roundtrip-multi-recreated\myapp\myapp-stores\pom.xml
[windows-jdk10] [INFO] Parent element not overwritten in F:\jenkins\jenkins-slave\workspace\-box_maven-archetype_master-7AVMJNUR3VZV7RPVUBCE43H65NYTRWAOYFWSDDPCNSCWDYBAGBVQ@2\m\archetype-testing\archetype-final\target\test-classes\projects\roundtrip-multi-recreated\myapp\myapp-stores\myapp-store-memory\pom.xml
[windows-jdk10] [INFO] Parent element not overwritten in F:\jenkins\jenkins-slave\workspace\-box_maven-archetype_master-7AVMJNUR3VZV7RPVUBCE43H65NYTRWAOYFWSDDPCNSCWDYBAGBVQ@2\m\archetype-testing\archetype-final\target\test-classes\projects\roundtrip-multi-recreated\myapp\myapp-stores\myapp-store-xstream\pom.xml
[windows-jdk10] [INFO] Project created from Archetype in dir: F:\jenkins\jenkins-slave\workspace\-box_maven-archetype_master-7AVMJNUR3VZV7RPVUBCE43H65NYTRWAOYFWSDDPCNSCWDYBAGBVQ@2\m\archetype-testing\archetype-final\target\test-classes\projects\roundtrip-multi-recreated\myapp
[windows-jdk10] Tests run: 1, Failures: 0, Errors: 0, Skipped: 0, Time elapsed: 3.979 sec - in org.apache.maven.archetype.test.RoundtripMultiModuleIT
[windows-jdk10] 
[windows-jdk10] Results :
[windows-jdk10] 
[windows-jdk10] Tests run: 14, Failures: 0, Errors: 0, Skipped: 0
[windows-jdk10] 
[windows-jdk10] [INFO] 
[windows-jdk10] [INFO] --- maven-checkstyle-plugin:3.0.0:check (checkstyle-check) @ archetype-final ---
[windows-jdk10] [INFO] 
[windows-jdk10] [INFO] --- maven-failsafe-plugin:2.19.1:verify (default) @ archetype-final ---
[windows-jdk10] [INFO] ------------------------------------------------------------------------
[windows-jdk10] [INFO] Reactor Summary:
[windows-jdk10] [INFO] 
[windows-jdk10] [INFO] Maven Archetype .................................... SUCCESS [ 28.119 s]
[windows-jdk10] [INFO] Maven Archetype Models ............................. SUCCESS [  0.648 s]
[windows-jdk10] [INFO] Maven Archetype Catalog Model ...................... SUCCESS [  7.053 s]
[windows-jdk10] [INFO] Maven Archetype Descriptor Model ................... SUCCESS [  1.753 s]
[windows-jdk10] [INFO] Maven Archetype Testing ............................ SUCCESS [  0.378 s]
[windows-jdk10] [INFO] Maven Archetype Webapp Repository .................. SUCCESS [  2.802 s]
[windows-jdk10] [INFO] Maven Archetype Webapp Proxy ....................... SUCCESS [  0.928 s]
[windows-jdk10] [INFO] Maven Archetype Common ............................. SUCCESS [ 24.645 s]
[windows-jdk10] [INFO] Maven Archetype Packaging .......................... SUCCESS [  0.366 s]
[windows-jdk10] [INFO] Maven Archetype Plugin ............................. SUCCESS [02:35 min]
[windows-jdk10] [INFO] Maven Archetype Testing Final ...................... SUCCESS [01:11 min]
[windows-jdk10] [INFO] ------------------------------------------------------------------------
[windows-jdk10] [INFO] BUILD SUCCESS
[windows-jdk10] [INFO] ------------------------------------------------------------------------
[windows-jdk10] [INFO] Total time: 04:55 min
[windows-jdk10] [INFO] Finished at: 2018-09-10T04:47:26Z
[windows-jdk10] [INFO] Final Memory: 61M/207M
[windows-jdk10] [INFO] ------------------------------------------------------------------------
[windows-jdk10] [INFO] [jenkins-event-spy] Generated F:\jenkins\jenkins-slave\workspace\-box_maven-archetype_master-7AVMJNUR3VZV7RPVUBCE43H65NYTRWAOYFWSDDPCNSCWDYBAGBVQ@2@tmp\withMavenffe9b34b\maven-spy-20180910-044230-6537581403044070786602.log
[Pipeline] [windows-jdk10] }
[Pipeline] [windows-jdk10] // dir
[Pipeline] [windows-jdk10] }
[windows-jdk10] [withMaven] invokerPublisher - Archive invoker results for Maven artifact MavenArtifact{org.apache.maven.plugins:maven-archetype-plugin::3.0.2-SNAPSHOT(version: 3.0.2-SNAPSHOT, snapshot:false) } generated by PluginInvocation{org.apache.maven.plugins:maven-invoker-plugin:3.1.0@run  integration-test}: m\maven-archetype-plugin\target\invoker-reports\*.xml
[windows-jdk10] performing MavenInvokerRecorder, reportsFilenamePattern:'**/m\maven-archetype-plugin\target\invoker-reports/BUILD*.xml', invokerBuildDir:'**/m\maven-archetype-plugin\target\it\projects'
[windows-jdk10] Found reports:[f:\jenkins\jenkins-slave\workspace\-box_maven-archetype_master-7AVMJNUR3VZV7RPVUBCE43H65NYTRWAOYFWSDDPCNSCWDYBAGBVQ@2\m\maven-archetype-plugin\target\invoker-reports\BUILD-ARCHETYPE-241_filter-directory.xml, f:\jenkins\jenkins-slave\workspace\-box_maven-archetype_master-7AVMJNUR3VZV7RPVUBCE43H65NYTRWAOYFWSDDPCNSCWDYBAGBVQ@2\m\maven-archetype-plugin\target\invoker-reports\BUILD-ARCHETYPE-517_failing-goals.xml, f:\jenkins\jenkins-slave\workspace\-box_maven-archetype_master-7AVMJNUR3VZV7RPVUBCE43H65NYTRWAOYFWSDDPCNSCWDYBAGBVQ@2\m\maven-archetype-plugin\target\invoker-reports\BUILD-ARCHETYPE-520_mirror.xml, f:\jenkins\jenkins-slave\workspace\-box_maven-archetype_master-7AVMJNUR3VZV7RPVUBCE43H65NYTRWAOYFWSDDPCNSCWDYBAGBVQ@2\m\maven-archetype-plugin\target\invoker-reports\BUILD-ARCHETYPE-521_archetype-repo.xml, f:\jenkins\jenkins-slave\workspace\-box_maven-archetype_master-7AVMJNUR3VZV7RPVUBCE43H65NYTRWAOYFWSDDPCNSCWDYBAGBVQ@2\m\maven-archetype-plugin\target\invoker-reports\BUILD-build-archetype-and-run-its-with-existing-parent.xml, f:\jenkins\jenkins-slave\workspace\-box_maven-archetype_master-7AVMJNUR3VZV7RPVUBCE43H65NYTRWAOYFWSDDPCNSCWDYBAGBVQ@2\m\maven-archetype-plugin\target\invoker-reports\BUILD-build-archetype-ignore-eol-encoding.xml, f:\jenkins\jenkins-slave\workspace\-box_maven-archetype_master-7AVMJNUR3VZV7RPVUBCE43H65NYTRWAOYFWSDDPCNSCWDYBAGBVQ@2\m\maven-archetype-plugin\target\invoker-reports\BUILD-build-archetype.xml, f:\jenkins\jenkins-slave\workspace\-box_maven-archetype_master-7AVMJNUR3VZV7RPVUBCE43H65NYTRWAOYFWSDDPCNSCWDYBAGBVQ@2\m\maven-archetype-plugin\target\invoker-reports\BUILD-create-from-project-exclude-patterns.xml, f:\jenkins\jenkins-slave\workspace\-box_maven-archetype_master-7AVMJNUR3VZV7RPVUBCE43H65NYTRWAOYFWSDDPCNSCWDYBAGBVQ@2\m\maven-archetype-plugin\target\invoker-reports\BUILD-create-from-project.xml, f:\jenkins\jenkins-slave\workspace\-box_maven-archetype_master-7AVMJNUR3VZV7RPVUBCE43H65NYTRWAOYFWSDDPCNSCWDYBAGBVQ@2\m\maven-archetype-plugin\target\invoker-reports\BUILD-generate-basic.xml, f:\jenkins\jenkins-slave\workspace\-box_maven-archetype_master-7AVMJNUR3VZV7RPVUBCE43H65NYTRWAOYFWSDDPCNSCWDYBAGBVQ@2\m\maven-archetype-plugin\target\invoker-reports\BUILD-property-setting-cli.xml]
[windows-jdk10] Found logs:[f:\jenkins\jenkins-slave\workspace\-box_maven-archetype_master-7AVMJNUR3VZV7RPVUBCE43H65NYTRWAOYFWSDDPCNSCWDYBAGBVQ@2\m\maven-archetype-plugin\target\it\projects\ARCHETYPE-241_filter-directory\build.log, f:\jenkins\jenkins-slave\workspace\-box_maven-archetype_master-7AVMJNUR3VZV7RPVUBCE43H65NYTRWAOYFWSDDPCNSCWDYBAGBVQ@2\m\maven-archetype-plugin\target\it\projects\ARCHETYPE-517_failing-goals\build.log, f:\jenkins\jenkins-slave\workspace\-box_maven-archetype_master-7AVMJNUR3VZV7RPVUBCE43H65NYTRWAOYFWSDDPCNSCWDYBAGBVQ@2\m\maven-archetype-plugin\target\it\projects\ARCHETYPE-520_mirror\build.log, f:\jenkins\jenkins-slave\workspace\-box_maven-archetype_master-7AVMJNUR3VZV7RPVUBCE43H65NYTRWAOYFWSDDPCNSCWDYBAGBVQ@2\m\maven-archetype-plugin\target\it\projects\ARCHETYPE-521_archetype-repo\build.log, f:\jenkins\jenkins-slave\workspace\-box_maven-archetype_master-7AVMJNUR3VZV7RPVUBCE43H65NYTRWAOYFWSDDPCNSCWDYBAGBVQ@2\m\maven-archetype-plugin\target\it\projects\build-archetype-and-run-its-with-existing-parent\build.log, f:\jenkins\jenkins-slave\workspace\-box_maven-archetype_master-7AVMJNUR3VZV7RPVUBCE43H65NYTRWAOYFWSDDPCNSCWDYBAGBVQ@2\m\maven-archetype-plugin\target\it\projects\build-archetype-and-run-its-with-existing-parent\target\test-classes\projects\basic\project\project\basic\build.log, f:\jenkins\jenkins-slave\workspace\-box_maven-archetype_master-7AVMJNUR3VZV7RPVUBCE43H65NYTRWAOYFWSDDPCNSCWDYBAGBVQ@2\m\maven-archetype-plugin\target\it\projects\build-archetype-ignore-eol-encoding\build.log, f:\jenkins\jenkins-slave\workspace\-box_maven-archetype_master-7AVMJNUR3VZV7RPVUBCE43H65NYTRWAOYFWSDDPCNSCWDYBAGBVQ@2\m\maven-archetype-plugin\target\it\projects\build-archetype-ignore-eol-encoding\target\test-classes\projects\basic\project\basic\build.log, f:\jenkins\jenkins-slave\workspace\-box_maven-archetype_master-7AVMJNUR3VZV7RPVUBCE43H65NYTRWAOYFWSDDPCNSCWDYBAGBVQ@2\m\maven-archetype-plugin\target\it\projects\build-archetype\build.log, f:\jenkins\jenkins-slave\workspace\-box_maven-archetype_master-7AVMJNUR3VZV7RPVUBCE43H65NYTRWAOYFWSDDPCNSCWDYBAGBVQ@2\m\maven-archetype-plugin\target\it\projects\build-archetype\target\test-classes\projects\basic\project\basic\build.log, f:\jenkins\jenkins-slave\workspace\-box_maven-archetype_master-7AVMJNUR3VZV7RPVUBCE43H65NYTRWAOYFWSDDPCNSCWDYBAGBVQ@2\m\maven-archetype-plugin\target\it\projects\create-from-project-exclude-patterns\build.log, f:\jenkins\jenkins-slave\workspace\-box_maven-archetype_master-7AVMJNUR3VZV7RPVUBCE43H65NYTRWAOYFWSDDPCNSCWDYBAGBVQ@2\m\maven-archetype-plugin\target\it\projects\create-from-project-exclude-patterns\target\generated-sources\archetype\src\main\resources\archetype-resources\build.log, f:\jenkins\jenkins-slave\workspace\-box_maven-archetype_master-7AVMJNUR3VZV7RPVUBCE43H65NYTRWAOYFWSDDPCNSCWDYBAGBVQ@2\m\maven-archetype-plugin\target\it\projects\create-from-project-exclude-patterns\target\generated-sources\archetype\target\classes\archetype-resources\build.log, f:\jenkins\jenkins-slave\workspace\-box_maven-archetype_master-7AVMJNUR3VZV7RPVUBCE43H65NYTRWAOYFWSDDPCNSCWDYBAGBVQ@2\m\maven-archetype-plugin\target\it\projects\create-from-project\build.log, f:\jenkins\jenkins-slave\workspace\-box_maven-archetype_master-7AVMJNUR3VZV7RPVUBCE43H65NYTRWAOYFWSDDPCNSCWDYBAGBVQ@2\m\maven-archetype-plugin\target\it\projects\create-from-project\target\generated-sources\archetype\src\main\resources\archetype-resources\build.log, f:\jenkins\jenkins-slave\workspace\-box_maven-archetype_master-7AVMJNUR3VZV7RPVUBCE43H65NYTRWAOYFWSDDPCNSCWDYBAGBVQ@2\m\maven-archetype-plugin\target\it\projects\create-from-project\target\generated-sources\archetype\target\classes\archetype-resources\build.log, f:\jenkins\jenkins-slave\workspace\-box_maven-archetype_master-7AVMJNUR3VZV7RPVUBCE43H65NYTRWAOYFWSDDPCNSCWDYBAGBVQ@2\m\maven-archetype-plugin\target\it\projects\generate-basic\build.log, f:\jenkins\jenkins-slave\workspace\-box_maven-archetype_master-7AVMJNUR3VZV7RPVUBCE43H65NYTRWAOYFWSDDPCNSCWDYBAGBVQ@2\m\maven-archetype-plugin\target\it\projects\property-setting-cli\build.log]
[windows-jdk10] Finished parsing Maven Invoker results (found 11)
[windows-jdk10] [withMaven] junitPublisher - Archive test results for Maven artifact org.apache.maven.archetype:archetype-catalog:3.0.2-SNAPSHOT generated by maven-surefire-plugin:test (default-test): m\archetype-models\archetype-catalog\target\surefire-reports\*.xml
[windows-jdk10] Recording test results
[windows-jdk10] None of the test reports contained any result
[windows-jdk10] [withMaven] junitPublisher - Archive test results for Maven artifact org.apache.maven.archetype:archetype-descriptor:3.0.2-SNAPSHOT generated by maven-surefire-plugin:test (default-test): m\archetype-models\archetype-descriptor\target\surefire-reports\*.xml
[windows-jdk10] Recording test results
[windows-jdk10] None of the test reports contained any result
[windows-jdk10] [withMaven] junitPublisher - Archive test results for Maven artifact org.apache.maven.archetype:archetype-repository:3.0.2-SNAPSHOT generated by maven-surefire-plugin:test (default-test): m\archetype-testing\archetype-repository\target\surefire-reports\*.xml
[windows-jdk10] Recording test results
[windows-jdk10] None of the test reports contained any result
[windows-jdk10] [withMaven] junitPublisher - Archive test results for Maven artifact org.apache.maven.archetype:archetype-proxy:3.0.2-SNAPSHOT generated by maven-surefire-plugin:test (default-test): m\archetype-testing\archetype-proxy\target\surefire-reports\*.xml
[windows-jdk10] Recording test results
[windows-jdk10] None of the test reports contained any result
[windows-jdk10] [withMaven] junitPublisher - Archive test results for Maven artifact org.apache.maven.archetype:archetype-common:3.0.2-SNAPSHOT generated by maven-surefire-plugin:test (default-test): m\archetype-common\target\surefire-reports\*.xml
[windows-jdk10] Recording test results
[windows-jdk10] [withMaven] junitPublisher - Archive test results for Maven artifact org.apache.maven.archetype:archetype-packaging:3.0.2-SNAPSHOT generated by maven-surefire-plugin:test (default-test): m\archetype-packaging\target\surefire-reports\*.xml
[windows-jdk10] Recording test results
[windows-jdk10] None of the test reports contained any result
[windows-jdk10] [withMaven] junitPublisher - Archive test results for Maven artifact org.apache.maven.plugins:maven-archetype-plugin:3.0.2-SNAPSHOT generated by maven-surefire-plugin:test (default-test): m\maven-archetype-plugin\target\surefire-reports\*.xml
[windows-jdk10] Recording test results
[windows-jdk10] [withMaven] junitPublisher - Archive test results for Maven artifact org.apache.maven.archetype:archetype-final:3.0.2-SNAPSHOT generated by maven-surefire-plugin:test (default-test): m\archetype-testing\archetype-final\target\surefire-reports\*.xml
[windows-jdk10] Recording test results
[windows-jdk10] None of the test reports contained any result
[windows-jdk10] [withMaven] junitPublisher - Archive test results for Maven artifact org.apache.maven.archetype:archetype-final:3.0.2-SNAPSHOT generated by maven-failsafe-plugin:integration-test (default): m\archetype-testing\archetype-final\target\failsafe-reports\*.xml
[windows-jdk10] Recording test results
[Pipeline] [windows-jdk10] // withMaven
[Pipeline] [windows-jdk10] cleanWs
[windows-jdk10] [WS-CLEANUP] Deleting project workspace...[WS-CLEANUP] done
[Pipeline] [windows-jdk10] }
[Pipeline] [windows-jdk10] // stage
[Pipeline] [windows-jdk10] }
[Pipeline] [windows-jdk10] // node
[Pipeline] [windows-jdk10] }
[Pipeline] // parallel
[Pipeline] stage
[Pipeline] { (Notifications)
[Pipeline] echo
Build result: UNSTABLE
[Pipeline] jiraIssueSelector
[Pipeline] emailext
Mime
  • Unnamed multipart/mixed (inline, None, 0 bytes)
View raw message