maven-notifications mailing list archives

Site index · List index
Message view « Date » · « Thread »
Top « Date » · « Thread »
From Apache Jenkins Server <jenk...@builds.apache.org>
Subject Build unstable in Jenkins: Maven TLP » maven-scm » master #60
Date Sat, 08 Sep 2018 23:03:50 GMT
See https://builds.apache.org/job/maven-box/job/maven-scm/job/master/60/

No changes.

6 tests failed.
FAILED:  org.apache.maven.scm.provider.git.gitexe.command.checkin.GitCheckInCommandNoBranchTest.testCheckinNoBranch

Error Message:
The command result success flag was false.

Stack Trace:
junit.framework.AssertionFailedError: The command result success flag was false.
	at org.apache.maven.scm.provider.git.gitexe.command.checkin.GitCheckInCommandNoBranchTest.checkoutRepo(GitCheckInCommandNoBranchTest.java:100)
	at org.apache.maven.scm.provider.git.gitexe.command.checkin.GitCheckInCommandNoBranchTest.testCheckinNoBranch(GitCheckInCommandNoBranchTest.java:86)


FAILED:  org.apache.maven.scm.provider.git.gitexe.command.checkin.GitCheckInCommandNoBranchTest.testCheckinNoBranch

Error Message:
The command result success flag was false.

Stack Trace:
junit.framework.AssertionFailedError: The command result success flag was false.
	at org.apache.maven.scm.provider.git.gitexe.command.checkin.GitCheckInCommandNoBranchTest.checkoutRepo(GitCheckInCommandNoBranchTest.java:100)
	at org.apache.maven.scm.provider.git.gitexe.command.checkin.GitCheckInCommandNoBranchTest.testCheckinNoBranch(GitCheckInCommandNoBranchTest.java:86)


FAILED:  org.apache.maven.scm.provider.git.gitexe.command.checkin.GitCheckInCommandTest.testCheckinAfterRename

Error Message:
The command result success flag was false.

Stack Trace:
junit.framework.AssertionFailedError: The command result success flag was false.
	at org.apache.maven.scm.provider.git.gitexe.command.checkin.GitCheckInCommandTest.checkoutRepoInto(GitCheckInCommandTest.java:185)
	at org.apache.maven.scm.provider.git.gitexe.command.checkin.GitCheckInCommandTest.testCheckinAfterRename(GitCheckInCommandTest.java:100)


FAILED:  org.apache.maven.scm.provider.git.gitexe.command.checkin.GitCheckInCommandTest.testCheckinAfterRename

Error Message:
The command result success flag was false.

Stack Trace:
junit.framework.AssertionFailedError: The command result success flag was false.
	at org.apache.maven.scm.provider.git.gitexe.command.checkin.GitCheckInCommandTest.checkoutRepoInto(GitCheckInCommandTest.java:185)
	at org.apache.maven.scm.provider.git.gitexe.command.checkin.GitCheckInCommandTest.testCheckinAfterRename(GitCheckInCommandTest.java:100)


FAILED:  org.apache.maven.scm.provider.git.gitexe.command.checkin.GitCheckInCommandTest.testCheckinWithFileSet

Error Message:
The command result success flag was false.

Stack Trace:
junit.framework.AssertionFailedError: The command result success flag was false.
	at org.apache.maven.scm.provider.git.gitexe.command.checkin.GitCheckInCommandTest.checkoutRepoInto(GitCheckInCommandTest.java:185)
	at org.apache.maven.scm.provider.git.gitexe.command.checkin.GitCheckInCommandTest.testCheckinWithFileSet(GitCheckInCommandTest.java:144)


FAILED:  org.apache.maven.scm.provider.git.gitexe.command.checkin.GitCheckInCommandTest.testCheckinWithFileSet

Error Message:
The command result success flag was false.

Stack Trace:
junit.framework.AssertionFailedError: The command result success flag was false.
	at org.apache.maven.scm.provider.git.gitexe.command.checkin.GitCheckInCommandTest.checkoutRepoInto(GitCheckInCommandTest.java:185)
	at org.apache.maven.scm.provider.git.gitexe.command.checkin.GitCheckInCommandTest.testCheckinWithFileSet(GitCheckInCommandTest.java:144)




Build log:
[...truncated 2.11 MB...]
[windows-jdk8] [INFO] Downloaded from central: https://repo.maven.apache.org/maven2/commons-validator/commons-validator/1.4.1/commons-validator-1.4.1.jar
(190 kB at 8.3 MB/s)
[windows-jdk8] [INFO] Downloading from central: https://repo.maven.apache.org/maven2/org/apache/ant/ant/1.8.1/ant-1.8.1.jar
[windows-jdk8] [INFO] Downloaded from central: https://repo.maven.apache.org/maven2/commons-digester/commons-digester/1.8.1/commons-digester-1.8.1.jar
(146 kB at 6.4 MB/s)
[windows-jdk8] [INFO] Downloading from central: https://repo.maven.apache.org/maven2/org/apache/maven/shared/maven-artifact-transfer/0.9.1/maven-artifact-transfer-0.9.1.jar
[windows-jdk8] [INFO] Downloaded from central: https://repo.maven.apache.org/maven2/commons-beanutils/commons-beanutils/1.8.3/commons-beanutils-1.8.3.jar
(232 kB at 8.6 MB/s)
[windows-jdk8] [INFO] Downloading from central: https://repo.maven.apache.org/maven2/org/apache/maven/doxia/doxia-sink-api/1.7/doxia-sink-api-1.7.jar
[windows-jdk8] [INFO] Downloaded from central: https://repo.maven.apache.org/maven2/org/apache/maven/shared/maven-script-interpreter/1.2/maven-script-interpreter-1.2.jar
(22 kB at 630 kB/s)
[windows-jdk8] [INFO] Downloading from central: https://repo.maven.apache.org/maven2/org/apache/maven/doxia/doxia-logging-api/1.7/doxia-logging-api-1.7.jar
[windows-jdk8] [INFO] Downloaded from central: https://repo.maven.apache.org/maven2/commons-logging/commons-logging/1.2/commons-logging-1.2.jar
(62 kB at 1.7 MB/s)
[windows-jdk8] [INFO] Downloading from central: https://repo.maven.apache.org/maven2/org/apache/maven/doxia/doxia-site-renderer/1.7.4/doxia-site-renderer-1.7.4.jar
[windows-jdk8] [INFO] Downloaded from central: https://repo.maven.apache.org/maven2/org/apache/maven/doxia/doxia-sink-api/1.7/doxia-sink-api-1.7.jar
(11 kB at 278 kB/s)
[windows-jdk8] [INFO] Downloading from central: https://repo.maven.apache.org/maven2/org/apache/maven/doxia/doxia-decoration-model/1.7.4/doxia-decoration-model-1.7.4.jar
[windows-jdk8] [INFO] Downloaded from central: https://repo.maven.apache.org/maven2/org/apache/maven/shared/maven-artifact-transfer/0.9.1/maven-artifact-transfer-0.9.1.jar
(123 kB at 2.9 MB/s)
[windows-jdk8] [INFO] Downloading from central: https://repo.maven.apache.org/maven2/org/apache/maven/doxia/doxia-skin-model/1.7.4/doxia-skin-model-1.7.4.jar
[windows-jdk8] [INFO] Downloaded from central: https://repo.maven.apache.org/maven2/org/apache/maven/doxia/doxia-logging-api/1.7/doxia-logging-api-1.7.jar
(12 kB at 257 kB/s)
[windows-jdk8] [INFO] Downloading from central: https://repo.maven.apache.org/maven2/org/apache/maven/doxia/doxia-module-xhtml/1.7/doxia-module-xhtml-1.7.jar
[windows-jdk8] [INFO] Downloaded from central: https://repo.maven.apache.org/maven2/org/apache/maven/doxia/doxia-site-renderer/1.7.4/doxia-site-renderer-1.7.4.jar
(64 kB at 1.3 MB/s)
[windows-jdk8] [INFO] Downloading from central: https://repo.maven.apache.org/maven2/org/codehaus/groovy/groovy-all/2.4.8/groovy-all-2.4.8.jar
[windows-jdk8] [INFO] Downloaded from central: https://repo.maven.apache.org/maven2/org/apache/maven/doxia/doxia-decoration-model/1.7.4/doxia-decoration-model-1.7.4.jar
(61 kB at 1.2 MB/s)
[windows-jdk8] [INFO] Downloaded from central: https://repo.maven.apache.org/maven2/org/apache/maven/doxia/doxia-skin-model/1.7.4/doxia-skin-model-1.7.4.jar
(16 kB at 296 kB/s)
[windows-jdk8] [INFO] Downloaded from central: https://repo.maven.apache.org/maven2/org/apache/maven/doxia/doxia-module-xhtml/1.7/doxia-module-xhtml-1.7.jar
(17 kB at 312 kB/s)
[windows-jdk8] [INFO] Downloaded from central: https://repo.maven.apache.org/maven2/org/apache/ant/ant/1.8.1/ant-1.8.1.jar
(1.5 MB at 13 MB/s)
[windows-jdk8] [INFO] Downloaded from central: https://repo.maven.apache.org/maven2/org/codehaus/groovy/groovy-all/2.4.8/groovy-all-2.4.8.jar
(7.0 MB at 19 MB/s)
[windows-jdk8] [INFO] Installing F:\jenkins\jenkins-slave\workspace\maven-box_maven-scm_master-LZ7UVRJQGWEFPDXKGVXHDWRQ4JZLLSJWYQRZLEZSFZG4LONP4W2A\m\maven-scm-managers\maven-scm-manager-plexus\pom.xml
to F:\jenkins\jenkins-slave\workspace\maven-box_maven-scm_master-LZ7UVRJQGWEFPDXKGVXHDWRQ4JZLLSJWYQRZLEZSFZG4LONP4W2A\m\maven-scm-plugin\target\local-repo\org\apache\maven\scm\maven-scm-manager-plexus\1.11.1-SNAPSHOT\maven-scm-manager-plexus-1.11.1-SNAPSHOT.pom
[windows-jdk8] [INFO] Installing F:\jenkins\jenkins-slave\workspace\maven-box_maven-scm_master-LZ7UVRJQGWEFPDXKGVXHDWRQ4JZLLSJWYQRZLEZSFZG4LONP4W2A\m\maven-scm-managers\maven-scm-manager-plexus\target\maven-scm-manager-plexus-1.11.1-SNAPSHOT.jar
to F:\jenkins\jenkins-slave\workspace\maven-box_maven-scm_master-LZ7UVRJQGWEFPDXKGVXHDWRQ4JZLLSJWYQRZLEZSFZG4LONP4W2A\m\maven-scm-plugin\target\local-repo\org\apache\maven\scm\maven-scm-manager-plexus\1.11.1-SNAPSHOT\maven-scm-manager-plexus-1.11.1-SNAPSHOT.jar
[windows-jdk8] [INFO] Installing F:\jenkins\jenkins-slave\workspace\maven-box_maven-scm_master-LZ7UVRJQGWEFPDXKGVXHDWRQ4JZLLSJWYQRZLEZSFZG4LONP4W2A\m\maven-scm-managers\pom.xml
to F:\jenkins\jenkins-slave\workspace\maven-box_maven-scm_master-LZ7UVRJQGWEFPDXKGVXHDWRQ4JZLLSJWYQRZLEZSFZG4LONP4W2A\m\maven-scm-plugin\target\local-repo\org\apache\maven\scm\maven-scm-managers\1.11.1-SNAPSHOT\maven-scm-managers-1.11.1-SNAPSHOT.pom
[windows-jdk8] [INFO] Installing f:\jenkins\jenkins-slave\workspace\maven-box_maven-scm_master-LZ7UVRJQGWEFPDXKGVXHDWRQ4JZLLSJWYQRZLEZSFZG4LONP4W2A\m\pom.xml
to F:\jenkins\jenkins-slave\workspace\maven-box_maven-scm_master-LZ7UVRJQGWEFPDXKGVXHDWRQ4JZLLSJWYQRZLEZSFZG4LONP4W2A\m\maven-scm-plugin\target\local-repo\org\apache\maven\scm\maven-scm\1.11.1-SNAPSHOT\maven-scm-1.11.1-SNAPSHOT.pom
[windows-jdk8] [INFO] Installing F:\jenkins\jenkins-slave\workspace\maven-box_maven-scm_master-LZ7UVRJQGWEFPDXKGVXHDWRQ4JZLLSJWYQRZLEZSFZG4LONP4W2A\m\maven-scm-providers\maven-scm-provider-local\pom.xml
to F:\jenkins\jenkins-slave\workspace\maven-box_maven-scm_master-LZ7UVRJQGWEFPDXKGVXHDWRQ4JZLLSJWYQRZLEZSFZG4LONP4W2A\m\maven-scm-plugin\target\local-repo\org\apache\maven\scm\maven-scm-provider-local\1.11.1-SNAPSHOT\maven-scm-provider-local-1.11.1-SNAPSHOT.pom
[windows-jdk8] [INFO] Installing F:\jenkins\jenkins-slave\workspace\maven-box_maven-scm_master-LZ7UVRJQGWEFPDXKGVXHDWRQ4JZLLSJWYQRZLEZSFZG4LONP4W2A\m\maven-scm-providers\maven-scm-provider-local\target\maven-scm-provider-local-1.11.1-SNAPSHOT.jar
to F:\jenkins\jenkins-slave\workspace\maven-box_maven-scm_master-LZ7UVRJQGWEFPDXKGVXHDWRQ4JZLLSJWYQRZLEZSFZG4LONP4W2A\m\maven-scm-plugin\target\local-repo\org\apache\maven\scm\maven-scm-provider-local\1.11.1-SNAPSHOT\maven-scm-provider-local-1.11.1-SNAPSHOT.jar
[windows-jdk8] [INFO] Installing F:\jenkins\jenkins-slave\workspace\maven-box_maven-scm_master-LZ7UVRJQGWEFPDXKGVXHDWRQ4JZLLSJWYQRZLEZSFZG4LONP4W2A\m\maven-scm-providers\pom.xml
to F:\jenkins\jenkins-slave\workspace\maven-box_maven-scm_master-LZ7UVRJQGWEFPDXKGVXHDWRQ4JZLLSJWYQRZLEZSFZG4LONP4W2A\m\maven-scm-plugin\target\local-repo\org\apache\maven\scm\maven-scm-providers\1.11.1-SNAPSHOT\maven-scm-providers-1.11.1-SNAPSHOT.pom
[windows-jdk8] [INFO] Installing F:\jenkins\jenkins-slave\workspace\maven-box_maven-scm_master-LZ7UVRJQGWEFPDXKGVXHDWRQ4JZLLSJWYQRZLEZSFZG4LONP4W2A\m\maven-scm-providers\maven-scm-providers-svn\maven-scm-provider-svn-commons\pom.xml
to F:\jenkins\jenkins-slave\workspace\maven-box_maven-scm_master-LZ7UVRJQGWEFPDXKGVXHDWRQ4JZLLSJWYQRZLEZSFZG4LONP4W2A\m\maven-scm-plugin\target\local-repo\org\apache\maven\scm\maven-scm-provider-svn-commons\1.11.1-SNAPSHOT\maven-scm-provider-svn-commons-1.11.1-SNAPSHOT.pom
[windows-jdk8] [INFO] Installing F:\jenkins\jenkins-slave\workspace\maven-box_maven-scm_master-LZ7UVRJQGWEFPDXKGVXHDWRQ4JZLLSJWYQRZLEZSFZG4LONP4W2A\m\maven-scm-providers\maven-scm-providers-svn\maven-scm-provider-svn-commons\target\maven-scm-provider-svn-commons-1.11.1-SNAPSHOT.jar
to F:\jenkins\jenkins-slave\workspace\maven-box_maven-scm_master-LZ7UVRJQGWEFPDXKGVXHDWRQ4JZLLSJWYQRZLEZSFZG4LONP4W2A\m\maven-scm-plugin\target\local-repo\org\apache\maven\scm\maven-scm-provider-svn-commons\1.11.1-SNAPSHOT\maven-scm-provider-svn-commons-1.11.1-SNAPSHOT.jar
[windows-jdk8] [INFO] Installing F:\jenkins\jenkins-slave\workspace\maven-box_maven-scm_master-LZ7UVRJQGWEFPDXKGVXHDWRQ4JZLLSJWYQRZLEZSFZG4LONP4W2A\m\maven-scm-providers\maven-scm-providers-svn\pom.xml
to F:\jenkins\jenkins-slave\workspace\maven-box_maven-scm_master-LZ7UVRJQGWEFPDXKGVXHDWRQ4JZLLSJWYQRZLEZSFZG4LONP4W2A\m\maven-scm-plugin\target\local-repo\org\apache\maven\scm\maven-scm-providers-svn\1.11.1-SNAPSHOT\maven-scm-providers-svn-1.11.1-SNAPSHOT.pom
[windows-jdk8] [INFO] Installing F:\jenkins\jenkins-slave\workspace\maven-box_maven-scm_master-LZ7UVRJQGWEFPDXKGVXHDWRQ4JZLLSJWYQRZLEZSFZG4LONP4W2A\m\maven-scm-providers\maven-scm-providers-svn\maven-scm-provider-svntest\pom.xml
to F:\jenkins\jenkins-slave\workspace\maven-box_maven-scm_master-LZ7UVRJQGWEFPDXKGVXHDWRQ4JZLLSJWYQRZLEZSFZG4LONP4W2A\m\maven-scm-plugin\target\local-repo\org\apache\maven\scm\maven-scm-provider-svntest\1.11.1-SNAPSHOT\maven-scm-provider-svntest-1.11.1-SNAPSHOT.pom
[windows-jdk8] [INFO] Installing F:\jenkins\jenkins-slave\workspace\maven-box_maven-scm_master-LZ7UVRJQGWEFPDXKGVXHDWRQ4JZLLSJWYQRZLEZSFZG4LONP4W2A\m\maven-scm-providers\maven-scm-providers-svn\maven-scm-provider-svntest\target\maven-scm-provider-svntest-1.11.1-SNAPSHOT.jar
to F:\jenkins\jenkins-slave\workspace\maven-box_maven-scm_master-LZ7UVRJQGWEFPDXKGVXHDWRQ4JZLLSJWYQRZLEZSFZG4LONP4W2A\m\maven-scm-plugin\target\local-repo\org\apache\maven\scm\maven-scm-provider-svntest\1.11.1-SNAPSHOT\maven-scm-provider-svntest-1.11.1-SNAPSHOT.jar
[windows-jdk8] [INFO] Installing F:\jenkins\jenkins-slave\workspace\maven-box_maven-scm_master-LZ7UVRJQGWEFPDXKGVXHDWRQ4JZLLSJWYQRZLEZSFZG4LONP4W2A\m\maven-scm-providers\maven-scm-providers-standard\pom.xml
to F:\jenkins\jenkins-slave\workspace\maven-box_maven-scm_master-LZ7UVRJQGWEFPDXKGVXHDWRQ4JZLLSJWYQRZLEZSFZG4LONP4W2A\m\maven-scm-plugin\target\local-repo\org\apache\maven\scm\maven-scm-providers-standard\1.11.1-SNAPSHOT\maven-scm-providers-standard-1.11.1-SNAPSHOT.pom
[windows-jdk8] [INFO] Installing F:\jenkins\jenkins-slave\workspace\maven-box_maven-scm_master-LZ7UVRJQGWEFPDXKGVXHDWRQ4JZLLSJWYQRZLEZSFZG4LONP4W2A\m\maven-scm-plugin\pom.xml
to F:\jenkins\jenkins-slave\workspace\maven-box_maven-scm_master-LZ7UVRJQGWEFPDXKGVXHDWRQ4JZLLSJWYQRZLEZSFZG4LONP4W2A\m\maven-scm-plugin\target\local-repo\org\apache\maven\plugins\maven-scm-plugin\1.11.1-SNAPSHOT\maven-scm-plugin-1.11.1-SNAPSHOT.pom
[windows-jdk8] [INFO] Installing F:\jenkins\jenkins-slave\workspace\maven-box_maven-scm_master-LZ7UVRJQGWEFPDXKGVXHDWRQ4JZLLSJWYQRZLEZSFZG4LONP4W2A\m\maven-scm-plugin\target\maven-scm-plugin-1.11.1-SNAPSHOT.jar
to F:\jenkins\jenkins-slave\workspace\maven-box_maven-scm_master-LZ7UVRJQGWEFPDXKGVXHDWRQ4JZLLSJWYQRZLEZSFZG4LONP4W2A\m\maven-scm-plugin\target\local-repo\org\apache\maven\plugins\maven-scm-plugin\1.11.1-SNAPSHOT\maven-scm-plugin-1.11.1-SNAPSHOT.jar
[windows-jdk8] [INFO] 
[windows-jdk8] [INFO] --- maven-invoker-plugin:3.1.0:run (integration-test) @ maven-scm-plugin
---
[windows-jdk8] [INFO] No projects were selected for execution.
[windows-jdk8] [INFO] 
[windows-jdk8] [INFO] --- maven-checkstyle-plugin:3.0.0:check (checkstyle-check) @ maven-scm-plugin
---
[windows-jdk8] [INFO] ------------------------------------------------------------------------
[windows-jdk8] [INFO] Reactor Summary:
[windows-jdk8] [INFO] 
[windows-jdk8] [INFO] Maven SCM .......................................... SUCCESS [ 16.555
s]
[windows-jdk8] [INFO] Maven SCM API ...................................... SUCCESS [  8.107
s]
[windows-jdk8] [INFO] Maven SCM Managers ................................. SUCCESS [  1.116
s]
[windows-jdk8] [INFO] Maven SCM Manager for Plexus ....................... SUCCESS [  2.012
s]
[windows-jdk8] [INFO] Maven SCM Test ..................................... SUCCESS [  3.156
s]
[windows-jdk8] [INFO] Maven SCM Providers ................................ SUCCESS [  2.006
s]
[windows-jdk8] [INFO] Maven SCM AccuRev Provider ......................... SUCCESS [  6.608
s]
[windows-jdk8] [INFO] Maven SCM Bazaar Provider .......................... SUCCESS [  3.293
s]
[windows-jdk8] [INFO] Maven SCM Clearcase Provider ....................... SUCCESS [  4.789
s]
[windows-jdk8] [INFO] Maven SCM CVS Provider - Parent .................... SUCCESS [  1.172
s]
[windows-jdk8] [INFO] Maven SCM CVS Provider TCK tests ................... SUCCESS [  1.705
s]
[windows-jdk8] [INFO] Maven SCM CVS Provider - Common library ............ SUCCESS [  3.450
s]
[windows-jdk8] [INFO] Maven SCM CVS Provider - CVS Executable Impl. ...... SUCCESS [  3.052
s]
[windows-jdk8] [INFO] Maven SCM CVS Provider - CVS Java Impl. ............ SUCCESS [  3.214
s]
[windows-jdk8] [INFO] Maven SCM Mercurial (Hg) Provider .................. SUCCESS [  3.530
s]
[windows-jdk8] [INFO] Maven SCM Git Provider - Parent .................... SUCCESS [  1.154
s]
[windows-jdk8] [INFO] Maven SCM Git Provider - Common library ............ SUCCESS [  3.000
s]
[windows-jdk8] [INFO] Maven SCM Git Provider TCK Tests ................... SUCCESS [  1.897
s]
[windows-jdk8] [INFO] Maven SCM Git Provider - Git Executable Impl. ...... SUCCESS [  6.196
s]
[windows-jdk8] [INFO] Maven SCM Git Provider - JGit Impl. ................ SUCCESS [ 37.439
s]
[windows-jdk8] [INFO] Maven SCM Local Provider ........................... SUCCESS [  3.139
s]
[windows-jdk8] [INFO] Maven SCM Perforce Provider ........................ SUCCESS [  3.834
s]
[windows-jdk8] [INFO] Maven SCM Starteam Provider ........................ SUCCESS [  4.244
s]
[windows-jdk8] [INFO] Maven SCM Subversion Provider - Parent ............. SUCCESS [  1.098
s]
[windows-jdk8] [INFO] Maven SCM Subversion Provider - Common library ..... SUCCESS [  3.118
s]
[windows-jdk8] [INFO] Maven SCM Subversion Provider TCK Tests ............ SUCCESS [  1.465
s]
[windows-jdk8] [INFO] Maven SCM Subversion Provider - SVN Executable Impl. SUCCESS [  6.043
s]
[windows-jdk8] [INFO] Maven SCM Synergy Provider ......................... SUCCESS [  3.469
s]
[windows-jdk8] [INFO] Maven SCM Visual Source Safe Provider .............. SUCCESS [  3.129
s]
[windows-jdk8] [INFO] Maven SCM TFS Provider ............................. SUCCESS [  2.932
s]
[windows-jdk8] [INFO] Maven SCM MKS Integrity Provider ................... SUCCESS [  3.801
s]
[windows-jdk8] [INFO] Maven SCM Jazz/Rational Team Concert Provider ...... SUCCESS [  4.078
s]
[windows-jdk8] [INFO] Maven SCM Standard Providers ....................... SUCCESS [  2.100
s]
[windows-jdk8] [INFO] Maven SCM Client ................................... SUCCESS [  4.594
s]
[windows-jdk8] [INFO] Maven SCM Plugin ................................... SUCCESS [ 21.681
s]
[windows-jdk8] [INFO] ------------------------------------------------------------------------
[windows-jdk8] [INFO] BUILD SUCCESS
[windows-jdk8] [INFO] ------------------------------------------------------------------------
[windows-jdk8] [INFO] Total time: 03:04 min
[windows-jdk8] [INFO] Finished at: 2018-09-08T23:03:33Z
[windows-jdk8] [INFO] Final Memory: 97M/1153M
[windows-jdk8] [INFO] ------------------------------------------------------------------------
[windows-jdk8] [WARNING] The requested profile "run-its" could not be activated because it
does not exist.
[windows-jdk8] [INFO] [jenkins-event-spy] Generated F:\jenkins\jenkins-slave\workspace\maven-box_maven-scm_master-LZ7UVRJQGWEFPDXKGVXHDWRQ4JZLLSJWYQRZLEZSFZG4LONP4W2A@tmp\withMaven29500034\maven-spy-20180908-230028-9083809831251286866524.log
[windows-jdk8] Picked up JAVA_TOOL_OPTIONS: -Dmaven.ext.class.path="f:\jenkins\jenkins-slave\workspace\maven-box_maven-scm_master-LZ7UVRJQGWEFPDXKGVXHDWRQ4JZLLSJWYQRZLEZSFZG4LONP4W2A@tmp\withMaven29500034\pipeline-maven-spy.jar"
-Dorg.jenkinsci.plugins.pipeline.maven.reportsFolder="f:\jenkins\jenkins-slave\workspace\maven-box_maven-scm_master-LZ7UVRJQGWEFPDXKGVXHDWRQ4JZLLSJWYQRZLEZSFZG4LONP4W2A@tmp\withMaven29500034"

[Pipeline] [windows-jdk10] }
[windows-jdk10] [withMaven] invokerPublisher - Archive invoker results for Maven artifact
MavenArtifact{org.apache.maven.plugins:maven-scm-plugin::1.11.1-SNAPSHOT(version: 1.11.1-SNAPSHOT,
snapshot:false) } generated by PluginInvocation{org.apache.maven.plugins:maven-invoker-plugin:3.1.0@run
 integration-test}: m\maven-scm-plugin\target\invoker-reports\*.xml
[windows-jdk10] performing MavenInvokerRecorder, reportsFilenamePattern:'**/m\maven-scm-plugin\target\invoker-reports/BUILD*.xml',
invokerBuildDir:'**/m\maven-scm-plugin\target\it'
[windows-jdk10] Found reports:[]
[windows-jdk10] Found logs:[]
[windows-jdk10] Finished parsing Maven Invoker results (found 0)
[windows-jdk10] [withMaven] junitPublisher - Archive test results for Maven artifact org.apache.maven.scm:maven-scm-api:1.11.1-SNAPSHOT
generated by maven-surefire-plugin:test (default-test): m\maven-scm-api\target\surefire-reports\*.xml
[windows-jdk10] Recording test results
[windows-jdk10] [withMaven] junitPublisher - Archive test results for Maven artifact org.apache.maven.scm:maven-scm-manager-plexus:1.11.1-SNAPSHOT
generated by maven-surefire-plugin:test (default-test): m\maven-scm-managers\maven-scm-manager-plexus\target\surefire-reports\*.xml
[windows-jdk10] Recording test results
[windows-jdk10] None of the test reports contained any result
[windows-jdk10] [withMaven] junitPublisher - Archive test results for Maven artifact org.apache.maven.scm:maven-scm-test:1.11.1-SNAPSHOT
generated by maven-surefire-plugin:test (default-test): m\maven-scm-test\target\surefire-reports\*.xml
[windows-jdk10] Recording test results
[windows-jdk10] [withMaven] junitPublisher - Archive test results for Maven artifact org.apache.maven.scm:maven-scm-provider-accurev:1.11.1-SNAPSHOT
generated by maven-surefire-plugin:test (default-test): m\maven-scm-providers\maven-scm-provider-accurev\target\surefire-reports\*.xml
[windows-jdk10] Recording test results
[windows-jdk10] [withMaven] junitPublisher - Archive test results for Maven artifact org.apache.maven.scm:maven-scm-provider-bazaar:1.11.1-SNAPSHOT
generated by maven-surefire-plugin:test (default-test): m\maven-scm-providers\maven-scm-provider-bazaar\target\surefire-reports\*.xml
[windows-jdk10] Recording test results
[windows-jdk10] [withMaven] junitPublisher - Archive test results for Maven artifact org.apache.maven.scm:maven-scm-provider-clearcase:1.11.1-SNAPSHOT
generated by maven-surefire-plugin:test (default-test): m\maven-scm-providers\maven-scm-provider-clearcase\target\surefire-reports\*.xml
[windows-jdk10] Recording test results
[windows-jdk10] [withMaven] junitPublisher - Archive test results for Maven artifact org.apache.maven.scm:maven-scm-provider-cvstest:1.11.1-SNAPSHOT
generated by maven-surefire-plugin:test (default-test): m\maven-scm-providers\maven-scm-providers-cvs\maven-scm-provider-cvstest\target\surefire-reports\*.xml
[windows-jdk10] Recording test results
[windows-jdk10] None of the test reports contained any result
[windows-jdk10] [withMaven] junitPublisher - Archive test results for Maven artifact org.apache.maven.scm:maven-scm-provider-cvs-commons:1.11.1-SNAPSHOT
generated by maven-surefire-plugin:test (default-test): m\maven-scm-providers\maven-scm-providers-cvs\maven-scm-provider-cvs-commons\target\surefire-reports\*.xml
[windows-jdk10] Recording test results
[windows-jdk10] [withMaven] junitPublisher - Archive test results for Maven artifact org.apache.maven.scm:maven-scm-provider-cvsexe:1.11.1-SNAPSHOT
generated by maven-surefire-plugin:test (default-test): m\maven-scm-providers\maven-scm-providers-cvs\maven-scm-provider-cvsexe\target\surefire-reports\*.xml
[windows-jdk10] Recording test results
[windows-jdk10] [withMaven] junitPublisher - Archive test results for Maven artifact org.apache.maven.scm:maven-scm-provider-cvsjava:1.11.1-SNAPSHOT
generated by maven-surefire-plugin:test (default-test): m\maven-scm-providers\maven-scm-providers-cvs\maven-scm-provider-cvsjava\target\surefire-reports\*.xml
[windows-jdk10] Recording test results
[windows-jdk10] [withMaven] junitPublisher - Archive test results for Maven artifact org.apache.maven.scm:maven-scm-provider-hg:1.11.1-SNAPSHOT
generated by maven-surefire-plugin:test (default-test): m\maven-scm-providers\maven-scm-provider-hg\target\surefire-reports\*.xml
[windows-jdk10] Recording test results
[windows-jdk10] [withMaven] junitPublisher - Archive test results for Maven artifact org.apache.maven.scm:maven-scm-provider-git-commons:1.11.1-SNAPSHOT
generated by maven-surefire-plugin:test (default-test): m\maven-scm-providers\maven-scm-providers-git\maven-scm-provider-git-commons\target\surefire-reports\*.xml
[windows-jdk10] Recording test results
[windows-jdk10] [withMaven] junitPublisher - Archive test results for Maven artifact org.apache.maven.scm:maven-scm-provider-gittest:1.11.1-SNAPSHOT
generated by maven-surefire-plugin:test (default-test): m\maven-scm-providers\maven-scm-providers-git\maven-scm-provider-gittest\target\surefire-reports\*.xml
[windows-jdk10] Recording test results
[windows-jdk10] None of the test reports contained any result
[windows-jdk10] [withMaven] junitPublisher - Archive test results for Maven artifact org.apache.maven.scm:maven-scm-provider-gitexe:1.11.1-SNAPSHOT
generated by maven-surefire-plugin:test (default-test): m\maven-scm-providers\maven-scm-providers-git\maven-scm-provider-gitexe\target\surefire-reports\*.xml
[windows-jdk10] Recording test results
[windows-jdk10] [withMaven] junitPublisher - Archive test results for Maven artifact org.apache.maven.scm:maven-scm-provider-jgit:1.11.1-SNAPSHOT
generated by maven-surefire-plugin:test (default-test): m\maven-scm-providers\maven-scm-providers-git\maven-scm-provider-jgit\target\surefire-reports\*.xml
[windows-jdk10] Recording test results
[windows-jdk10] [withMaven] junitPublisher - Archive test results for Maven artifact org.apache.maven.scm:maven-scm-provider-local:1.11.1-SNAPSHOT
generated by maven-surefire-plugin:test (default-test): m\maven-scm-providers\maven-scm-provider-local\target\surefire-reports\*.xml
[windows-jdk10] Recording test results
[windows-jdk10] [withMaven] junitPublisher - Archive test results for Maven artifact org.apache.maven.scm:maven-scm-provider-perforce:1.11.1-SNAPSHOT
generated by maven-surefire-plugin:test (default-test): m\maven-scm-providers\maven-scm-provider-perforce\target\surefire-reports\*.xml
[windows-jdk10] Recording test results
[windows-jdk10] [withMaven] junitPublisher - Archive test results for Maven artifact org.apache.maven.scm:maven-scm-provider-starteam:1.11.1-SNAPSHOT
generated by maven-surefire-plugin:test (default-test): m\maven-scm-providers\maven-scm-provider-starteam\target\surefire-reports\*.xml
[windows-jdk10] Recording test results
[windows-jdk10] [withMaven] junitPublisher - Archive test results for Maven artifact org.apache.maven.scm:maven-scm-provider-svn-commons:1.11.1-SNAPSHOT
generated by maven-surefire-plugin:test (default-test): m\maven-scm-providers\maven-scm-providers-svn\maven-scm-provider-svn-commons\target\surefire-reports\*.xml
[windows-jdk10] Recording test results
[windows-jdk10] [withMaven] junitPublisher - Archive test results for Maven artifact org.apache.maven.scm:maven-scm-provider-svntest:1.11.1-SNAPSHOT
generated by maven-surefire-plugin:test (default-test): m\maven-scm-providers\maven-scm-providers-svn\maven-scm-provider-svntest\target\surefire-reports\*.xml
[windows-jdk10] Recording test results
[windows-jdk10] None of the test reports contained any result
[windows-jdk10] [withMaven] junitPublisher - Archive test results for Maven artifact org.apache.maven.scm:maven-scm-provider-svnexe:1.11.1-SNAPSHOT
generated by maven-surefire-plugin:test (default-test): m\maven-scm-providers\maven-scm-providers-svn\maven-scm-provider-svnexe\target\surefire-reports\*.xml
[windows-jdk10] Recording test results
[windows-jdk10] [withMaven] junitPublisher - Archive test results for Maven artifact org.apache.maven.scm:maven-scm-provider-synergy:1.11.1-SNAPSHOT
generated by maven-surefire-plugin:test (default-test): m\maven-scm-providers\maven-scm-provider-synergy\target\surefire-reports\*.xml
[windows-jdk10] Recording test results
[windows-jdk10] [withMaven] junitPublisher - Archive test results for Maven artifact org.apache.maven.scm:maven-scm-provider-vss:1.11.1-SNAPSHOT
generated by maven-surefire-plugin:test (default-test): m\maven-scm-providers\maven-scm-provider-vss\target\surefire-reports\*.xml
[windows-jdk10] Recording test results
[windows-jdk10] [withMaven] junitPublisher - Archive test results for Maven artifact org.apache.maven.scm:maven-scm-provider-tfs:1.11.1-SNAPSHOT
generated by maven-surefire-plugin:test (default-test): m\maven-scm-providers\maven-scm-provider-tfs\target\surefire-reports\*.xml
[windows-jdk10] Recording test results
[windows-jdk10] [withMaven] junitPublisher - Archive test results for Maven artifact org.apache.maven.scm:maven-scm-provider-integrity:1.11.1-SNAPSHOT
generated by maven-surefire-plugin:test (default-test): m\maven-scm-providers\maven-scm-provider-integrity\target\surefire-reports\*.xml
[windows-jdk10] Recording test results
[windows-jdk10] [withMaven] junitPublisher - Archive test results for Maven artifact org.apache.maven.scm:maven-scm-provider-jazz:1.11.1-SNAPSHOT
generated by maven-surefire-plugin:test (default-test): m\maven-scm-providers\maven-scm-provider-jazz\target\surefire-reports\*.xml
[windows-jdk10] Recording test results
[windows-jdk10] [withMaven] junitPublisher - Archive test results for Maven artifact org.apache.maven.scm:maven-scm-client:1.11.1-SNAPSHOT
generated by maven-surefire-plugin:test (default-test): m\maven-scm-client\target\surefire-reports\*.xml
[windows-jdk10] Recording test results
[windows-jdk10] None of the test reports contained any result
[windows-jdk10] [withMaven] junitPublisher - Archive test results for Maven artifact org.apache.maven.plugins:maven-scm-plugin:1.11.1-SNAPSHOT
generated by maven-surefire-plugin:test (default-test): m\maven-scm-plugin\target\surefire-reports\*.xml
[windows-jdk10] Recording test results
[Pipeline] [windows-jdk10] // withMaven
[Pipeline] [windows-jdk10] cleanWs
[Pipeline] [windows-jdk8] }
[Pipeline] [windows-jdk8] // dir
[windows-jdk10] [WS-CLEANUP] Deleting project workspace...[WS-CLEANUP] done
[Pipeline] [windows-jdk8] }
[windows-jdk8] [withMaven] invokerPublisher - Archive invoker results for Maven artifact MavenArtifact{org.apache.maven.plugins:maven-scm-plugin::1.11.1-SNAPSHOT(version:
1.11.1-SNAPSHOT, snapshot:false) } generated by PluginInvocation{org.apache.maven.plugins:maven-invoker-plugin:3.1.0@run
 integration-test}: m\maven-scm-plugin\target\invoker-reports\*.xml
[windows-jdk8] performing MavenInvokerRecorder, reportsFilenamePattern:'**/m\maven-scm-plugin\target\invoker-reports/BUILD*.xml',
invokerBuildDir:'**/m\maven-scm-plugin\target\it'
[windows-jdk8] Found reports:[]
[windows-jdk8] Found logs:[]
[windows-jdk8] Finished parsing Maven Invoker results (found 0)
[windows-jdk8] [withMaven] junitPublisher - Archive test results for Maven artifact org.apache.maven.scm:maven-scm-api:1.11.1-SNAPSHOT
generated by maven-surefire-plugin:test (default-test): m\maven-scm-api\target\surefire-reports\*.xml
[windows-jdk8] Recording test results
[windows-jdk8] [withMaven] junitPublisher - Archive test results for Maven artifact org.apache.maven.scm:maven-scm-manager-plexus:1.11.1-SNAPSHOT
generated by maven-surefire-plugin:test (default-test): m\maven-scm-managers\maven-scm-manager-plexus\target\surefire-reports\*.xml
[windows-jdk8] Recording test results
[windows-jdk8] None of the test reports contained any result
[windows-jdk8] [withMaven] junitPublisher - Archive test results for Maven artifact org.apache.maven.scm:maven-scm-test:1.11.1-SNAPSHOT
generated by maven-surefire-plugin:test (default-test): m\maven-scm-test\target\surefire-reports\*.xml
[windows-jdk8] Recording test results
[windows-jdk8] [withMaven] junitPublisher - Archive test results for Maven artifact org.apache.maven.scm:maven-scm-provider-accurev:1.11.1-SNAPSHOT
generated by maven-surefire-plugin:test (default-test): m\maven-scm-providers\maven-scm-provider-accurev\target\surefire-reports\*.xml
[windows-jdk8] Recording test results
[windows-jdk8] [withMaven] junitPublisher - Archive test results for Maven artifact org.apache.maven.scm:maven-scm-provider-bazaar:1.11.1-SNAPSHOT
generated by maven-surefire-plugin:test (default-test): m\maven-scm-providers\maven-scm-provider-bazaar\target\surefire-reports\*.xml
[windows-jdk8] Recording test results
[windows-jdk8] [withMaven] junitPublisher - Archive test results for Maven artifact org.apache.maven.scm:maven-scm-provider-clearcase:1.11.1-SNAPSHOT
generated by maven-surefire-plugin:test (default-test): m\maven-scm-providers\maven-scm-provider-clearcase\target\surefire-reports\*.xml
[windows-jdk8] Recording test results
[windows-jdk8] [withMaven] junitPublisher - Archive test results for Maven artifact org.apache.maven.scm:maven-scm-provider-cvstest:1.11.1-SNAPSHOT
generated by maven-surefire-plugin:test (default-test): m\maven-scm-providers\maven-scm-providers-cvs\maven-scm-provider-cvstest\target\surefire-reports\*.xml
[windows-jdk8] Recording test results
[windows-jdk8] None of the test reports contained any result
[windows-jdk8] [withMaven] junitPublisher - Archive test results for Maven artifact org.apache.maven.scm:maven-scm-provider-cvs-commons:1.11.1-SNAPSHOT
generated by maven-surefire-plugin:test (default-test): m\maven-scm-providers\maven-scm-providers-cvs\maven-scm-provider-cvs-commons\target\surefire-reports\*.xml
[windows-jdk8] Recording test results
[windows-jdk8] [withMaven] junitPublisher - Archive test results for Maven artifact org.apache.maven.scm:maven-scm-provider-cvsexe:1.11.1-SNAPSHOT
generated by maven-surefire-plugin:test (default-test): m\maven-scm-providers\maven-scm-providers-cvs\maven-scm-provider-cvsexe\target\surefire-reports\*.xml
[windows-jdk8] Recording test results
[windows-jdk8] [withMaven] junitPublisher - Archive test results for Maven artifact org.apache.maven.scm:maven-scm-provider-cvsjava:1.11.1-SNAPSHOT
generated by maven-surefire-plugin:test (default-test): m\maven-scm-providers\maven-scm-providers-cvs\maven-scm-provider-cvsjava\target\surefire-reports\*.xml
[windows-jdk8] Recording test results
[windows-jdk8] [withMaven] junitPublisher - Archive test results for Maven artifact org.apache.maven.scm:maven-scm-provider-hg:1.11.1-SNAPSHOT
generated by maven-surefire-plugin:test (default-test): m\maven-scm-providers\maven-scm-provider-hg\target\surefire-reports\*.xml
[windows-jdk8] Recording test results
[windows-jdk8] [withMaven] junitPublisher - Archive test results for Maven artifact org.apache.maven.scm:maven-scm-provider-git-commons:1.11.1-SNAPSHOT
generated by maven-surefire-plugin:test (default-test): m\maven-scm-providers\maven-scm-providers-git\maven-scm-provider-git-commons\target\surefire-reports\*.xml
[windows-jdk8] Recording test results
[windows-jdk8] [withMaven] junitPublisher - Archive test results for Maven artifact org.apache.maven.scm:maven-scm-provider-gittest:1.11.1-SNAPSHOT
generated by maven-surefire-plugin:test (default-test): m\maven-scm-providers\maven-scm-providers-git\maven-scm-provider-gittest\target\surefire-reports\*.xml
[windows-jdk8] Recording test results
[windows-jdk8] None of the test reports contained any result
[windows-jdk8] [withMaven] junitPublisher - Archive test results for Maven artifact org.apache.maven.scm:maven-scm-provider-gitexe:1.11.1-SNAPSHOT
generated by maven-surefire-plugin:test (default-test): m\maven-scm-providers\maven-scm-providers-git\maven-scm-provider-gitexe\target\surefire-reports\*.xml
[windows-jdk8] Recording test results
[windows-jdk8] [withMaven] junitPublisher - Archive test results for Maven artifact org.apache.maven.scm:maven-scm-provider-jgit:1.11.1-SNAPSHOT
generated by maven-surefire-plugin:test (default-test): m\maven-scm-providers\maven-scm-providers-git\maven-scm-provider-jgit\target\surefire-reports\*.xml
[windows-jdk8] Recording test results
[windows-jdk8] [withMaven] junitPublisher - Archive test results for Maven artifact org.apache.maven.scm:maven-scm-provider-local:1.11.1-SNAPSHOT
generated by maven-surefire-plugin:test (default-test): m\maven-scm-providers\maven-scm-provider-local\target\surefire-reports\*.xml
[windows-jdk8] Recording test results
[windows-jdk8] [withMaven] junitPublisher - Archive test results for Maven artifact org.apache.maven.scm:maven-scm-provider-perforce:1.11.1-SNAPSHOT
generated by maven-surefire-plugin:test (default-test): m\maven-scm-providers\maven-scm-provider-perforce\target\surefire-reports\*.xml
[windows-jdk8] Recording test results
[windows-jdk8] [withMaven] junitPublisher - Archive test results for Maven artifact org.apache.maven.scm:maven-scm-provider-starteam:1.11.1-SNAPSHOT
generated by maven-surefire-plugin:test (default-test): m\maven-scm-providers\maven-scm-provider-starteam\target\surefire-reports\*.xml
[windows-jdk8] Recording test results
[windows-jdk8] [withMaven] junitPublisher - Archive test results for Maven artifact org.apache.maven.scm:maven-scm-provider-svn-commons:1.11.1-SNAPSHOT
generated by maven-surefire-plugin:test (default-test): m\maven-scm-providers\maven-scm-providers-svn\maven-scm-provider-svn-commons\target\surefire-reports\*.xml
[windows-jdk8] Recording test results
[windows-jdk8] [withMaven] junitPublisher - Archive test results for Maven artifact org.apache.maven.scm:maven-scm-provider-svntest:1.11.1-SNAPSHOT
generated by maven-surefire-plugin:test (default-test): m\maven-scm-providers\maven-scm-providers-svn\maven-scm-provider-svntest\target\surefire-reports\*.xml
[windows-jdk8] Recording test results
[windows-jdk8] None of the test reports contained any result
[windows-jdk8] [withMaven] junitPublisher - Archive test results for Maven artifact org.apache.maven.scm:maven-scm-provider-svnexe:1.11.1-SNAPSHOT
generated by maven-surefire-plugin:test (default-test): m\maven-scm-providers\maven-scm-providers-svn\maven-scm-provider-svnexe\target\surefire-reports\*.xml
[windows-jdk8] Recording test results
[windows-jdk8] [withMaven] junitPublisher - Archive test results for Maven artifact org.apache.maven.scm:maven-scm-provider-synergy:1.11.1-SNAPSHOT
generated by maven-surefire-plugin:test (default-test): m\maven-scm-providers\maven-scm-provider-synergy\target\surefire-reports\*.xml
[windows-jdk8] Recording test results
[windows-jdk8] [withMaven] junitPublisher - Archive test results for Maven artifact org.apache.maven.scm:maven-scm-provider-vss:1.11.1-SNAPSHOT
generated by maven-surefire-plugin:test (default-test): m\maven-scm-providers\maven-scm-provider-vss\target\surefire-reports\*.xml
[windows-jdk8] Recording test results
[windows-jdk8] [withMaven] junitPublisher - Archive test results for Maven artifact org.apache.maven.scm:maven-scm-provider-tfs:1.11.1-SNAPSHOT
generated by maven-surefire-plugin:test (default-test): m\maven-scm-providers\maven-scm-provider-tfs\target\surefire-reports\*.xml
[windows-jdk8] Recording test results
[windows-jdk8] [withMaven] junitPublisher - Archive test results for Maven artifact org.apache.maven.scm:maven-scm-provider-integrity:1.11.1-SNAPSHOT
generated by maven-surefire-plugin:test (default-test): m\maven-scm-providers\maven-scm-provider-integrity\target\surefire-reports\*.xml
[windows-jdk8] Recording test results
[windows-jdk8] [withMaven] junitPublisher - Archive test results for Maven artifact org.apache.maven.scm:maven-scm-provider-jazz:1.11.1-SNAPSHOT
generated by maven-surefire-plugin:test (default-test): m\maven-scm-providers\maven-scm-provider-jazz\target\surefire-reports\*.xml
[windows-jdk8] Recording test results
[windows-jdk8] [withMaven] junitPublisher - Archive test results for Maven artifact org.apache.maven.scm:maven-scm-client:1.11.1-SNAPSHOT
generated by maven-surefire-plugin:test (default-test): m\maven-scm-client\target\surefire-reports\*.xml
[windows-jdk8] Recording test results
[windows-jdk8] None of the test reports contained any result
[windows-jdk8] [withMaven] junitPublisher - Archive test results for Maven artifact org.apache.maven.plugins:maven-scm-plugin:1.11.1-SNAPSHOT
generated by maven-surefire-plugin:test (default-test): m\maven-scm-plugin\target\surefire-reports\*.xml
[windows-jdk8] Recording test results
[Pipeline] [windows-jdk8] // withMaven
[Pipeline] [windows-jdk8] cleanWs
[Pipeline] [windows-jdk10] }
[Pipeline] [windows-jdk10] // stage
[Pipeline] [windows-jdk10] }
[Pipeline] [windows-jdk10] // node
[Pipeline] [windows-jdk10] }
[windows-jdk8] [WS-CLEANUP] Deleting project workspace...[WS-CLEANUP] done
[Pipeline] [windows-jdk8] }
[Pipeline] [windows-jdk8] // stage
[Pipeline] [windows-jdk8] }
[Pipeline] [windows-jdk8] // node
[Pipeline] [windows-jdk8] }
[Pipeline] // parallel
[Pipeline] stage
[Pipeline] { (Notifications)
[Pipeline] echo
Build result: UNSTABLE
[Pipeline] jiraIssueSelector
Mime
  • Unnamed multipart/mixed (inline, None, 0 bytes)
View raw message