maven-notifications mailing list archives

Site index · List index
Message view « Date » · « Thread »
Top « Date » · « Thread »
From Apache Jenkins Server <jenk...@builds.apache.org>
Subject Build unstable in Jenkins: Maven TLP » maven-archetype » ARCHETYPE-553 #16
Date Mon, 10 Sep 2018 05:51:55 GMT
See https://builds.apache.org/job/maven-box/job/maven-archetype/job/ARCHETYPE-553/16/

No changes.

32 tests failed.
FAILED:  org.apache.maven.archetype.creator.DefaultArchetypeCreatorIT.testExcludePatternsMustExcludeDirectory

Error Message:
Error while executing process.

Stack Trace:
org.codehaus.plexus.util.cli.CommandLineException: Error while executing process.
	at org.apache.maven.archetype.creator.DefaultArchetypeCreatorIT.createFilesetArchetype(DefaultArchetypeCreatorIT.java:136)
	at org.apache.maven.archetype.creator.DefaultArchetypeCreatorIT.testExcludePatternsMustExcludeDirectory(DefaultArchetypeCreatorIT.java:163)
Caused by: java.io.IOException: Cannot run program "F:\jenkins\tools\maven\apache-maven-3.5.2\bin\mvn.cmd" (in directory "F:\jenkins\jenkins-slave\workspace\ven-archetype_ARCHETYPE-553-J4FOCNZGBVSFDFI4P3DBC7GXGJK62NFN5QH7Q5I46GZ5AP3FIVLQ@2\windows-jdk10-m3.5.x_build\archetype-testing\archetype-final\target\test-classes\projects\exclude-patterns\target\generated-sources\archetype"): CreateProcess error=267, The directory name is invalid
	at org.apache.maven.archetype.creator.DefaultArchetypeCreatorIT.createFilesetArchetype(DefaultArchetypeCreatorIT.java:136)
	at org.apache.maven.archetype.creator.DefaultArchetypeCreatorIT.testExcludePatternsMustExcludeDirectory(DefaultArchetypeCreatorIT.java:163)
Caused by: java.io.IOException: CreateProcess error=267, The directory name is invalid
	at org.apache.maven.archetype.creator.DefaultArchetypeCreatorIT.createFilesetArchetype(DefaultArchetypeCreatorIT.java:136)
	at org.apache.maven.archetype.creator.DefaultArchetypeCreatorIT.testExcludePatternsMustExcludeDirectory(DefaultArchetypeCreatorIT.java:163)


FAILED:  org.apache.maven.archetype.creator.DefaultArchetypeCreatorIT.testExcludePatternsContainingFilesSameExtension

Error Message:
Error while executing process.

Stack Trace:
org.codehaus.plexus.util.cli.CommandLineException: Error while executing process.
	at org.apache.maven.archetype.creator.DefaultArchetypeCreatorIT.createFilesetArchetype(DefaultArchetypeCreatorIT.java:136)
	at org.apache.maven.archetype.creator.DefaultArchetypeCreatorIT.testExcludePatternsContainingFilesSameExtension(DefaultArchetypeCreatorIT.java:177)
Caused by: java.io.IOException: Cannot run program "F:\jenkins\tools\maven\apache-maven-3.5.2\bin\mvn.cmd" (in directory "F:\jenkins\jenkins-slave\workspace\ven-archetype_ARCHETYPE-553-J4FOCNZGBVSFDFI4P3DBC7GXGJK62NFN5QH7Q5I46GZ5AP3FIVLQ@2\windows-jdk10-m3.5.x_build\archetype-testing\archetype-final\target\test-classes\projects\exclude-patterns-2\target\generated-sources\archetype"): CreateProcess error=267, The directory name is invalid
	at org.apache.maven.archetype.creator.DefaultArchetypeCreatorIT.createFilesetArchetype(DefaultArchetypeCreatorIT.java:136)
	at org.apache.maven.archetype.creator.DefaultArchetypeCreatorIT.testExcludePatternsContainingFilesSameExtension(DefaultArchetypeCreatorIT.java:177)
Caused by: java.io.IOException: CreateProcess error=267, The directory name is invalid
	at org.apache.maven.archetype.creator.DefaultArchetypeCreatorIT.createFilesetArchetype(DefaultArchetypeCreatorIT.java:136)
	at org.apache.maven.archetype.creator.DefaultArchetypeCreatorIT.testExcludePatternsContainingFilesSameExtension(DefaultArchetypeCreatorIT.java:177)


FAILED:  org.apache.maven.archetype.creator.DefaultArchetypeCreatorIT.testIncludeFileWithNoExtension

Error Message:
Error while executing process.

Stack Trace:
org.codehaus.plexus.util.cli.CommandLineException: Error while executing process.
	at org.apache.maven.archetype.creator.DefaultArchetypeCreatorIT.createFilesetArchetype(DefaultArchetypeCreatorIT.java:136)
	at org.apache.maven.archetype.creator.DefaultArchetypeCreatorIT.testIncludeFileWithNoExtension(DefaultArchetypeCreatorIT.java:189)
Caused by: java.io.IOException: Cannot run program "F:\jenkins\tools\maven\apache-maven-3.2.5\bin\mvn.bat" (in directory "F:\jenkins\jenkins-slave\workspace\ven-archetype_ARCHETYPE-553-J4FOCNZGBVSFDFI4P3DBC7GXGJK62NFN5QH7Q5I46GZ5AP3FIVLQ\windows-jdk7-m3.2.x_build\archetype-testing\archetype-final\target\test-classes\projects\include-file-with-no-extension\target\generated-sources\archetype"): CreateProcess error=267, The directory name is invalid
	at org.apache.maven.archetype.creator.DefaultArchetypeCreatorIT.createFilesetArchetype(DefaultArchetypeCreatorIT.java:136)
	at org.apache.maven.archetype.creator.DefaultArchetypeCreatorIT.testIncludeFileWithNoExtension(DefaultArchetypeCreatorIT.java:189)
Caused by: java.io.IOException: CreateProcess error=267, The directory name is invalid
	at org.apache.maven.archetype.creator.DefaultArchetypeCreatorIT.createFilesetArchetype(DefaultArchetypeCreatorIT.java:136)
	at org.apache.maven.archetype.creator.DefaultArchetypeCreatorIT.testIncludeFileWithNoExtension(DefaultArchetypeCreatorIT.java:189)


FAILED:  org.apache.maven.archetype.creator.DefaultArchetypeCreatorIT.testSystemPropertiesAreIncluded

Error Message:
Error while executing process.

Stack Trace:
org.codehaus.plexus.util.cli.CommandLineException: Error while executing process.
	at org.apache.maven.archetype.creator.DefaultArchetypeCreatorIT.createFilesetArchetype(DefaultArchetypeCreatorIT.java:136)
	at org.apache.maven.archetype.creator.DefaultArchetypeCreatorIT.testSystemPropertiesAreIncluded(DefaultArchetypeCreatorIT.java:200)
Caused by: java.io.IOException: Cannot run program "F:\jenkins\tools\maven\apache-maven-3.2.5\bin\mvn.bat" (in directory "F:\jenkins\jenkins-slave\workspace\ven-archetype_ARCHETYPE-553-J4FOCNZGBVSFDFI4P3DBC7GXGJK62NFN5QH7Q5I46GZ5AP3FIVLQ\windows-jdk7-m3.2.x_build\archetype-testing\archetype-final\target\test-classes\projects\included-system-properties\target\generated-sources\archetype"): CreateProcess error=267, The directory name is invalid
	at org.apache.maven.archetype.creator.DefaultArchetypeCreatorIT.createFilesetArchetype(DefaultArchetypeCreatorIT.java:136)
	at org.apache.maven.archetype.creator.DefaultArchetypeCreatorIT.testSystemPropertiesAreIncluded(DefaultArchetypeCreatorIT.java:200)
Caused by: java.io.IOException: CreateProcess error=267, The directory name is invalid
	at org.apache.maven.archetype.creator.DefaultArchetypeCreatorIT.createFilesetArchetype(DefaultArchetypeCreatorIT.java:136)
	at org.apache.maven.archetype.creator.DefaultArchetypeCreatorIT.testSystemPropertiesAreIncluded(DefaultArchetypeCreatorIT.java:200)


FAILED:  org.apache.maven.archetype.creator.DefaultArchetypeCreatorIT.testChangeJavaFilenameWhenCustomPropertyEqualsClassName

Error Message:
Error while executing process.

Stack Trace:
org.codehaus.plexus.util.cli.CommandLineException: Error while executing process.
	at org.apache.maven.archetype.creator.DefaultArchetypeCreatorIT.createFilesetArchetype(DefaultArchetypeCreatorIT.java:136)
	at org.apache.maven.archetype.creator.DefaultArchetypeCreatorIT.testChangeJavaFilenameWhenCustomPropertyEqualsClassName(DefaultArchetypeCreatorIT.java:151)
Caused by: java.io.IOException: Cannot run program "F:\jenkins\tools\maven\apache-maven-3.2.5\bin\mvn.bat" (in directory "F:\jenkins\jenkins-slave\workspace\ven-archetype_ARCHETYPE-553-J4FOCNZGBVSFDFI4P3DBC7GXGJK62NFN5QH7Q5I46GZ5AP3FIVLQ\windows-jdk7-m3.2.x_build\archetype-testing\archetype-final\target\test-classes\projects\change-file-with-property\target\generated-sources\archetype"): CreateProcess error=267, The directory name is invalid
	at org.apache.maven.archetype.creator.DefaultArchetypeCreatorIT.createFilesetArchetype(DefaultArchetypeCreatorIT.java:136)
	at org.apache.maven.archetype.creator.DefaultArchetypeCreatorIT.testChangeJavaFilenameWhenCustomPropertyEqualsClassName(DefaultArchetypeCreatorIT.java:151)
Caused by: java.io.IOException: CreateProcess error=267, The directory name is invalid
	at org.apache.maven.archetype.creator.DefaultArchetypeCreatorIT.createFilesetArchetype(DefaultArchetypeCreatorIT.java:136)
	at org.apache.maven.archetype.creator.DefaultArchetypeCreatorIT.testChangeJavaFilenameWhenCustomPropertyEqualsClassName(DefaultArchetypeCreatorIT.java:151)


FAILED:  org.apache.maven.archetype.creator.DefaultArchetypeCreatorIT.testIncludeFileWithNoExtension

Error Message:
Error while executing process.

Stack Trace:
org.codehaus.plexus.util.cli.CommandLineException: Error while executing process.
	at org.apache.maven.archetype.creator.DefaultArchetypeCreatorIT.createFilesetArchetype(DefaultArchetypeCreatorIT.java:136)
	at org.apache.maven.archetype.creator.DefaultArchetypeCreatorIT.testIncludeFileWithNoExtension(DefaultArchetypeCreatorIT.java:189)
Caused by: java.io.IOException: Cannot run program "F:\jenkins\tools\maven\apache-maven-3.3.9\bin\mvn.cmd" (in directory "F:\jenkins\jenkins-slave\workspace\ven-archetype_ARCHETYPE-553-J4FOCNZGBVSFDFI4P3DBC7GXGJK62NFN5QH7Q5I46GZ5AP3FIVLQ\windows-jdk7-m3.3.x_build\archetype-testing\archetype-final\target\test-classes\projects\include-file-with-no-extension\target\generated-sources\archetype"): CreateProcess error=267, The directory name is invalid
	at org.apache.maven.archetype.creator.DefaultArchetypeCreatorIT.createFilesetArchetype(DefaultArchetypeCreatorIT.java:136)
	at org.apache.maven.archetype.creator.DefaultArchetypeCreatorIT.testIncludeFileWithNoExtension(DefaultArchetypeCreatorIT.java:189)
Caused by: java.io.IOException: CreateProcess error=267, The directory name is invalid
	at org.apache.maven.archetype.creator.DefaultArchetypeCreatorIT.createFilesetArchetype(DefaultArchetypeCreatorIT.java:136)
	at org.apache.maven.archetype.creator.DefaultArchetypeCreatorIT.testIncludeFileWithNoExtension(DefaultArchetypeCreatorIT.java:189)


FAILED:  org.apache.maven.archetype.creator.DefaultArchetypeCreatorIT.testSystemPropertiesAreIncluded

Error Message:
Error while executing process.

Stack Trace:
org.codehaus.plexus.util.cli.CommandLineException: Error while executing process.
	at org.apache.maven.archetype.creator.DefaultArchetypeCreatorIT.createFilesetArchetype(DefaultArchetypeCreatorIT.java:136)
	at org.apache.maven.archetype.creator.DefaultArchetypeCreatorIT.testSystemPropertiesAreIncluded(DefaultArchetypeCreatorIT.java:200)
Caused by: java.io.IOException: Cannot run program "F:\jenkins\tools\maven\apache-maven-3.3.9\bin\mvn.cmd" (in directory "F:\jenkins\jenkins-slave\workspace\ven-archetype_ARCHETYPE-553-J4FOCNZGBVSFDFI4P3DBC7GXGJK62NFN5QH7Q5I46GZ5AP3FIVLQ\windows-jdk7-m3.3.x_build\archetype-testing\archetype-final\target\test-classes\projects\included-system-properties\target\generated-sources\archetype"): CreateProcess error=267, The directory name is invalid
	at org.apache.maven.archetype.creator.DefaultArchetypeCreatorIT.createFilesetArchetype(DefaultArchetypeCreatorIT.java:136)
	at org.apache.maven.archetype.creator.DefaultArchetypeCreatorIT.testSystemPropertiesAreIncluded(DefaultArchetypeCreatorIT.java:200)
Caused by: java.io.IOException: CreateProcess error=267, The directory name is invalid
	at org.apache.maven.archetype.creator.DefaultArchetypeCreatorIT.createFilesetArchetype(DefaultArchetypeCreatorIT.java:136)
	at org.apache.maven.archetype.creator.DefaultArchetypeCreatorIT.testSystemPropertiesAreIncluded(DefaultArchetypeCreatorIT.java:200)


FAILED:  org.apache.maven.archetype.creator.DefaultArchetypeCreatorIT.testChangeJavaFilenameWhenCustomPropertyEqualsClassName

Error Message:
Error while executing process.

Stack Trace:
org.codehaus.plexus.util.cli.CommandLineException: Error while executing process.
	at org.apache.maven.archetype.creator.DefaultArchetypeCreatorIT.createFilesetArchetype(DefaultArchetypeCreatorIT.java:136)
	at org.apache.maven.archetype.creator.DefaultArchetypeCreatorIT.testChangeJavaFilenameWhenCustomPropertyEqualsClassName(DefaultArchetypeCreatorIT.java:151)
Caused by: java.io.IOException: Cannot run program "F:\jenkins\tools\maven\apache-maven-3.3.9\bin\mvn.cmd" (in directory "F:\jenkins\jenkins-slave\workspace\ven-archetype_ARCHETYPE-553-J4FOCNZGBVSFDFI4P3DBC7GXGJK62NFN5QH7Q5I46GZ5AP3FIVLQ\windows-jdk7-m3.3.x_build\archetype-testing\archetype-final\target\test-classes\projects\change-file-with-property\target\generated-sources\archetype"): CreateProcess error=267, The directory name is invalid
	at org.apache.maven.archetype.creator.DefaultArchetypeCreatorIT.createFilesetArchetype(DefaultArchetypeCreatorIT.java:136)
	at org.apache.maven.archetype.creator.DefaultArchetypeCreatorIT.testChangeJavaFilenameWhenCustomPropertyEqualsClassName(DefaultArchetypeCreatorIT.java:151)
Caused by: java.io.IOException: CreateProcess error=267, The directory name is invalid
	at org.apache.maven.archetype.creator.DefaultArchetypeCreatorIT.createFilesetArchetype(DefaultArchetypeCreatorIT.java:136)
	at org.apache.maven.archetype.creator.DefaultArchetypeCreatorIT.testChangeJavaFilenameWhenCustomPropertyEqualsClassName(DefaultArchetypeCreatorIT.java:151)


FAILED:  org.apache.maven.archetype.creator.DefaultArchetypeCreatorIT.testIncludeFileWithNoExtension

Error Message:
Error while executing process.

Stack Trace:
org.codehaus.plexus.util.cli.CommandLineException: Error while executing process.
	at org.apache.maven.archetype.creator.DefaultArchetypeCreatorIT.createFilesetArchetype(DefaultArchetypeCreatorIT.java:136)
	at org.apache.maven.archetype.creator.DefaultArchetypeCreatorIT.testIncludeFileWithNoExtension(DefaultArchetypeCreatorIT.java:189)
Caused by: java.io.IOException: Cannot run program "F:\jenkins\tools\maven\apache-maven-3.5.2\bin\mvn.cmd" (in directory "F:\jenkins\jenkins-slave\workspace\ven-archetype_ARCHETYPE-553-J4FOCNZGBVSFDFI4P3DBC7GXGJK62NFN5QH7Q5I46GZ5AP3FIVLQ\windows-jdk7-m3.5.x_build\archetype-testing\archetype-final\target\test-classes\projects\include-file-with-no-extension\target\generated-sources\archetype"): CreateProcess error=267, The directory name is invalid
	at org.apache.maven.archetype.creator.DefaultArchetypeCreatorIT.createFilesetArchetype(DefaultArchetypeCreatorIT.java:136)
	at org.apache.maven.archetype.creator.DefaultArchetypeCreatorIT.testIncludeFileWithNoExtension(DefaultArchetypeCreatorIT.java:189)
Caused by: java.io.IOException: CreateProcess error=267, The directory name is invalid
	at org.apache.maven.archetype.creator.DefaultArchetypeCreatorIT.createFilesetArchetype(DefaultArchetypeCreatorIT.java:136)
	at org.apache.maven.archetype.creator.DefaultArchetypeCreatorIT.testIncludeFileWithNoExtension(DefaultArchetypeCreatorIT.java:189)


FAILED:  org.apache.maven.archetype.creator.DefaultArchetypeCreatorIT.testSystemPropertiesAreIncluded

Error Message:
Error while executing process.

Stack Trace:
org.codehaus.plexus.util.cli.CommandLineException: Error while executing process.
	at org.apache.maven.archetype.creator.DefaultArchetypeCreatorIT.createFilesetArchetype(DefaultArchetypeCreatorIT.java:136)
	at org.apache.maven.archetype.creator.DefaultArchetypeCreatorIT.testSystemPropertiesAreIncluded(DefaultArchetypeCreatorIT.java:200)
Caused by: java.io.IOException: Cannot run program "F:\jenkins\tools\maven\apache-maven-3.5.2\bin\mvn.cmd" (in directory "F:\jenkins\jenkins-slave\workspace\ven-archetype_ARCHETYPE-553-J4FOCNZGBVSFDFI4P3DBC7GXGJK62NFN5QH7Q5I46GZ5AP3FIVLQ\windows-jdk7-m3.5.x_build\archetype-testing\archetype-final\target\test-classes\projects\included-system-properties\target\generated-sources\archetype"): CreateProcess error=267, The directory name is invalid
	at org.apache.maven.archetype.creator.DefaultArchetypeCreatorIT.createFilesetArchetype(DefaultArchetypeCreatorIT.java:136)
	at org.apache.maven.archetype.creator.DefaultArchetypeCreatorIT.testSystemPropertiesAreIncluded(DefaultArchetypeCreatorIT.java:200)
Caused by: java.io.IOException: CreateProcess error=267, The directory name is invalid
	at org.apache.maven.archetype.creator.DefaultArchetypeCreatorIT.createFilesetArchetype(DefaultArchetypeCreatorIT.java:136)
	at org.apache.maven.archetype.creator.DefaultArchetypeCreatorIT.testSystemPropertiesAreIncluded(DefaultArchetypeCreatorIT.java:200)


FAILED:  org.apache.maven.archetype.creator.DefaultArchetypeCreatorIT.testChangeJavaFilenameWhenCustomPropertyEqualsClassName

Error Message:
Error while executing process.

Stack Trace:
org.codehaus.plexus.util.cli.CommandLineException: Error while executing process.
	at org.apache.maven.archetype.creator.DefaultArchetypeCreatorIT.createFilesetArchetype(DefaultArchetypeCreatorIT.java:136)
	at org.apache.maven.archetype.creator.DefaultArchetypeCreatorIT.testChangeJavaFilenameWhenCustomPropertyEqualsClassName(DefaultArchetypeCreatorIT.java:151)
Caused by: java.io.IOException: Cannot run program "F:\jenkins\tools\maven\apache-maven-3.5.2\bin\mvn.cmd" (in directory "F:\jenkins\jenkins-slave\workspace\ven-archetype_ARCHETYPE-553-J4FOCNZGBVSFDFI4P3DBC7GXGJK62NFN5QH7Q5I46GZ5AP3FIVLQ\windows-jdk7-m3.5.x_build\archetype-testing\archetype-final\target\test-classes\projects\change-file-with-property\target\generated-sources\archetype"): CreateProcess error=267, The directory name is invalid
	at org.apache.maven.archetype.creator.DefaultArchetypeCreatorIT.createFilesetArchetype(DefaultArchetypeCreatorIT.java:136)
	at org.apache.maven.archetype.creator.DefaultArchetypeCreatorIT.testChangeJavaFilenameWhenCustomPropertyEqualsClassName(DefaultArchetypeCreatorIT.java:151)
Caused by: java.io.IOException: CreateProcess error=267, The directory name is invalid
	at org.apache.maven.archetype.creator.DefaultArchetypeCreatorIT.createFilesetArchetype(DefaultArchetypeCreatorIT.java:136)
	at org.apache.maven.archetype.creator.DefaultArchetypeCreatorIT.testChangeJavaFilenameWhenCustomPropertyEqualsClassName(DefaultArchetypeCreatorIT.java:151)


FAILED:  org.apache.maven.archetype.creator.DefaultArchetypeCreatorIT.testIncludeFileWithNoExtension

Error Message:
Error while executing process.

Stack Trace:
org.codehaus.plexus.util.cli.CommandLineException: Error while executing process.
	at org.apache.maven.archetype.creator.DefaultArchetypeCreatorIT.createFilesetArchetype(DefaultArchetypeCreatorIT.java:136)
	at org.apache.maven.archetype.creator.DefaultArchetypeCreatorIT.testIncludeFileWithNoExtension(DefaultArchetypeCreatorIT.java:189)
Caused by: java.io.IOException: Cannot run program "F:\jenkins\tools\maven\apache-maven-3.5.2\bin\mvn.cmd" (in directory "F:\jenkins\jenkins-slave\workspace\ven-archetype_ARCHETYPE-553-J4FOCNZGBVSFDFI4P3DBC7GXGJK62NFN5QH7Q5I46GZ5AP3FIVLQ\windows-jdk8-m3.5.x_build\archetype-testing\archetype-final\target\test-classes\projects\include-file-with-no-extension\target\generated-sources\archetype"): CreateProcess error=267, The directory name is invalid
	at org.apache.maven.archetype.creator.DefaultArchetypeCreatorIT.createFilesetArchetype(DefaultArchetypeCreatorIT.java:136)
	at org.apache.maven.archetype.creator.DefaultArchetypeCreatorIT.testIncludeFileWithNoExtension(DefaultArchetypeCreatorIT.java:189)
Caused by: java.io.IOException: CreateProcess error=267, The directory name is invalid
	at org.apache.maven.archetype.creator.DefaultArchetypeCreatorIT.createFilesetArchetype(DefaultArchetypeCreatorIT.java:136)
	at org.apache.maven.archetype.creator.DefaultArchetypeCreatorIT.testIncludeFileWithNoExtension(DefaultArchetypeCreatorIT.java:189)


FAILED:  org.apache.maven.archetype.creator.DefaultArchetypeCreatorIT.testSystemPropertiesAreIncluded

Error Message:
Error while executing process.

Stack Trace:
org.codehaus.plexus.util.cli.CommandLineException: Error while executing process.
	at org.apache.maven.archetype.creator.DefaultArchetypeCreatorIT.createFilesetArchetype(DefaultArchetypeCreatorIT.java:136)
	at org.apache.maven.archetype.creator.DefaultArchetypeCreatorIT.testSystemPropertiesAreIncluded(DefaultArchetypeCreatorIT.java:200)
Caused by: java.io.IOException: Cannot run program "F:\jenkins\tools\maven\apache-maven-3.5.2\bin\mvn.cmd" (in directory "F:\jenkins\jenkins-slave\workspace\ven-archetype_ARCHETYPE-553-J4FOCNZGBVSFDFI4P3DBC7GXGJK62NFN5QH7Q5I46GZ5AP3FIVLQ\windows-jdk8-m3.5.x_build\archetype-testing\archetype-final\target\test-classes\projects\included-system-properties\target\generated-sources\archetype"): CreateProcess error=267, The directory name is invalid
	at org.apache.maven.archetype.creator.DefaultArchetypeCreatorIT.createFilesetArchetype(DefaultArchetypeCreatorIT.java:136)
	at org.apache.maven.archetype.creator.DefaultArchetypeCreatorIT.testSystemPropertiesAreIncluded(DefaultArchetypeCreatorIT.java:200)
Caused by: java.io.IOException: CreateProcess error=267, The directory name is invalid
	at org.apache.maven.archetype.creator.DefaultArchetypeCreatorIT.createFilesetArchetype(DefaultArchetypeCreatorIT.java:136)
	at org.apache.maven.archetype.creator.DefaultArchetypeCreatorIT.testSystemPropertiesAreIncluded(DefaultArchetypeCreatorIT.java:200)


FAILED:  org.apache.maven.archetype.creator.DefaultArchetypeCreatorIT.testChangeJavaFilenameWhenCustomPropertyEqualsClassName

Error Message:
Error while executing process.

Stack Trace:
org.codehaus.plexus.util.cli.CommandLineException: Error while executing process.
	at org.apache.maven.archetype.creator.DefaultArchetypeCreatorIT.createFilesetArchetype(DefaultArchetypeCreatorIT.java:136)
	at org.apache.maven.archetype.creator.DefaultArchetypeCreatorIT.testChangeJavaFilenameWhenCustomPropertyEqualsClassName(DefaultArchetypeCreatorIT.java:151)
Caused by: java.io.IOException: Cannot run program "F:\jenkins\tools\maven\apache-maven-3.5.2\bin\mvn.cmd" (in directory "F:\jenkins\jenkins-slave\workspace\ven-archetype_ARCHETYPE-553-J4FOCNZGBVSFDFI4P3DBC7GXGJK62NFN5QH7Q5I46GZ5AP3FIVLQ\windows-jdk8-m3.5.x_build\archetype-testing\archetype-final\target\test-classes\projects\change-file-with-property\target\generated-sources\archetype"): CreateProcess error=267, The directory name is invalid
	at org.apache.maven.archetype.creator.DefaultArchetypeCreatorIT.createFilesetArchetype(DefaultArchetypeCreatorIT.java:136)
	at org.apache.maven.archetype.creator.DefaultArchetypeCreatorIT.testChangeJavaFilenameWhenCustomPropertyEqualsClassName(DefaultArchetypeCreatorIT.java:151)
Caused by: java.io.IOException: CreateProcess error=267, The directory name is invalid
	at org.apache.maven.archetype.creator.DefaultArchetypeCreatorIT.createFilesetArchetype(DefaultArchetypeCreatorIT.java:136)
	at org.apache.maven.archetype.creator.DefaultArchetypeCreatorIT.testChangeJavaFilenameWhenCustomPropertyEqualsClassName(DefaultArchetypeCreatorIT.java:151)


FAILED:  org.apache.maven.archetype.creator.DefaultArchetypeCreatorIT.testIncludeFileWithNoExtension

Error Message:
Error while executing process.

Stack Trace:
org.codehaus.plexus.util.cli.CommandLineException: Error while executing process.
	at org.apache.maven.archetype.creator.DefaultArchetypeCreatorIT.createFilesetArchetype(DefaultArchetypeCreatorIT.java:136)
	at org.apache.maven.archetype.creator.DefaultArchetypeCreatorIT.testIncludeFileWithNoExtension(DefaultArchetypeCreatorIT.java:189)
Caused by: java.io.IOException: Cannot run program "F:\jenkins\tools\maven\apache-maven-3.5.2\bin\mvn.cmd" (in directory "F:\jenkins\jenkins-slave\workspace\ven-archetype_ARCHETYPE-553-J4FOCNZGBVSFDFI4P3DBC7GXGJK62NFN5QH7Q5I46GZ5AP3FIVLQ\windows-jdk9-m3.5.x_build\archetype-testing\archetype-final\target\test-classes\projects\include-file-with-no-extension\target\generated-sources\archetype"): CreateProcess error=267, The directory name is invalid
	at org.apache.maven.archetype.creator.DefaultArchetypeCreatorIT.createFilesetArchetype(DefaultArchetypeCreatorIT.java:136)
	at org.apache.maven.archetype.creator.DefaultArchetypeCreatorIT.testIncludeFileWithNoExtension(DefaultArchetypeCreatorIT.java:189)
Caused by: java.io.IOException: CreateProcess error=267, The directory name is invalid
	at org.apache.maven.archetype.creator.DefaultArchetypeCreatorIT.createFilesetArchetype(DefaultArchetypeCreatorIT.java:136)
	at org.apache.maven.archetype.creator.DefaultArchetypeCreatorIT.testIncludeFileWithNoExtension(DefaultArchetypeCreatorIT.java:189)


FAILED:  org.apache.maven.archetype.creator.DefaultArchetypeCreatorIT.testSystemPropertiesAreIncluded

Error Message:
Error while executing process.

Stack Trace:
org.codehaus.plexus.util.cli.CommandLineException: Error while executing process.
	at org.apache.maven.archetype.creator.DefaultArchetypeCreatorIT.createFilesetArchetype(DefaultArchetypeCreatorIT.java:136)
	at org.apache.maven.archetype.creator.DefaultArchetypeCreatorIT.testSystemPropertiesAreIncluded(DefaultArchetypeCreatorIT.java:200)
Caused by: java.io.IOException: Cannot run program "F:\jenkins\tools\maven\apache-maven-3.5.2\bin\mvn.cmd" (in directory "F:\jenkins\jenkins-slave\workspace\ven-archetype_ARCHETYPE-553-J4FOCNZGBVSFDFI4P3DBC7GXGJK62NFN5QH7Q5I46GZ5AP3FIVLQ\windows-jdk9-m3.5.x_build\archetype-testing\archetype-final\target\test-classes\projects\included-system-properties\target\generated-sources\archetype"): CreateProcess error=267, The directory name is invalid
	at org.apache.maven.archetype.creator.DefaultArchetypeCreatorIT.createFilesetArchetype(DefaultArchetypeCreatorIT.java:136)
	at org.apache.maven.archetype.creator.DefaultArchetypeCreatorIT.testSystemPropertiesAreIncluded(DefaultArchetypeCreatorIT.java:200)
Caused by: java.io.IOException: CreateProcess error=267, The directory name is invalid
	at org.apache.maven.archetype.creator.DefaultArchetypeCreatorIT.createFilesetArchetype(DefaultArchetypeCreatorIT.java:136)
	at org.apache.maven.archetype.creator.DefaultArchetypeCreatorIT.testSystemPropertiesAreIncluded(DefaultArchetypeCreatorIT.java:200)


FAILED:  org.apache.maven.archetype.creator.DefaultArchetypeCreatorIT.testChangeJavaFilenameWhenCustomPropertyEqualsClassName

Error Message:
Error while executing process.

Stack Trace:
org.codehaus.plexus.util.cli.CommandLineException: Error while executing process.
	at org.apache.maven.archetype.creator.DefaultArchetypeCreatorIT.createFilesetArchetype(DefaultArchetypeCreatorIT.java:136)
	at org.apache.maven.archetype.creator.DefaultArchetypeCreatorIT.testChangeJavaFilenameWhenCustomPropertyEqualsClassName(DefaultArchetypeCreatorIT.java:151)
Caused by: java.io.IOException: Cannot run program "F:\jenkins\tools\maven\apache-maven-3.5.2\bin\mvn.cmd" (in directory "F:\jenkins\jenkins-slave\workspace\ven-archetype_ARCHETYPE-553-J4FOCNZGBVSFDFI4P3DBC7GXGJK62NFN5QH7Q5I46GZ5AP3FIVLQ\windows-jdk9-m3.5.x_build\archetype-testing\archetype-final\target\test-classes\projects\change-file-with-property\target\generated-sources\archetype"): CreateProcess error=267, The directory name is invalid
	at org.apache.maven.archetype.creator.DefaultArchetypeCreatorIT.createFilesetArchetype(DefaultArchetypeCreatorIT.java:136)
	at org.apache.maven.archetype.creator.DefaultArchetypeCreatorIT.testChangeJavaFilenameWhenCustomPropertyEqualsClassName(DefaultArchetypeCreatorIT.java:151)
Caused by: java.io.IOException: CreateProcess error=267, The directory name is invalid
	at org.apache.maven.archetype.creator.DefaultArchetypeCreatorIT.createFilesetArchetype(DefaultArchetypeCreatorIT.java:136)
	at org.apache.maven.archetype.creator.DefaultArchetypeCreatorIT.testChangeJavaFilenameWhenCustomPropertyEqualsClassName(DefaultArchetypeCreatorIT.java:151)


FAILED:  org.apache.maven.archetype.creator.DefaultArchetypeCreatorIT.testIncludeFileWithNoExtension

Error Message:
Error while executing process.

Stack Trace:
org.codehaus.plexus.util.cli.CommandLineException: Error while executing process.
	at org.apache.maven.archetype.creator.DefaultArchetypeCreatorIT.createFilesetArchetype(DefaultArchetypeCreatorIT.java:136)
	at org.apache.maven.archetype.creator.DefaultArchetypeCreatorIT.testIncludeFileWithNoExtension(DefaultArchetypeCreatorIT.java:189)
Caused by: java.io.IOException: Cannot run program "F:\jenkins\tools\maven\apache-maven-3.5.2\bin\mvn.cmd" (in directory "F:\jenkins\jenkins-slave\workspace\ven-archetype_ARCHETYPE-553-J4FOCNZGBVSFDFI4P3DBC7GXGJK62NFN5QH7Q5I46GZ5AP3FIVLQ@2\windows-jdk10-m3.5.x_build\archetype-testing\archetype-final\target\test-classes\projects\include-file-with-no-extension\target\generated-sources\archetype"): CreateProcess error=267, The directory name is invalid
	at org.apache.maven.archetype.creator.DefaultArchetypeCreatorIT.createFilesetArchetype(DefaultArchetypeCreatorIT.java:136)
	at org.apache.maven.archetype.creator.DefaultArchetypeCreatorIT.testIncludeFileWithNoExtension(DefaultArchetypeCreatorIT.java:189)
Caused by: java.io.IOException: CreateProcess error=267, The directory name is invalid
	at org.apache.maven.archetype.creator.DefaultArchetypeCreatorIT.createFilesetArchetype(DefaultArchetypeCreatorIT.java:136)
	at org.apache.maven.archetype.creator.DefaultArchetypeCreatorIT.testIncludeFileWithNoExtension(DefaultArchetypeCreatorIT.java:189)


FAILED:  org.apache.maven.archetype.creator.DefaultArchetypeCreatorIT.testSystemPropertiesAreIncluded

Error Message:
Error while executing process.

Stack Trace:
org.codehaus.plexus.util.cli.CommandLineException: Error while executing process.
	at org.apache.maven.archetype.creator.DefaultArchetypeCreatorIT.createFilesetArchetype(DefaultArchetypeCreatorIT.java:136)
	at org.apache.maven.archetype.creator.DefaultArchetypeCreatorIT.testSystemPropertiesAreIncluded(DefaultArchetypeCreatorIT.java:200)
Caused by: java.io.IOException: Cannot run program "F:\jenkins\tools\maven\apache-maven-3.5.2\bin\mvn.cmd" (in directory "F:\jenkins\jenkins-slave\workspace\ven-archetype_ARCHETYPE-553-J4FOCNZGBVSFDFI4P3DBC7GXGJK62NFN5QH7Q5I46GZ5AP3FIVLQ@2\windows-jdk10-m3.5.x_build\archetype-testing\archetype-final\target\test-classes\projects\included-system-properties\target\generated-sources\archetype"): CreateProcess error=267, The directory name is invalid
	at org.apache.maven.archetype.creator.DefaultArchetypeCreatorIT.createFilesetArchetype(DefaultArchetypeCreatorIT.java:136)
	at org.apache.maven.archetype.creator.DefaultArchetypeCreatorIT.testSystemPropertiesAreIncluded(DefaultArchetypeCreatorIT.java:200)
Caused by: java.io.IOException: CreateProcess error=267, The directory name is invalid
	at org.apache.maven.archetype.creator.DefaultArchetypeCreatorIT.createFilesetArchetype(DefaultArchetypeCreatorIT.java:136)
	at org.apache.maven.archetype.creator.DefaultArchetypeCreatorIT.testSystemPropertiesAreIncluded(DefaultArchetypeCreatorIT.java:200)


FAILED:  org.apache.maven.archetype.creator.DefaultArchetypeCreatorIT.testChangeJavaFilenameWhenCustomPropertyEqualsClassName

Error Message:
Error while executing process.

Stack Trace:
org.codehaus.plexus.util.cli.CommandLineException: Error while executing process.
	at org.apache.maven.archetype.creator.DefaultArchetypeCreatorIT.createFilesetArchetype(DefaultArchetypeCreatorIT.java:136)
	at org.apache.maven.archetype.creator.DefaultArchetypeCreatorIT.testChangeJavaFilenameWhenCustomPropertyEqualsClassName(DefaultArchetypeCreatorIT.java:151)
Caused by: java.io.IOException: Cannot run program "F:\jenkins\tools\maven\apache-maven-3.5.2\bin\mvn.cmd" (in directory "F:\jenkins\jenkins-slave\workspace\ven-archetype_ARCHETYPE-553-J4FOCNZGBVSFDFI4P3DBC7GXGJK62NFN5QH7Q5I46GZ5AP3FIVLQ@2\windows-jdk10-m3.5.x_build\archetype-testing\archetype-final\target\test-classes\projects\change-file-with-property\target\generated-sources\archetype"): CreateProcess error=267, The directory name is invalid
	at org.apache.maven.archetype.creator.DefaultArchetypeCreatorIT.createFilesetArchetype(DefaultArchetypeCreatorIT.java:136)
	at org.apache.maven.archetype.creator.DefaultArchetypeCreatorIT.testChangeJavaFilenameWhenCustomPropertyEqualsClassName(DefaultArchetypeCreatorIT.java:151)
Caused by: java.io.IOException: CreateProcess error=267, The directory name is invalid
	at org.apache.maven.archetype.creator.DefaultArchetypeCreatorIT.createFilesetArchetype(DefaultArchetypeCreatorIT.java:136)
	at org.apache.maven.archetype.creator.DefaultArchetypeCreatorIT.testChangeJavaFilenameWhenCustomPropertyEqualsClassName(DefaultArchetypeCreatorIT.java:151)


FAILED:  org.apache.maven.archetype.test.ArchetyperRoundtripIT.testArchetyper

Error Message:
Error while executing process.

Stack Trace:
org.codehaus.plexus.util.cli.CommandLineException: Error while executing process.
	at org.apache.maven.archetype.test.ArchetyperRoundtripIT.testArchetyper(ArchetyperRoundtripIT.java:121)
Caused by: java.io.IOException: Cannot run program "F:\jenkins\tools\maven\apache-maven-3.2.5\bin\mvn.bat" (in directory "F:\jenkins\jenkins-slave\workspace\ven-archetype_ARCHETYPE-553-J4FOCNZGBVSFDFI4P3DBC7GXGJK62NFN5QH7Q5I46GZ5AP3FIVLQ\windows-jdk7-m3.2.x_build\archetype-testing\archetype-final\target\test-classes\projects\roundtrip-1-project\target\generated-sources\archetype"): CreateProcess error=267, The directory name is invalid
	at org.apache.maven.archetype.test.ArchetyperRoundtripIT.testArchetyper(ArchetyperRoundtripIT.java:121)
Caused by: java.io.IOException: CreateProcess error=267, The directory name is invalid
	at org.apache.maven.archetype.test.ArchetyperRoundtripIT.testArchetyper(ArchetyperRoundtripIT.java:121)


FAILED:  org.apache.maven.archetype.test.ArchetyperRoundtripIT.testArchetyper

Error Message:
Error while executing process.

Stack Trace:
org.codehaus.plexus.util.cli.CommandLineException: Error while executing process.
	at org.apache.maven.archetype.test.ArchetyperRoundtripIT.testArchetyper(ArchetyperRoundtripIT.java:121)
Caused by: java.io.IOException: Cannot run program "F:\jenkins\tools\maven\apache-maven-3.3.9\bin\mvn.cmd" (in directory "F:\jenkins\jenkins-slave\workspace\ven-archetype_ARCHETYPE-553-J4FOCNZGBVSFDFI4P3DBC7GXGJK62NFN5QH7Q5I46GZ5AP3FIVLQ\windows-jdk7-m3.3.x_build\archetype-testing\archetype-final\target\test-classes\projects\roundtrip-1-project\target\generated-sources\archetype"): CreateProcess error=267, The directory name is invalid
	at org.apache.maven.archetype.test.ArchetyperRoundtripIT.testArchetyper(ArchetyperRoundtripIT.java:121)
Caused by: java.io.IOException: CreateProcess error=267, The directory name is invalid
	at org.apache.maven.archetype.test.ArchetyperRoundtripIT.testArchetyper(ArchetyperRoundtripIT.java:121)


FAILED:  org.apache.maven.archetype.test.ArchetyperRoundtripIT.testArchetyper

Error Message:
Error while executing process.

Stack Trace:
org.codehaus.plexus.util.cli.CommandLineException: Error while executing process.
	at org.apache.maven.archetype.test.ArchetyperRoundtripIT.testArchetyper(ArchetyperRoundtripIT.java:121)
Caused by: java.io.IOException: Cannot run program "F:\jenkins\tools\maven\apache-maven-3.5.2\bin\mvn.cmd" (in directory "F:\jenkins\jenkins-slave\workspace\ven-archetype_ARCHETYPE-553-J4FOCNZGBVSFDFI4P3DBC7GXGJK62NFN5QH7Q5I46GZ5AP3FIVLQ\windows-jdk7-m3.5.x_build\archetype-testing\archetype-final\target\test-classes\projects\roundtrip-1-project\target\generated-sources\archetype"): CreateProcess error=267, The directory name is invalid
	at org.apache.maven.archetype.test.ArchetyperRoundtripIT.testArchetyper(ArchetyperRoundtripIT.java:121)
Caused by: java.io.IOException: CreateProcess error=267, The directory name is invalid
	at org.apache.maven.archetype.test.ArchetyperRoundtripIT.testArchetyper(ArchetyperRoundtripIT.java:121)


FAILED:  org.apache.maven.archetype.test.ArchetyperRoundtripIT.testArchetyper

Error Message:
Error while executing process.

Stack Trace:
org.codehaus.plexus.util.cli.CommandLineException: Error while executing process.
	at org.apache.maven.archetype.test.ArchetyperRoundtripIT.testArchetyper(ArchetyperRoundtripIT.java:121)
Caused by: java.io.IOException: Cannot run program "F:\jenkins\tools\maven\apache-maven-3.5.2\bin\mvn.cmd" (in directory "F:\jenkins\jenkins-slave\workspace\ven-archetype_ARCHETYPE-553-J4FOCNZGBVSFDFI4P3DBC7GXGJK62NFN5QH7Q5I46GZ5AP3FIVLQ\windows-jdk8-m3.5.x_build\archetype-testing\archetype-final\target\test-classes\projects\roundtrip-1-project\target\generated-sources\archetype"): CreateProcess error=267, The directory name is invalid
	at org.apache.maven.archetype.test.ArchetyperRoundtripIT.testArchetyper(ArchetyperRoundtripIT.java:121)
Caused by: java.io.IOException: CreateProcess error=267, The directory name is invalid
	at org.apache.maven.archetype.test.ArchetyperRoundtripIT.testArchetyper(ArchetyperRoundtripIT.java:121)


FAILED:  org.apache.maven.archetype.test.ArchetyperRoundtripIT.testArchetyper

Error Message:
Error while executing process.

Stack Trace:
org.codehaus.plexus.util.cli.CommandLineException: Error while executing process.
	at org.apache.maven.archetype.test.ArchetyperRoundtripIT.testArchetyper(ArchetyperRoundtripIT.java:121)
Caused by: java.io.IOException: Cannot run program "F:\jenkins\tools\maven\apache-maven-3.5.2\bin\mvn.cmd" (in directory "F:\jenkins\jenkins-slave\workspace\ven-archetype_ARCHETYPE-553-J4FOCNZGBVSFDFI4P3DBC7GXGJK62NFN5QH7Q5I46GZ5AP3FIVLQ\windows-jdk9-m3.5.x_build\archetype-testing\archetype-final\target\test-classes\projects\roundtrip-1-project\target\generated-sources\archetype"): CreateProcess error=267, The directory name is invalid
	at org.apache.maven.archetype.test.ArchetyperRoundtripIT.testArchetyper(ArchetyperRoundtripIT.java:121)
Caused by: java.io.IOException: CreateProcess error=267, The directory name is invalid
	at org.apache.maven.archetype.test.ArchetyperRoundtripIT.testArchetyper(ArchetyperRoundtripIT.java:121)


FAILED:  org.apache.maven.archetype.test.ArchetyperRoundtripIT.testArchetyper

Error Message:
Error while executing process.

Stack Trace:
org.codehaus.plexus.util.cli.CommandLineException: Error while executing process.
	at org.apache.maven.archetype.test.ArchetyperRoundtripIT.testArchetyper(ArchetyperRoundtripIT.java:121)
Caused by: java.io.IOException: Cannot run program "F:\jenkins\tools\maven\apache-maven-3.5.2\bin\mvn.cmd" (in directory "F:\jenkins\jenkins-slave\workspace\ven-archetype_ARCHETYPE-553-J4FOCNZGBVSFDFI4P3DBC7GXGJK62NFN5QH7Q5I46GZ5AP3FIVLQ@2\windows-jdk10-m3.5.x_build\archetype-testing\archetype-final\target\test-classes\projects\roundtrip-1-project\target\generated-sources\archetype"): CreateProcess error=267, The directory name is invalid
	at org.apache.maven.archetype.test.ArchetyperRoundtripIT.testArchetyper(ArchetyperRoundtripIT.java:121)
Caused by: java.io.IOException: CreateProcess error=267, The directory name is invalid
	at org.apache.maven.archetype.test.ArchetyperRoundtripIT.testArchetyper(ArchetyperRoundtripIT.java:121)


FAILED:  org.apache.maven.archetype.test.ArchetyperRoundtripWithProxyIT.testArchetyper

Error Message:
Error while executing process.

Stack Trace:
org.codehaus.plexus.util.cli.CommandLineException: Error while executing process.
	at org.apache.maven.archetype.test.ArchetyperRoundtripWithProxyIT.testArchetyper(ArchetyperRoundtripWithProxyIT.java:126)
Caused by: java.io.IOException: Cannot run program "F:\jenkins\tools\maven\apache-maven-3.2.5\bin\mvn.bat" (in directory "F:\jenkins\jenkins-slave\workspace\ven-archetype_ARCHETYPE-553-J4FOCNZGBVSFDFI4P3DBC7GXGJK62NFN5QH7Q5I46GZ5AP3FIVLQ\windows-jdk7-m3.2.x_build\archetype-testing\archetype-final\target\test-classes\projects\roundtrip-2-project\target\generated-sources\archetype"): CreateProcess error=267, The directory name is invalid
	at org.apache.maven.archetype.test.ArchetyperRoundtripWithProxyIT.testArchetyper(ArchetyperRoundtripWithProxyIT.java:126)
Caused by: java.io.IOException: CreateProcess error=267, The directory name is invalid
	at org.apache.maven.archetype.test.ArchetyperRoundtripWithProxyIT.testArchetyper(ArchetyperRoundtripWithProxyIT.java:126)


FAILED:  org.apache.maven.archetype.test.ArchetyperRoundtripWithProxyIT.testArchetyper

Error Message:
Error while executing process.

Stack Trace:
org.codehaus.plexus.util.cli.CommandLineException: Error while executing process.
	at org.apache.maven.archetype.test.ArchetyperRoundtripWithProxyIT.testArchetyper(ArchetyperRoundtripWithProxyIT.java:126)
Caused by: java.io.IOException: Cannot run program "F:\jenkins\tools\maven\apache-maven-3.3.9\bin\mvn.cmd" (in directory "F:\jenkins\jenkins-slave\workspace\ven-archetype_ARCHETYPE-553-J4FOCNZGBVSFDFI4P3DBC7GXGJK62NFN5QH7Q5I46GZ5AP3FIVLQ\windows-jdk7-m3.3.x_build\archetype-testing\archetype-final\target\test-classes\projects\roundtrip-2-project\target\generated-sources\archetype"): CreateProcess error=267, The directory name is invalid
	at org.apache.maven.archetype.test.ArchetyperRoundtripWithProxyIT.testArchetyper(ArchetyperRoundtripWithProxyIT.java:126)
Caused by: java.io.IOException: CreateProcess error=267, The directory name is invalid
	at org.apache.maven.archetype.test.ArchetyperRoundtripWithProxyIT.testArchetyper(ArchetyperRoundtripWithProxyIT.java:126)


FAILED:  org.apache.maven.archetype.test.ArchetyperRoundtripWithProxyIT.testArchetyper

Error Message:
Error while executing process.

Stack Trace:
org.codehaus.plexus.util.cli.CommandLineException: Error while executing process.
	at org.apache.maven.archetype.test.ArchetyperRoundtripWithProxyIT.testArchetyper(ArchetyperRoundtripWithProxyIT.java:126)
Caused by: java.io.IOException: Cannot run program "F:\jenkins\tools\maven\apache-maven-3.5.2\bin\mvn.cmd" (in directory "F:\jenkins\jenkins-slave\workspace\ven-archetype_ARCHETYPE-553-J4FOCNZGBVSFDFI4P3DBC7GXGJK62NFN5QH7Q5I46GZ5AP3FIVLQ\windows-jdk7-m3.5.x_build\archetype-testing\archetype-final\target\test-classes\projects\roundtrip-2-project\target\generated-sources\archetype"): CreateProcess error=267, The directory name is invalid
	at org.apache.maven.archetype.test.ArchetyperRoundtripWithProxyIT.testArchetyper(ArchetyperRoundtripWithProxyIT.java:126)
Caused by: java.io.IOException: CreateProcess error=267, The directory name is invalid
	at org.apache.maven.archetype.test.ArchetyperRoundtripWithProxyIT.testArchetyper(ArchetyperRoundtripWithProxyIT.java:126)


FAILED:  org.apache.maven.archetype.test.ArchetyperRoundtripWithProxyIT.testArchetyper

Error Message:
Error while executing process.

Stack Trace:
org.codehaus.plexus.util.cli.CommandLineException: Error while executing process.
	at org.apache.maven.archetype.test.ArchetyperRoundtripWithProxyIT.testArchetyper(ArchetyperRoundtripWithProxyIT.java:126)
Caused by: java.io.IOException: Cannot run program "F:\jenkins\tools\maven\apache-maven-3.5.2\bin\mvn.cmd" (in directory "F:\jenkins\jenkins-slave\workspace\ven-archetype_ARCHETYPE-553-J4FOCNZGBVSFDFI4P3DBC7GXGJK62NFN5QH7Q5I46GZ5AP3FIVLQ\windows-jdk8-m3.5.x_build\archetype-testing\archetype-final\target\test-classes\projects\roundtrip-2-project\target\generated-sources\archetype"): CreateProcess error=267, The directory name is invalid
	at org.apache.maven.archetype.test.ArchetyperRoundtripWithProxyIT.testArchetyper(ArchetyperRoundtripWithProxyIT.java:126)
Caused by: java.io.IOException: CreateProcess error=267, The directory name is invalid
	at org.apache.maven.archetype.test.ArchetyperRoundtripWithProxyIT.testArchetyper(ArchetyperRoundtripWithProxyIT.java:126)


FAILED:  org.apache.maven.archetype.test.ArchetyperRoundtripWithProxyIT.testArchetyper

Error Message:
Error while executing process.

Stack Trace:
org.codehaus.plexus.util.cli.CommandLineException: Error while executing process.
	at org.apache.maven.archetype.test.ArchetyperRoundtripWithProxyIT.testArchetyper(ArchetyperRoundtripWithProxyIT.java:126)
Caused by: java.io.IOException: Cannot run program "F:\jenkins\tools\maven\apache-maven-3.5.2\bin\mvn.cmd" (in directory "F:\jenkins\jenkins-slave\workspace\ven-archetype_ARCHETYPE-553-J4FOCNZGBVSFDFI4P3DBC7GXGJK62NFN5QH7Q5I46GZ5AP3FIVLQ\windows-jdk9-m3.5.x_build\archetype-testing\archetype-final\target\test-classes\projects\roundtrip-2-project\target\generated-sources\archetype"): CreateProcess error=267, The directory name is invalid
	at org.apache.maven.archetype.test.ArchetyperRoundtripWithProxyIT.testArchetyper(ArchetyperRoundtripWithProxyIT.java:126)
Caused by: java.io.IOException: CreateProcess error=267, The directory name is invalid
	at org.apache.maven.archetype.test.ArchetyperRoundtripWithProxyIT.testArchetyper(ArchetyperRoundtripWithProxyIT.java:126)


FAILED:  org.apache.maven.archetype.test.ArchetyperRoundtripWithProxyIT.testArchetyper

Error Message:
Error while executing process.

Stack Trace:
org.codehaus.plexus.util.cli.CommandLineException: Error while executing process.
	at org.apache.maven.archetype.test.ArchetyperRoundtripWithProxyIT.testArchetyper(ArchetyperRoundtripWithProxyIT.java:126)
Caused by: java.io.IOException: Cannot run program "F:\jenkins\tools\maven\apache-maven-3.5.2\bin\mvn.cmd" (in directory "F:\jenkins\jenkins-slave\workspace\ven-archetype_ARCHETYPE-553-J4FOCNZGBVSFDFI4P3DBC7GXGJK62NFN5QH7Q5I46GZ5AP3FIVLQ@2\windows-jdk10-m3.5.x_build\archetype-testing\archetype-final\target\test-classes\projects\roundtrip-2-project\target\generated-sources\archetype"): CreateProcess error=267, The directory name is invalid
	at org.apache.maven.archetype.test.ArchetyperRoundtripWithProxyIT.testArchetyper(ArchetyperRoundtripWithProxyIT.java:126)
Caused by: java.io.IOException: CreateProcess error=267, The directory name is invalid
	at org.apache.maven.archetype.test.ArchetyperRoundtripWithProxyIT.testArchetyper(ArchetyperRoundtripWithProxyIT.java:126)




Build log:
[...truncated 9.65 MB...]
[windows-jdk10-m3.5.x_build] Running org.apache.maven.archetype.test.ArchetyperRoundtripWithProxyIT
[windows-jdk10-m3.5.x_build] Tests run: 1, Failures: 0, Errors: 1, Skipped: 0, Time elapsed: 0.514 sec <<< FAILURE! - in org.apache.maven.archetype.test.ArchetyperRoundtripWithProxyIT
[windows-jdk10-m3.5.x_build] testArchetyper(org.apache.maven.archetype.test.ArchetyperRoundtripWithProxyIT)  Time elapsed: 0.514 sec  <<< ERROR!
[windows-jdk10-m3.5.x_build] org.codehaus.plexus.util.cli.CommandLineException: Error while executing process.
[windows-jdk10-m3.5.x_build] 	at org.apache.maven.archetype.test.ArchetyperRoundtripWithProxyIT.testArchetyper(ArchetyperRoundtripWithProxyIT.java:126)
[windows-jdk10-m3.5.x_build] Caused by: java.io.IOException: Cannot run program "F:\jenkins\tools\maven\apache-maven-3.5.2\bin\mvn.cmd" (in directory "F:\jenkins\jenkins-slave\workspace\ven-archetype_ARCHETYPE-553-J4FOCNZGBVSFDFI4P3DBC7GXGJK62NFN5QH7Q5I46GZ5AP3FIVLQ@2\windows-jdk10-m3.5.x_build\archetype-testing\archetype-final\target\test-classes\projects\roundtrip-2-project\target\generated-sources\archetype"): CreateProcess error=267, The directory name is invalid
[windows-jdk10-m3.5.x_build] 	at org.apache.maven.archetype.test.ArchetyperRoundtripWithProxyIT.testArchetyper(ArchetyperRoundtripWithProxyIT.java:126)
[windows-jdk10-m3.5.x_build] Caused by: java.io.IOException: CreateProcess error=267, The directory name is invalid
[windows-jdk10-m3.5.x_build] 	at org.apache.maven.archetype.test.ArchetyperRoundtripWithProxyIT.testArchetyper(ArchetyperRoundtripWithProxyIT.java:126)
[windows-jdk10-m3.5.x_build] 
[windows-jdk10-m3.5.x_build] Running org.apache.maven.archetype.test.RoundtripMultiModuleIT
[windows-jdk10-m3.5.x_build] The filename or extension is too long.
[windows-jdk10-m3.5.x_build] Picked up JAVA_TOOL_OPTIONS: -Dmaven.ext.class.path="f:\jenkins\jenkins-slave\workspace\ven-archetype_ARCHETYPE-553-J4FOCNZGBVSFDFI4P3DBC7GXGJK62NFN5QH7Q5I46GZ5AP3FIVLQ@2@tmp\withMaven56685d13\pipeline-maven-spy.jar" -Dorg.jenkinsci.plugins.pipeline.maven.reportsFolder="f:\jenkins\jenkins-slave\workspace\ven-archetype_ARCHETYPE-553-J4FOCNZGBVSFDFI4P3DBC7GXGJK62NFN5QH7Q5I46GZ5AP3FIVLQ@2@tmp\withMaven56685d13" 
[windows-jdk10-m3.5.x_build] [INFO] [jenkins-event-spy] Jenkins Maven Event Spy is disabled
[windows-jdk10-m3.5.x_build] [INFO] Scanning for projects...
[windows-jdk10-m3.5.x_build] [INFO] 
[windows-jdk10-m3.5.x_build] [INFO] ------------------------------------------------------------------------
[windows-jdk10-m3.5.x_build] [INFO] Building proficio 1.0-SNAPSHOT
[windows-jdk10-m3.5.x_build] [INFO] ------------------------------------------------------------------------
[windows-jdk10-m3.5.x_build] [INFO] 
[windows-jdk10-m3.5.x_build] [INFO] --- maven-resources-plugin:3.1.0:resources (default-resources) @ proficio ---
[windows-jdk10-m3.5.x_build] [WARNING] Using platform encoding (Cp1252 actually) to copy filtered resources, i.e. build is platform dependent!
[windows-jdk10-m3.5.x_build] [INFO] Copying 30 resources
[windows-jdk10-m3.5.x_build] [INFO] 
[windows-jdk10-m3.5.x_build] [INFO] --- maven-resources-plugin:3.1.0:testResources (default-testResources) @ proficio ---
[windows-jdk10-m3.5.x_build] [WARNING] Using platform encoding (Cp1252 actually) to copy filtered resources, i.e. build is platform dependent!
[windows-jdk10-m3.5.x_build] [INFO] Copying 2 resources
[windows-jdk10-m3.5.x_build] [INFO] 
[windows-jdk10-m3.5.x_build] [INFO] --- maven-archetype-plugin:3.0.2-SNAPSHOT:jar (default-jar) @ proficio ---
[windows-jdk10-m3.5.x_build] [INFO] Building archetype jar: F:\jenkins\jenkins-slave\workspace\ven-archetype_ARCHETYPE-553-J4FOCNZGBVSFDFI4P3DBC7GXGJK62NFN5QH7Q5I46GZ5AP3FIVLQ@2\windows-jdk10-m3.5.x_build\archetype-testing\archetype-final\target\test-classes\projects\roundtrip-multi\target\generated-sources\archetype\target\proficio-1.0-SNAPSHOT
[windows-jdk10-m3.5.x_build] [INFO] ------------------------------------------------------------------------
[windows-jdk10-m3.5.x_build] [INFO] BUILD SUCCESS
[windows-jdk10-m3.5.x_build] [INFO] ------------------------------------------------------------------------
[windows-jdk10-m3.5.x_build] [INFO] Total time: 1.686 s
[windows-jdk10-m3.5.x_build] [INFO] Finished at: 2018-09-10T05:51:47Z
[windows-jdk10-m3.5.x_build] [INFO] Final Memory: 13M/50M
[windows-jdk10-m3.5.x_build] [INFO] ------------------------------------------------------------------------
[windows-jdk10-m3.5.x_build] F:\jenkins\jenkins-slave\workspace\ven-archetype_ARCHETYPE-553-J4FOCNZGBVSFDFI4P3DBC7GXGJK62NFN5QH7Q5I46GZ5AP3FIVLQ@2\windows-jdk10-m3.5.x_build\archetype-testing\archetype-final\target\test-classes\projects\roundtrip-multi\target\generated-sources\archetype\pom.xml
[windows-jdk10-m3.5.x_build] F:\jenkins\jenkins-slave\workspace\ven-archetype_ARCHETYPE-553-J4FOCNZGBVSFDFI4P3DBC7GXGJK62NFN5QH7Q5I46GZ5AP3FIVLQ@2\windows-jdk10-m3.5.x_build\archetype-testing\archetype-final\target\test-classes\projects\roundtrip-multi\target\generated-sources\archetype\src\main\resources\archetype-resources\.checkstyle
[windows-jdk10-m3.5.x_build] F:\jenkins\jenkins-slave\workspace\ven-archetype_ARCHETYPE-553-J4FOCNZGBVSFDFI4P3DBC7GXGJK62NFN5QH7Q5I46GZ5AP3FIVLQ@2\windows-jdk10-m3.5.x_build\archetype-testing\archetype-final\target\test-classes\projects\roundtrip-multi\target\generated-sources\archetype\src\main\resources\archetype-resources\.classpath
[windows-jdk10-m3.5.x_build] F:\jenkins\jenkins-slave\workspace\ven-archetype_ARCHETYPE-553-J4FOCNZGBVSFDFI4P3DBC7GXGJK62NFN5QH7Q5I46GZ5AP3FIVLQ@2\windows-jdk10-m3.5.x_build\archetype-testing\archetype-final\target\test-classes\projects\roundtrip-multi\target\generated-sources\archetype\src\main\resources\archetype-resources\pom.xml
[windows-jdk10-m3.5.x_build] F:\jenkins\jenkins-slave\workspace\ven-archetype_ARCHETYPE-553-J4FOCNZGBVSFDFI4P3DBC7GXGJK62NFN5QH7Q5I46GZ5AP3FIVLQ@2\windows-jdk10-m3.5.x_build\archetype-testing\archetype-final\target\test-classes\projects\roundtrip-multi\target\generated-sources\archetype\src\main\resources\archetype-resources\src\site\site.xml
[windows-jdk10-m3.5.x_build] F:\jenkins\jenkins-slave\workspace\ven-archetype_ARCHETYPE-553-J4FOCNZGBVSFDFI4P3DBC7GXGJK62NFN5QH7Q5I46GZ5AP3FIVLQ@2\windows-jdk10-m3.5.x_build\archetype-testing\archetype-final\target\test-classes\projects\roundtrip-multi\target\generated-sources\archetype\src\main\resources\archetype-resources\__rootArtifactId__-api\.checkstyle
[windows-jdk10-m3.5.x_build] F:\jenkins\jenkins-slave\workspace\ven-archetype_ARCHETYPE-553-J4FOCNZGBVSFDFI4P3DBC7GXGJK62NFN5QH7Q5I46GZ5AP3FIVLQ@2\windows-jdk10-m3.5.x_build\archetype-testing\archetype-final\target\test-classes\projects\roundtrip-multi\target\generated-sources\archetype\src\main\resources\archetype-resources\__rootArtifactId__-api\.classpath
[windows-jdk10-m3.5.x_build] F:\jenkins\jenkins-slave\workspace\ven-archetype_ARCHETYPE-553-J4FOCNZGBVSFDFI4P3DBC7GXGJK62NFN5QH7Q5I46GZ5AP3FIVLQ@2\windows-jdk10-m3.5.x_build\archetype-testing\archetype-final\target\test-classes\projects\roundtrip-multi\target\generated-sources\archetype\src\main\resources\archetype-resources\__rootArtifactId__-api\pom.xml
[windows-jdk10-m3.5.x_build] F:\jenkins\jenkins-slave\workspace\ven-archetype_ARCHETYPE-553-J4FOCNZGBVSFDFI4P3DBC7GXGJK62NFN5QH7Q5I46GZ5AP3FIVLQ@2\windows-jdk10-m3.5.x_build\archetype-testing\archetype-final\target\test-classes\projects\roundtrip-multi\target\generated-sources\archetype\src\main\resources\archetype-resources\__rootArtifactId__-api\src\main\java\api\Api.java
[windows-jdk10-m3.5.x_build] F:\jenkins\jenkins-slave\workspace\ven-archetype_ARCHETYPE-553-J4FOCNZGBVSFDFI4P3DBC7GXGJK62NFN5QH7Q5I46GZ5AP3FIVLQ@2\windows-jdk10-m3.5.x_build\archetype-testing\archetype-final\target\test-classes\projects\roundtrip-multi\target\generated-sources\archetype\src\main\resources\archetype-resources\__rootArtifactId__-cli\.checkstyle
[windows-jdk10-m3.5.x_build] F:\jenkins\jenkins-slave\workspace\ven-archetype_ARCHETYPE-553-J4FOCNZGBVSFDFI4P3DBC7GXGJK62NFN5QH7Q5I46GZ5AP3FIVLQ@2\windows-jdk10-m3.5.x_build\archetype-testing\archetype-final\target\test-classes\projects\roundtrip-multi\target\generated-sources\archetype\src\main\resources\archetype-resources\__rootArtifactId__-cli\.classpath
[windows-jdk10-m3.5.x_build] F:\jenkins\jenkins-slave\workspace\ven-archetype_ARCHETYPE-553-J4FOCNZGBVSFDFI4P3DBC7GXGJK62NFN5QH7Q5I46GZ5AP3FIVLQ@2\windows-jdk10-m3.5.x_build\archetype-testing\archetype-final\target\test-classes\projects\roundtrip-multi\target\generated-sources\archetype\src\main\resources\archetype-resources\__rootArtifactId__-cli\pom.xml
[windows-jdk10-m3.5.x_build] F:\jenkins\jenkins-slave\workspace\ven-archetype_ARCHETYPE-553-J4FOCNZGBVSFDFI4P3DBC7GXGJK62NFN5QH7Q5I46GZ5AP3FIVLQ@2\windows-jdk10-m3.5.x_build\archetype-testing\archetype-final\target\test-classes\projects\roundtrip-multi\target\generated-sources\archetype\src\main\resources\archetype-resources\__rootArtifactId__-cli\src\main\java\cli\Cli.java
[windows-jdk10-m3.5.x_build] F:\jenkins\jenkins-slave\workspace\ven-archetype_ARCHETYPE-553-J4FOCNZGBVSFDFI4P3DBC7GXGJK62NFN5QH7Q5I46GZ5AP3FIVLQ@2\windows-jdk10-m3.5.x_build\archetype-testing\archetype-final\target\test-classes\projects\roundtrip-multi\target\generated-sources\archetype\src\main\resources\archetype-resources\__rootArtifactId__-core\.checkstyle
[windows-jdk10-m3.5.x_build] F:\jenkins\jenkins-slave\workspace\ven-archetype_ARCHETYPE-553-J4FOCNZGBVSFDFI4P3DBC7GXGJK62NFN5QH7Q5I46GZ5AP3FIVLQ@2\windows-jdk10-m3.5.x_build\archetype-testing\archetype-final\target\test-classes\projects\roundtrip-multi\target\generated-sources\archetype\src\main\resources\archetype-resources\__rootArtifactId__-core\.classpath
[windows-jdk10-m3.5.x_build] F:\jenkins\jenkins-slave\workspace\ven-archetype_ARCHETYPE-553-J4FOCNZGBVSFDFI4P3DBC7GXGJK62NFN5QH7Q5I46GZ5AP3FIVLQ@2\windows-jdk10-m3.5.x_build\archetype-testing\archetype-final\target\test-classes\projects\roundtrip-multi\target\generated-sources\archetype\src\main\resources\archetype-resources\__rootArtifactId__-core\pom.xml
[windows-jdk10-m3.5.x_build] F:\jenkins\jenkins-slave\workspace\ven-archetype_ARCHETYPE-553-J4FOCNZGBVSFDFI4P3DBC7GXGJK62NFN5QH7Q5I46GZ5AP3FIVLQ@2\windows-jdk10-m3.5.x_build\archetype-testing\archetype-final\target\test-classes\projects\roundtrip-multi\target\generated-sources\archetype\src\main\resources\archetype-resources\__rootArtifactId__-core\src\main\java\core\Core.java
[windows-jdk10-m3.5.x_build] F:\jenkins\jenkins-slave\workspace\ven-archetype_ARCHETYPE-553-J4FOCNZGBVSFDFI4P3DBC7GXGJK62NFN5QH7Q5I46GZ5AP3FIVLQ@2\windows-jdk10-m3.5.x_build\archetype-testing\archetype-final\target\test-classes\projects\roundtrip-multi\target\generated-sources\archetype\src\main\resources\archetype-resources\__rootArtifactId__-model\.checkstyle
[windows-jdk10-m3.5.x_build] F:\jenkins\jenkins-slave\workspace\ven-archetype_ARCHETYPE-553-J4FOCNZGBVSFDFI4P3DBC7GXGJK62NFN5QH7Q5I46GZ5AP3FIVLQ@2\windows-jdk10-m3.5.x_build\archetype-testing\archetype-final\target\test-classes\projects\roundtrip-multi\target\generated-sources\archetype\src\main\resources\archetype-resources\__rootArtifactId__-model\.classpath
[windows-jdk10-m3.5.x_build] F:\jenkins\jenkins-slave\workspace\ven-archetype_ARCHETYPE-553-J4FOCNZGBVSFDFI4P3DBC7GXGJK62NFN5QH7Q5I46GZ5AP3FIVLQ@2\windows-jdk10-m3.5.x_build\archetype-testing\archetype-final\target\test-classes\projects\roundtrip-multi\target\generated-sources\archetype\src\main\resources\archetype-resources\__rootArtifactId__-model\pom.xml
[windows-jdk10-m3.5.x_build] F:\jenkins\jenkins-slave\workspace\ven-archetype_ARCHETYPE-553-J4FOCNZGBVSFDFI4P3DBC7GXGJK62NFN5QH7Q5I46GZ5AP3FIVLQ@2\windows-jdk10-m3.5.x_build\archetype-testing\archetype-final\target\test-classes\projects\roundtrip-multi\target\generated-sources\archetype\src\main\resources\archetype-resources\__rootArtifactId__-model\src\main\java\org\company\__parentArtifactId__\model\Model.java
[windows-jdk10-m3.5.x_build] F:\jenkins\jenkins-slave\workspace\ven-archetype_ARCHETYPE-553-J4FOCNZGBVSFDFI4P3DBC7GXGJK62NFN5QH7Q5I46GZ5AP3FIVLQ@2\windows-jdk10-m3.5.x_build\archetype-testing\archetype-final\target\test-classes\projects\roundtrip-multi\target\generated-sources\archetype\src\main\resources\archetype-resources\__rootArtifactId__-stores\pom.xml
[windows-jdk10-m3.5.x_build] F:\jenkins\jenkins-slave\workspace\ven-archetype_ARCHETYPE-553-J4FOCNZGBVSFDFI4P3DBC7GXGJK62NFN5QH7Q5I46GZ5AP3FIVLQ@2\windows-jdk10-m3.5.x_build\archetype-testing\archetype-final\target\test-classes\projects\roundtrip-multi\target\generated-sources\archetype\src\main\resources\archetype-resources\__rootArtifactId__-stores\__rootArtifactId__-store-memory\.checkstyle
[windows-jdk10-m3.5.x_build] F:\jenkins\jenkins-slave\workspace\ven-archetype_ARCHETYPE-553-J4FOCNZGBVSFDFI4P3DBC7GXGJK62NFN5QH7Q5I46GZ5AP3FIVLQ@2\windows-jdk10-m3.5.x_build\archetype-testing\archetype-final\target\test-classes\projects\roundtrip-multi\target\generated-sources\archetype\src\main\resources\archetype-resources\__rootArtifactId__-stores\__rootArtifactId__-store-memory\.classpath
[windows-jdk10-m3.5.x_build] F:\jenkins\jenkins-slave\workspace\ven-archetype_ARCHETYPE-553-J4FOCNZGBVSFDFI4P3DBC7GXGJK62NFN5QH7Q5I46GZ5AP3FIVLQ@2\windows-jdk10-m3.5.x_build\archetype-testing\archetype-final\target\test-classes\projects\roundtrip-multi\target\generated-sources\archetype\src\main\resources\archetype-resources\__rootArtifactId__-stores\__rootArtifactId__-store-memory\pom.xml
[windows-jdk10-m3.5.x_build] F:\jenkins\jenkins-slave\workspace\ven-archetype_ARCHETYPE-553-J4FOCNZGBVSFDFI4P3DBC7GXGJK62NFN5QH7Q5I46GZ5AP3FIVLQ@2\windows-jdk10-m3.5.x_build\archetype-testing\archetype-final\target\test-classes\projects\roundtrip-multi\target\generated-sources\archetype\src\main\resources\archetype-resources\__rootArtifactId__-stores\__rootArtifactId__-store-memory\src\main\java\store\memory\Memory.java
[windows-jdk10-m3.5.x_build] F:\jenkins\jenkins-slave\workspace\ven-archetype_ARCHETYPE-553-J4FOCNZGBVSFDFI4P3DBC7GXGJK62NFN5QH7Q5I46GZ5AP3FIVLQ@2\windows-jdk10-m3.5.x_build\archetype-testing\archetype-final\target\test-classes\projects\roundtrip-multi\target\generated-sources\archetype\src\main\resources\archetype-resources\__rootArtifactId__-stores\__rootArtifactId__-store-xstream\.checkstyle
[windows-jdk10-m3.5.x_build] F:\jenkins\jenkins-slave\workspace\ven-archetype_ARCHETYPE-553-J4FOCNZGBVSFDFI4P3DBC7GXGJK62NFN5QH7Q5I46GZ5AP3FIVLQ@2\windows-jdk10-m3.5.x_build\archetype-testing\archetype-final\target\test-classes\projects\roundtrip-multi\target\generated-sources\archetype\src\main\resources\archetype-resources\__rootArtifactId__-stores\__rootArtifactId__-store-xstream\.classpath
[windows-jdk10-m3.5.x_build] F:\jenkins\jenkins-slave\workspace\ven-archetype_ARCHETYPE-553-J4FOCNZGBVSFDFI4P3DBC7GXGJK62NFN5QH7Q5I46GZ5AP3FIVLQ@2\windows-jdk10-m3.5.x_build\archetype-testing\archetype-final\target\test-classes\projects\roundtrip-multi\target\generated-sources\archetype\src\main\resources\archetype-resources\__rootArtifactId__-stores\__rootArtifactId__-store-xstream\pom.xml
[windows-jdk10-m3.5.x_build] F:\jenkins\jenkins-slave\workspace\ven-archetype_ARCHETYPE-553-J4FOCNZGBVSFDFI4P3DBC7GXGJK62NFN5QH7Q5I46GZ5AP3FIVLQ@2\windows-jdk10-m3.5.x_build\archetype-testing\archetype-final\target\test-classes\projects\roundtrip-multi\target\generated-sources\archetype\src\main\resources\archetype-resources\__rootArtifactId__-stores\__rootArtifactId__-store-xstream\src\main\java\store\xstream\XStream.java
[windows-jdk10-m3.5.x_build] F:\jenkins\jenkins-slave\workspace\ven-archetype_ARCHETYPE-553-J4FOCNZGBVSFDFI4P3DBC7GXGJK62NFN5QH7Q5I46GZ5AP3FIVLQ@2\windows-jdk10-m3.5.x_build\archetype-testing\archetype-final\target\test-classes\projects\roundtrip-multi\target\generated-sources\archetype\src\main\resources\META-INF\maven\archetype-metadata.xml
[windows-jdk10-m3.5.x_build] F:\jenkins\jenkins-slave\workspace\ven-archetype_ARCHETYPE-553-J4FOCNZGBVSFDFI4P3DBC7GXGJK62NFN5QH7Q5I46GZ5AP3FIVLQ@2\windows-jdk10-m3.5.x_build\archetype-testing\archetype-final\target\test-classes\projects\roundtrip-multi\target\generated-sources\archetype\src\test\resources\projects\basic\archetype.properties
[windows-jdk10-m3.5.x_build] F:\jenkins\jenkins-slave\workspace\ven-archetype_ARCHETYPE-553-J4FOCNZGBVSFDFI4P3DBC7GXGJK62NFN5QH7Q5I46GZ5AP3FIVLQ@2\windows-jdk10-m3.5.x_build\archetype-testing\archetype-final\target\test-classes\projects\roundtrip-multi\target\generated-sources\archetype\src\test\resources\projects\basic\goal.txt
[windows-jdk10-m3.5.x_build] F:\jenkins\jenkins-slave\workspace\ven-archetype_ARCHETYPE-553-J4FOCNZGBVSFDFI4P3DBC7GXGJK62NFN5QH7Q5I46GZ5AP3FIVLQ@2\windows-jdk10-m3.5.x_build\archetype-testing\archetype-final\target\test-classes\projects\roundtrip-multi\target\generated-sources\archetype\target\classes\archetype-resources\.checkstyle
[windows-jdk10-m3.5.x_build] F:\jenkins\jenkins-slave\workspace\ven-archetype_ARCHETYPE-553-J4FOCNZGBVSFDFI4P3DBC7GXGJK62NFN5QH7Q5I46GZ5AP3FIVLQ@2\windows-jdk10-m3.5.x_build\archetype-testing\archetype-final\target\test-classes\projects\roundtrip-multi\target\generated-sources\archetype\target\classes\archetype-resources\.classpath
[windows-jdk10-m3.5.x_build] F:\jenkins\jenkins-slave\workspace\ven-archetype_ARCHETYPE-553-J4FOCNZGBVSFDFI4P3DBC7GXGJK62NFN5QH7Q5I46GZ5AP3FIVLQ@2\windows-jdk10-m3.5.x_build\archetype-testing\archetype-final\target\test-classes\projects\roundtrip-multi\target\generated-sources\archetype\target\classes\archetype-resources\pom.xml
[windows-jdk10-m3.5.x_build] F:\jenkins\jenkins-slave\workspace\ven-archetype_ARCHETYPE-553-J4FOCNZGBVSFDFI4P3DBC7GXGJK62NFN5QH7Q5I46GZ5AP3FIVLQ@2\windows-jdk10-m3.5.x_build\archetype-testing\archetype-final\target\test-classes\projects\roundtrip-multi\target\generated-sources\archetype\target\classes\archetype-resources\src\site\site.xml
[windows-jdk10-m3.5.x_build] F:\jenkins\jenkins-slave\workspace\ven-archetype_ARCHETYPE-553-J4FOCNZGBVSFDFI4P3DBC7GXGJK62NFN5QH7Q5I46GZ5AP3FIVLQ@2\windows-jdk10-m3.5.x_build\archetype-testing\archetype-final\target\test-classes\projects\roundtrip-multi\target\generated-sources\archetype\target\classes\archetype-resources\__rootArtifactId__-api\.checkstyle
[windows-jdk10-m3.5.x_build] F:\jenkins\jenkins-slave\workspace\ven-archetype_ARCHETYPE-553-J4FOCNZGBVSFDFI4P3DBC7GXGJK62NFN5QH7Q5I46GZ5AP3FIVLQ@2\windows-jdk10-m3.5.x_build\archetype-testing\archetype-final\target\test-classes\projects\roundtrip-multi\target\generated-sources\archetype\target\classes\archetype-resources\__rootArtifactId__-api\.classpath
[windows-jdk10-m3.5.x_build] F:\jenkins\jenkins-slave\workspace\ven-archetype_ARCHETYPE-553-J4FOCNZGBVSFDFI4P3DBC7GXGJK62NFN5QH7Q5I46GZ5AP3FIVLQ@2\windows-jdk10-m3.5.x_build\archetype-testing\archetype-final\target\test-classes\projects\roundtrip-multi\target\generated-sources\archetype\target\classes\archetype-resources\__rootArtifactId__-api\pom.xml
[windows-jdk10-m3.5.x_build] F:\jenkins\jenkins-slave\workspace\ven-archetype_ARCHETYPE-553-J4FOCNZGBVSFDFI4P3DBC7GXGJK62NFN5QH7Q5I46GZ5AP3FIVLQ@2\windows-jdk10-m3.5.x_build\archetype-testing\archetype-final\target\test-classes\projects\roundtrip-multi\target\generated-sources\archetype\target\classes\archetype-resources\__rootArtifactId__-api\src\main\java\api\Api.java
[windows-jdk10-m3.5.x_build] F:\jenkins\jenkins-slave\workspace\ven-archetype_ARCHETYPE-553-J4FOCNZGBVSFDFI4P3DBC7GXGJK62NFN5QH7Q5I46GZ5AP3FIVLQ@2\windows-jdk10-m3.5.x_build\archetype-testing\archetype-final\target\test-classes\projects\roundtrip-multi\target\generated-sources\archetype\target\classes\archetype-resources\__rootArtifactId__-cli\.checkstyle
[windows-jdk10-m3.5.x_build] F:\jenkins\jenkins-slave\workspace\ven-archetype_ARCHETYPE-553-J4FOCNZGBVSFDFI4P3DBC7GXGJK62NFN5QH7Q5I46GZ5AP3FIVLQ@2\windows-jdk10-m3.5.x_build\archetype-testing\archetype-final\target\test-classes\projects\roundtrip-multi\target\generated-sources\archetype\target\classes\archetype-resources\__rootArtifactId__-cli\.classpath
[windows-jdk10-m3.5.x_build] F:\jenkins\jenkins-slave\workspace\ven-archetype_ARCHETYPE-553-J4FOCNZGBVSFDFI4P3DBC7GXGJK62NFN5QH7Q5I46GZ5AP3FIVLQ@2\windows-jdk10-m3.5.x_build\archetype-testing\archetype-final\target\test-classes\projects\roundtrip-multi\target\generated-sources\archetype\target\classes\archetype-resources\__rootArtifactId__-cli\pom.xml
[windows-jdk10-m3.5.x_build] F:\jenkins\jenkins-slave\workspace\ven-archetype_ARCHETYPE-553-J4FOCNZGBVSFDFI4P3DBC7GXGJK62NFN5QH7Q5I46GZ5AP3FIVLQ@2\windows-jdk10-m3.5.x_build\archetype-testing\archetype-final\target\test-classes\projects\roundtrip-multi\target\generated-sources\archetype\target\classes\archetype-resources\__rootArtifactId__-cli\src\main\java\cli\Cli.java
[windows-jdk10-m3.5.x_build] F:\jenkins\jenkins-slave\workspace\ven-archetype_ARCHETYPE-553-J4FOCNZGBVSFDFI4P3DBC7GXGJK62NFN5QH7Q5I46GZ5AP3FIVLQ@2\windows-jdk10-m3.5.x_build\archetype-testing\archetype-final\target\test-classes\projects\roundtrip-multi\target\generated-sources\archetype\target\classes\archetype-resources\__rootArtifactId__-core\.checkstyle
[windows-jdk10-m3.5.x_build] F:\jenkins\jenkins-slave\workspace\ven-archetype_ARCHETYPE-553-J4FOCNZGBVSFDFI4P3DBC7GXGJK62NFN5QH7Q5I46GZ5AP3FIVLQ@2\windows-jdk10-m3.5.x_build\archetype-testing\archetype-final\target\test-classes\projects\roundtrip-multi\target\generated-sources\archetype\target\classes\archetype-resources\__rootArtifactId__-core\.classpath
[windows-jdk10-m3.5.x_build] F:\jenkins\jenkins-slave\workspace\ven-archetype_ARCHETYPE-553-J4FOCNZGBVSFDFI4P3DBC7GXGJK62NFN5QH7Q5I46GZ5AP3FIVLQ@2\windows-jdk10-m3.5.x_build\archetype-testing\archetype-final\target\test-classes\projects\roundtrip-multi\target\generated-sources\archetype\target\classes\archetype-resources\__rootArtifactId__-core\pom.xml
[windows-jdk10-m3.5.x_build] F:\jenkins\jenkins-slave\workspace\ven-archetype_ARCHETYPE-553-J4FOCNZGBVSFDFI4P3DBC7GXGJK62NFN5QH7Q5I46GZ5AP3FIVLQ@2\windows-jdk10-m3.5.x_build\archetype-testing\archetype-final\target\test-classes\projects\roundtrip-multi\target\generated-sources\archetype\target\classes\archetype-resources\__rootArtifactId__-core\src\main\java\core\Core.java
[windows-jdk10-m3.5.x_build] F:\jenkins\jenkins-slave\workspace\ven-archetype_ARCHETYPE-553-J4FOCNZGBVSFDFI4P3DBC7GXGJK62NFN5QH7Q5I46GZ5AP3FIVLQ@2\windows-jdk10-m3.5.x_build\archetype-testing\archetype-final\target\test-classes\projects\roundtrip-multi\target\generated-sources\archetype\target\classes\archetype-resources\__rootArtifactId__-model\.checkstyle
[windows-jdk10-m3.5.x_build] F:\jenkins\jenkins-slave\workspace\ven-archetype_ARCHETYPE-553-J4FOCNZGBVSFDFI4P3DBC7GXGJK62NFN5QH7Q5I46GZ5AP3FIVLQ@2\windows-jdk10-m3.5.x_build\archetype-testing\archetype-final\target\test-classes\projects\roundtrip-multi\target\generated-sources\archetype\target\classes\archetype-resources\__rootArtifactId__-model\.classpath
[windows-jdk10-m3.5.x_build] F:\jenkins\jenkins-slave\workspace\ven-archetype_ARCHETYPE-553-J4FOCNZGBVSFDFI4P3DBC7GXGJK62NFN5QH7Q5I46GZ5AP3FIVLQ@2\windows-jdk10-m3.5.x_build\archetype-testing\archetype-final\target\test-classes\projects\roundtrip-multi\target\generated-sources\archetype\target\classes\archetype-resources\__rootArtifactId__-model\pom.xml
[windows-jdk10-m3.5.x_build] F:\jenkins\jenkins-slave\workspace\ven-archetype_ARCHETYPE-553-J4FOCNZGBVSFDFI4P3DBC7GXGJK62NFN5QH7Q5I46GZ5AP3FIVLQ@2\windows-jdk10-m3.5.x_build\archetype-testing\archetype-final\target\test-classes\projects\roundtrip-multi\target\generated-sources\archetype\target\classes\archetype-resources\__rootArtifactId__-model\src\main\java\org\company\__parentArtifactId__\model\Model.java
[windows-jdk10-m3.5.x_build] F:\jenkins\jenkins-slave\workspace\ven-archetype_ARCHETYPE-553-J4FOCNZGBVSFDFI4P3DBC7GXGJK62NFN5QH7Q5I46GZ5AP3FIVLQ@2\windows-jdk10-m3.5.x_build\archetype-testing\archetype-final\target\test-classes\projects\roundtrip-multi\target\generated-sources\archetype\target\classes\archetype-resources\__rootArtifactId__-stores\pom.xml
[windows-jdk10-m3.5.x_build] F:\jenkins\jenkins-slave\workspace\ven-archetype_ARCHETYPE-553-J4FOCNZGBVSFDFI4P3DBC7GXGJK62NFN5QH7Q5I46GZ5AP3FIVLQ@2\windows-jdk10-m3.5.x_build\archetype-testing\archetype-final\target\test-classes\projects\roundtrip-multi\target\generated-sources\archetype\target\classes\archetype-resources\__rootArtifactId__-stores\__rootArtifactId__-store-memory\.checkstyle
[windows-jdk10-m3.5.x_build] F:\jenkins\jenkins-slave\workspace\ven-archetype_ARCHETYPE-553-J4FOCNZGBVSFDFI4P3DBC7GXGJK62NFN5QH7Q5I46GZ5AP3FIVLQ@2\windows-jdk10-m3.5.x_build\archetype-testing\archetype-final\target\test-classes\projects\roundtrip-multi\target\generated-sources\archetype\target\classes\archetype-resources\__rootArtifactId__-stores\__rootArtifactId__-store-memory\.classpath
[windows-jdk10-m3.5.x_build] F:\jenkins\jenkins-slave\workspace\ven-archetype_ARCHETYPE-553-J4FOCNZGBVSFDFI4P3DBC7GXGJK62NFN5QH7Q5I46GZ5AP3FIVLQ@2\windows-jdk10-m3.5.x_build\archetype-testing\archetype-final\target\test-classes\projects\roundtrip-multi\target\generated-sources\archetype\target\classes\archetype-resources\__rootArtifactId__-stores\__rootArtifactId__-store-memory\pom.xml
[windows-jdk10-m3.5.x_build] F:\jenkins\jenkins-slave\workspace\ven-archetype_ARCHETYPE-553-J4FOCNZGBVSFDFI4P3DBC7GXGJK62NFN5QH7Q5I46GZ5AP3FIVLQ@2\windows-jdk10-m3.5.x_build\archetype-testing\archetype-final\target\test-classes\projects\roundtrip-multi\target\generated-sources\archetype\target\classes\archetype-resources\__rootArtifactId__-stores\__rootArtifactId__-store-memory\src\main\java\store\memory\Memory.java
[windows-jdk10-m3.5.x_build] F:\jenkins\jenkins-slave\workspace\ven-archetype_ARCHETYPE-553-J4FOCNZGBVSFDFI4P3DBC7GXGJK62NFN5QH7Q5I46GZ5AP3FIVLQ@2\windows-jdk10-m3.5.x_build\archetype-testing\archetype-final\target\test-classes\projects\roundtrip-multi\target\generated-sources\archetype\target\classes\archetype-resources\__rootArtifactId__-stores\__rootArtifactId__-store-xstream\.checkstyle
[windows-jdk10-m3.5.x_build] F:\jenkins\jenkins-slave\workspace\ven-archetype_ARCHETYPE-553-J4FOCNZGBVSFDFI4P3DBC7GXGJK62NFN5QH7Q5I46GZ5AP3FIVLQ@2\windows-jdk10-m3.5.x_build\archetype-testing\archetype-final\target\test-classes\projects\roundtrip-multi\target\generated-sources\archetype\target\classes\archetype-resources\__rootArtifactId__-stores\__rootArtifactId__-store-xstream\.classpath
[windows-jdk10-m3.5.x_build] F:\jenkins\jenkins-slave\workspace\ven-archetype_ARCHETYPE-553-J4FOCNZGBVSFDFI4P3DBC7GXGJK62NFN5QH7Q5I46GZ5AP3FIVLQ@2\windows-jdk10-m3.5.x_build\archetype-testing\archetype-final\target\test-classes\projects\roundtrip-multi\target\generated-sources\archetype\target\classes\archetype-resources\__rootArtifactId__-stores\__rootArtifactId__-store-xstream\pom.xml
[windows-jdk10-m3.5.x_build] F:\jenkins\jenkins-slave\workspace\ven-archetype_ARCHETYPE-553-J4FOCNZGBVSFDFI4P3DBC7GXGJK62NFN5QH7Q5I46GZ5AP3FIVLQ@2\windows-jdk10-m3.5.x_build\archetype-testing\archetype-final\target\test-classes\projects\roundtrip-multi\target\generated-sources\archetype\target\classes\archetype-resources\__rootArtifactId__-stores\__rootArtifactId__-store-xstream\src\main\java\store\xstream\XStream.java
[windows-jdk10-m3.5.x_build] F:\jenkins\jenkins-slave\workspace\ven-archetype_ARCHETYPE-553-J4FOCNZGBVSFDFI4P3DBC7GXGJK62NFN5QH7Q5I46GZ5AP3FIVLQ@2\windows-jdk10-m3.5.x_build\archetype-testing\archetype-final\target\test-classes\projects\roundtrip-multi\target\generated-sources\archetype\target\classes\META-INF\maven\archetype-metadata.xml
[windows-jdk10-m3.5.x_build] F:\jenkins\jenkins-slave\workspace\ven-archetype_ARCHETYPE-553-J4FOCNZGBVSFDFI4P3DBC7GXGJK62NFN5QH7Q5I46GZ5AP3FIVLQ@2\windows-jdk10-m3.5.x_build\archetype-testing\archetype-final\target\test-classes\projects\roundtrip-multi\target\generated-sources\archetype\target\proficio-1.0-SNAPSHOT.jar
[windows-jdk10-m3.5.x_build] F:\jenkins\jenkins-slave\workspace\ven-archetype_ARCHETYPE-553-J4FOCNZGBVSFDFI4P3DBC7GXGJK62NFN5QH7Q5I46GZ5AP3FIVLQ@2\windows-jdk10-m3.5.x_build\archetype-testing\archetype-final\target\test-classes\projects\roundtrip-multi\target\generated-sources\archetype\target\test-classes\projects\basic\archetype.properties
[windows-jdk10-m3.5.x_build] F:\jenkins\jenkins-slave\workspace\ven-archetype_ARCHETYPE-553-J4FOCNZGBVSFDFI4P3DBC7GXGJK62NFN5QH7Q5I46GZ5AP3FIVLQ@2\windows-jdk10-m3.5.x_build\archetype-testing\archetype-final\target\test-classes\projects\roundtrip-multi\target\generated-sources\archetype\target\test-classes\projects\basic\goal.txt
[windows-jdk10-m3.5.x_build] log4j:WARN No appenders could be found for logger (org.apache.http.client.protocol.RequestAddCookies).
[windows-jdk10-m3.5.x_build] log4j:WARN Please initialize the log4j system properly.
[windows-jdk10-m3.5.x_build] [INFO] ----------------------------------------------------------------------------
[windows-jdk10-m3.5.x_build] [INFO] Using following parameters for creating project from Archetype: proficio:1.0-SNAPSHOT
[windows-jdk10-m3.5.x_build] [INFO] ----------------------------------------------------------------------------
[windows-jdk10-m3.5.x_build] [INFO] Parameter: groupId, Value: com.mycompany
[windows-jdk10-m3.5.x_build] [INFO] Parameter: artifactId, Value: myapp
[windows-jdk10-m3.5.x_build] [INFO] Parameter: version, Value: 1.0-SNAPSHOT
[windows-jdk10-m3.5.x_build] [INFO] Parameter: package, Value: com.mycompany.myapp
[windows-jdk10-m3.5.x_build] [INFO] Parameter: packageInPathFormat, Value: com/mycompany/myapp
[windows-jdk10-m3.5.x_build] WARNING: An illegal reflective access operation has occurred
[windows-jdk10-m3.5.x_build] WARNING: Illegal reflective access by org.dom4j.io.SAXContentHandler (file:/f:/jenkins/jenkins-slave/workspace/ven-archetype_ARCHETYPE-553-J4FOCNZGBVSFDFI4P3DBC7GXGJK62NFN5QH7Q5I46GZ5AP3FIVLQ%402/.repository/dom4j/dom4j/1.6.1/dom4j-1.6.1.jar) to method com.sun.org.apache.xerces.internal.parsers.AbstractSAXParser$LocatorProxy.getEncoding()
[windows-jdk10-m3.5.x_build] WARNING: Please consider reporting this to the maintainers of org.dom4j.io.SAXContentHandler
[windows-jdk10-m3.5.x_build] WARNING: Use --illegal-access=warn to enable warnings of further illegal reflective access operations
[windows-jdk10-m3.5.x_build] WARNING: All illegal access operations will be denied in a future release
[windows-jdk10-m3.5.x_build] [INFO] Parent element not overwritten in F:\jenkins\jenkins-slave\workspace\ven-archetype_ARCHETYPE-553-J4FOCNZGBVSFDFI4P3DBC7GXGJK62NFN5QH7Q5I46GZ5AP3FIVLQ@2\windows-jdk10-m3.5.x_build\archetype-testing\archetype-final\target\test-classes\projects\roundtrip-multi-recreated\myapp\myapp-api\pom.xml
[windows-jdk10-m3.5.x_build] [INFO] Parent element not overwritten in F:\jenkins\jenkins-slave\workspace\ven-archetype_ARCHETYPE-553-J4FOCNZGBVSFDFI4P3DBC7GXGJK62NFN5QH7Q5I46GZ5AP3FIVLQ@2\windows-jdk10-m3.5.x_build\archetype-testing\archetype-final\target\test-classes\projects\roundtrip-multi-recreated\myapp\myapp-cli\pom.xml
[windows-jdk10-m3.5.x_build] [INFO] Parent element not overwritten in F:\jenkins\jenkins-slave\workspace\ven-archetype_ARCHETYPE-553-J4FOCNZGBVSFDFI4P3DBC7GXGJK62NFN5QH7Q5I46GZ5AP3FIVLQ@2\windows-jdk10-m3.5.x_build\archetype-testing\archetype-final\target\test-classes\projects\roundtrip-multi-recreated\myapp\myapp-core\pom.xml
[windows-jdk10-m3.5.x_build] [INFO] Parent element not overwritten in F:\jenkins\jenkins-slave\workspace\ven-archetype_ARCHETYPE-553-J4FOCNZGBVSFDFI4P3DBC7GXGJK62NFN5QH7Q5I46GZ5AP3FIVLQ@2\windows-jdk10-m3.5.x_build\archetype-testing\archetype-final\target\test-classes\projects\roundtrip-multi-recreated\myapp\myapp-model\pom.xml
[windows-jdk10-m3.5.x_build] [INFO] Parent element not overwritten in F:\jenkins\jenkins-slave\workspace\ven-archetype_ARCHETYPE-553-J4FOCNZGBVSFDFI4P3DBC7GXGJK62NFN5QH7Q5I46GZ5AP3FIVLQ@2\windows-jdk10-m3.5.x_build\archetype-testing\archetype-final\target\test-classes\projects\roundtrip-multi-recreated\myapp\myapp-stores\pom.xml
[windows-jdk10-m3.5.x_build] [INFO] Parent element not overwritten in F:\jenkins\jenkins-slave\workspace\ven-archetype_ARCHETYPE-553-J4FOCNZGBVSFDFI4P3DBC7GXGJK62NFN5QH7Q5I46GZ5AP3FIVLQ@2\windows-jdk10-m3.5.x_build\archetype-testing\archetype-final\target\test-classes\projects\roundtrip-multi-recreated\myapp\myapp-stores\myapp-store-memory\pom.xml
[windows-jdk10-m3.5.x_build] [INFO] Parent element not overwritten in F:\jenkins\jenkins-slave\workspace\ven-archetype_ARCHETYPE-553-J4FOCNZGBVSFDFI4P3DBC7GXGJK62NFN5QH7Q5I46GZ5AP3FIVLQ@2\windows-jdk10-m3.5.x_build\archetype-testing\archetype-final\target\test-classes\projects\roundtrip-multi-recreated\myapp\myapp-stores\myapp-store-xstream\pom.xml
[windows-jdk10-m3.5.x_build] [INFO] Project created from Archetype in dir: F:\jenkins\jenkins-slave\workspace\ven-archetype_ARCHETYPE-553-J4FOCNZGBVSFDFI4P3DBC7GXGJK62NFN5QH7Q5I46GZ5AP3FIVLQ@2\windows-jdk10-m3.5.x_build\archetype-testing\archetype-final\target\test-classes\projects\roundtrip-multi-recreated\myapp
[windows-jdk10-m3.5.x_build] Tests run: 1, Failures: 0, Errors: 0, Skipped: 0, Time elapsed: 5.489 sec - in org.apache.maven.archetype.test.RoundtripMultiModuleIT
[windows-jdk10-m3.5.x_build] 
[windows-jdk10-m3.5.x_build] Results :
[windows-jdk10-m3.5.x_build] 
[windows-jdk10-m3.5.x_build] Tests in error: 
[windows-jdk10-m3.5.x_build]   DefaultArchetypeCreatorIT.testChangeJavaFilenameWhenCustomPropertyEqualsClassName:151->createFilesetArchetype:136 � CommandLine
[windows-jdk10-m3.5.x_build]   DefaultArchetypeCreatorIT.testExcludePatternsContainingFilesSameExtension:177->createFilesetArchetype:136 � CommandLine
[windows-jdk10-m3.5.x_build]   DefaultArchetypeCreatorIT.testExcludePatternsMustExcludeDirectory:163->createFilesetArchetype:136 � CommandLine
[windows-jdk10-m3.5.x_build]   DefaultArchetypeCreatorIT.testIncludeFileWithNoExtension:189->createFilesetArchetype:136 � CommandLine
[windows-jdk10-m3.5.x_build]   DefaultArchetypeCreatorIT.testSystemPropertiesAreIncluded:200->createFilesetArchetype:136 � CommandLine
[windows-jdk10-m3.5.x_build]   ArchetyperRoundtripIT.testArchetyper:121 � CommandLine Error while executing p...
[windows-jdk10-m3.5.x_build]   ArchetyperRoundtripWithProxyIT.testArchetyper:126 � CommandLine Error while ex...
[windows-jdk10-m3.5.x_build] 
[windows-jdk10-m3.5.x_build] Tests run: 14, Failures: 0, Errors: 7, Skipped: 0
[windows-jdk10-m3.5.x_build] 
[windows-jdk10-m3.5.x_build] [INFO] 
[windows-jdk10-m3.5.x_build] [INFO] --- maven-checkstyle-plugin:3.0.0:check (checkstyle-check) @ archetype-final ---
[windows-jdk10-m3.5.x_build] [INFO] 
[windows-jdk10-m3.5.x_build] [INFO] --- maven-failsafe-plugin:2.19.1:verify (default) @ archetype-final ---
[windows-jdk10-m3.5.x_build] [ERROR] There are test failures.
[windows-jdk10-m3.5.x_build] 
[windows-jdk10-m3.5.x_build] Please refer to F:\jenkins\jenkins-slave\workspace\ven-archetype_ARCHETYPE-553-J4FOCNZGBVSFDFI4P3DBC7GXGJK62NFN5QH7Q5I46GZ5AP3FIVLQ@2\windows-jdk10-m3.5.x_build\archetype-testing\archetype-final\target\failsafe-reports for the individual test results.
[windows-jdk10-m3.5.x_build] [INFO] ------------------------------------------------------------------------
[windows-jdk10-m3.5.x_build] [INFO] Reactor Summary:
[windows-jdk10-m3.5.x_build] [INFO] 
[windows-jdk10-m3.5.x_build] [INFO] Maven Archetype .................................... SUCCESS [ 16.670 s]
[windows-jdk10-m3.5.x_build] [INFO] Maven Archetype Models ............................. SUCCESS [  0.678 s]
[windows-jdk10-m3.5.x_build] [INFO] Maven Archetype Catalog Model ...................... SUCCESS [  5.521 s]
[windows-jdk10-m3.5.x_build] [INFO] Maven Archetype Descriptor Model ................... SUCCESS [  1.165 s]
[windows-jdk10-m3.5.x_build] [INFO] Maven Archetype Testing ............................ SUCCESS [  0.665 s]
[windows-jdk10-m3.5.x_build] [INFO] Maven Archetype Webapp Repository .................. SUCCESS [  1.862 s]
[windows-jdk10-m3.5.x_build] [INFO] Maven Archetype Webapp Proxy ....................... SUCCESS [  0.889 s]
[windows-jdk10-m3.5.x_build] [INFO] Maven Archetype Common ............................. SUCCESS [ 22.404 s]
[windows-jdk10-m3.5.x_build] [INFO] Maven Archetype Packaging .......................... SUCCESS [  0.556 s]
[windows-jdk10-m3.5.x_build] [INFO] Maven Archetype Plugin ............................. SUCCESS [02:25 min]
[windows-jdk10-m3.5.x_build] [INFO] Maven Archetype Testing Final ...................... SUCCESS [ 45.669 s]
[windows-jdk10-m3.5.x_build] [INFO] ------------------------------------------------------------------------
[windows-jdk10-m3.5.x_build] [INFO] BUILD SUCCESS
[windows-jdk10-m3.5.x_build] [INFO] ------------------------------------------------------------------------
[windows-jdk10-m3.5.x_build] [INFO] Total time: 04:02 min
[windows-jdk10-m3.5.x_build] [INFO] Finished at: 2018-09-10T05:51:49Z
[windows-jdk10-m3.5.x_build] [INFO] Final Memory: 61M/214M
[windows-jdk10-m3.5.x_build] [INFO] ------------------------------------------------------------------------
[windows-jdk10-m3.5.x_build] [INFO] [jenkins-event-spy] Generated F:\jenkins\jenkins-slave\workspace\ven-archetype_ARCHETYPE-553-J4FOCNZGBVSFDFI4P3DBC7GXGJK62NFN5QH7Q5I46GZ5AP3FIVLQ@2@tmp\withMaven56685d13\maven-spy-20180910-054746-1855887639475994170364.log
[Pipeline] [windows-jdk10-m3.5.x_build] }
[Pipeline] [windows-jdk10-m3.5.x_build] // dir
[Pipeline] [windows-jdk10-m3.5.x_build] }
[windows-jdk10-m3.5.x_build] [withMaven] artifactsPublisher - Archive artifact windows-jdk10-m3.5.x_build\pom.xml under org\apache\maven\archetype\maven-archetype\3.0.2-SNAPSHOT\maven-archetype-3.0.2-SNAPSHOT.pom
[windows-jdk10-m3.5.x_build] [withMaven] artifactsPublisher - Archive artifact windows-jdk10-m3.5.x_build\target\maven-archetype-3.0.2-SNAPSHOT-site.xml under org\apache\maven\archetype\maven-archetype\3.0.2-SNAPSHOT\maven-archetype-3.0.2-SNAPSHOT-site.xml
[windows-jdk10-m3.5.x_build] [withMaven] artifactsPublisher - Archive artifact windows-jdk10-m3.5.x_build\archetype-models\pom.xml under org\apache\maven\archetype\archetype-models\3.0.2-SNAPSHOT\archetype-models-3.0.2-SNAPSHOT.pom
[windows-jdk10-m3.5.x_build] [withMaven] artifactsPublisher - Archive artifact windows-jdk10-m3.5.x_build\archetype-models\target\archetype-models-3.0.2-SNAPSHOT-site.xml under org\apache\maven\archetype\archetype-models\3.0.2-SNAPSHOT\archetype-models-3.0.2-SNAPSHOT-site.xml
[windows-jdk10-m3.5.x_build] [withMaven] artifactsPublisher - Archive artifact windows-jdk10-m3.5.x_build\archetype-models\archetype-catalog\pom.xml under org\apache\maven\archetype\archetype-catalog\3.0.2-SNAPSHOT\archetype-catalog-3.0.2-SNAPSHOT.pom
[windows-jdk10-m3.5.x_build] [withMaven] artifactsPublisher - Archive artifact windows-jdk10-m3.5.x_build\archetype-models\archetype-catalog\target\archetype-catalog-3.0.2-SNAPSHOT.jar under org\apache\maven\archetype\archetype-catalog\3.0.2-SNAPSHOT\archetype-catalog-3.0.2-SNAPSHOT.jar
[windows-jdk10-m3.5.x_build] [withMaven] artifactsPublisher - Archive artifact windows-jdk10-m3.5.x_build\archetype-models\archetype-descriptor\pom.xml under org\apache\maven\archetype\archetype-descriptor\3.0.2-SNAPSHOT\archetype-descriptor-3.0.2-SNAPSHOT.pom
[windows-jdk10-m3.5.x_build] [withMaven] artifactsPublisher - Archive artifact windows-jdk10-m3.5.x_build\archetype-models\archetype-descriptor\target\archetype-descriptor-3.0.2-SNAPSHOT.jar under org\apache\maven\archetype\archetype-descriptor\3.0.2-SNAPSHOT\archetype-descriptor-3.0.2-SNAPSHOT.jar
[windows-jdk10-m3.5.x_build] [withMaven] artifactsPublisher - Archive artifact windows-jdk10-m3.5.x_build\archetype-testing\pom.xml under org\apache\maven\archetype\archetype-testing\3.0.2-SNAPSHOT\archetype-testing-3.0.2-SNAPSHOT.pom
[windows-jdk10-m3.5.x_build] [withMaven] artifactsPublisher - Archive artifact windows-jdk10-m3.5.x_build\archetype-testing\target\archetype-testing-3.0.2-SNAPSHOT-site.xml under org\apache\maven\archetype\archetype-testing\3.0.2-SNAPSHOT\archetype-testing-3.0.2-SNAPSHOT-site.xml
[windows-jdk10-m3.5.x_build] [withMaven] artifactsPublisher - Archive artifact windows-jdk10-m3.5.x_build\archetype-testing\archetype-repository\pom.xml under org\apache\maven\archetype\archetype-repository\3.0.2-SNAPSHOT\archetype-repository-3.0.2-SNAPSHOT.pom
[windows-jdk10-m3.5.x_build] [withMaven] artifactsPublisher - Archive artifact windows-jdk10-m3.5.x_build\archetype-testing\archetype-repository\target\archetype-repository-3.0.2-SNAPSHOT.war under org\apache\maven\archetype\archetype-repository\3.0.2-SNAPSHOT\archetype-repository-3.0.2-SNAPSHOT.war
[windows-jdk10-m3.5.x_build] [withMaven] artifactsPublisher - Archive artifact windows-jdk10-m3.5.x_build\archetype-testing\archetype-proxy\pom.xml under org\apache\maven\archetype\archetype-proxy\3.0.2-SNAPSHOT\archetype-proxy-3.0.2-SNAPSHOT.pom
[windows-jdk10-m3.5.x_build] [withMaven] artifactsPublisher - Archive artifact windows-jdk10-m3.5.x_build\archetype-testing\archetype-proxy\target\archetype-proxy-3.0.2-SNAPSHOT.war under org\apache\maven\archetype\archetype-proxy\3.0.2-SNAPSHOT\archetype-proxy-3.0.2-SNAPSHOT.war
[windows-jdk10-m3.5.x_build] [withMaven] artifactsPublisher - Archive artifact windows-jdk10-m3.5.x_build\archetype-common\pom.xml under org\apache\maven\archetype\archetype-common\3.0.2-SNAPSHOT\archetype-common-3.0.2-SNAPSHOT.pom
[windows-jdk10-m3.5.x_build] [withMaven] artifactsPublisher - Archive artifact windows-jdk10-m3.5.x_build\archetype-common\target\archetype-common-3.0.2-SNAPSHOT.jar under org\apache\maven\archetype\archetype-common\3.0.2-SNAPSHOT\archetype-common-3.0.2-SNAPSHOT.jar
[windows-jdk10-m3.5.x_build] [withMaven] artifactsPublisher - Archive artifact windows-jdk10-m3.5.x_build\archetype-packaging\pom.xml under org\apache\maven\archetype\archetype-packaging\3.0.2-SNAPSHOT\archetype-packaging-3.0.2-SNAPSHOT.pom
[windows-jdk10-m3.5.x_build] [withMaven] artifactsPublisher - Archive artifact windows-jdk10-m3.5.x_build\archetype-packaging\target\archetype-packaging-3.0.2-SNAPSHOT.jar under org\apache\maven\archetype\archetype-packaging\3.0.2-SNAPSHOT\archetype-packaging-3.0.2-SNAPSHOT.jar
[windows-jdk10-m3.5.x_build] [withMaven] artifactsPublisher - Archive artifact windows-jdk10-m3.5.x_build\maven-archetype-plugin\pom.xml under org\apache\maven\plugins\maven-archetype-plugin\3.0.2-SNAPSHOT\maven-archetype-plugin-3.0.2-SNAPSHOT.pom
[windows-jdk10-m3.5.x_build] [withMaven] artifactsPublisher - Archive artifact windows-jdk10-m3.5.x_build\maven-archetype-plugin\target\maven-archetype-plugin-3.0.2-SNAPSHOT.jar under org\apache\maven\plugins\maven-archetype-plugin\3.0.2-SNAPSHOT\maven-archetype-plugin-3.0.2-SNAPSHOT.jar
[windows-jdk10-m3.5.x_build] [withMaven] artifactsPublisher - Archive artifact windows-jdk10-m3.5.x_build\archetype-testing\archetype-final\pom.xml under org\apache\maven\archetype\archetype-final\3.0.2-SNAPSHOT\archetype-final-3.0.2-SNAPSHOT.pom
[windows-jdk10-m3.5.x_build] [withMaven] artifactsPublisher - Archive artifact windows-jdk10-m3.5.x_build\archetype-testing\archetype-final\target\archetype-final-3.0.2-SNAPSHOT.jar under org\apache\maven\archetype\archetype-final\3.0.2-SNAPSHOT\archetype-final-3.0.2-SNAPSHOT.jar
[windows-jdk10-m3.5.x_build] [Fast Archiver] Compressed 873.77 KB of artifacts by 43.9% relative to #15
[windows-jdk10-m3.5.x_build] [withMaven] invokerPublisher - Archive invoker results for Maven artifact MavenArtifact{org.apache.maven.plugins:maven-archetype-plugin::3.0.2-SNAPSHOT(version: 3.0.2-SNAPSHOT, snapshot:false) } generated by PluginInvocation{org.apache.maven.plugins:maven-invoker-plugin:3.1.0@run  integration-test}: windows-jdk10-m3.5.x_build\maven-archetype-plugin\target\invoker-reports\*.xml
[windows-jdk10-m3.5.x_build] performing MavenInvokerRecorder, reportsFilenamePattern:'**/windows-jdk10-m3.5.x_build\maven-archetype-plugin\target\invoker-reports/BUILD*.xml', invokerBuildDir:'**/windows-jdk10-m3.5.x_build\maven-archetype-plugin\target\it\projects'
[windows-jdk10-m3.5.x_build] Found reports:[f:\jenkins\jenkins-slave\workspace\ven-archetype_ARCHETYPE-553-J4FOCNZGBVSFDFI4P3DBC7GXGJK62NFN5QH7Q5I46GZ5AP3FIVLQ@2\windows-jdk10-m3.5.x_build\maven-archetype-plugin\target\invoker-reports\BUILD-ARCHETYPE-241_filter-directory.xml, f:\jenkins\jenkins-slave\workspace\ven-archetype_ARCHETYPE-553-J4FOCNZGBVSFDFI4P3DBC7GXGJK62NFN5QH7Q5I46GZ5AP3FIVLQ@2\windows-jdk10-m3.5.x_build\maven-archetype-plugin\target\invoker-reports\BUILD-ARCHETYPE-517_failing-goals.xml, f:\jenkins\jenkins-slave\workspace\ven-archetype_ARCHETYPE-553-J4FOCNZGBVSFDFI4P3DBC7GXGJK62NFN5QH7Q5I46GZ5AP3FIVLQ@2\windows-jdk10-m3.5.x_build\maven-archetype-plugin\target\invoker-reports\BUILD-ARCHETYPE-520_mirror.xml, f:\jenkins\jenkins-slave\workspace\ven-archetype_ARCHETYPE-553-J4FOCNZGBVSFDFI4P3DBC7GXGJK62NFN5QH7Q5I46GZ5AP3FIVLQ@2\windows-jdk10-m3.5.x_build\maven-archetype-plugin\target\invoker-reports\BUILD-ARCHETYPE-521_archetype-repo.xml, f:\jenkins\jenkins-slave\workspace\ven-archetype_ARCHETYPE-553-J4FOCNZGBVSFDFI4P3DBC7GXGJK62NFN5QH7Q5I46GZ5AP3FIVLQ@2\windows-jdk10-m3.5.x_build\maven-archetype-plugin\target\invoker-reports\BUILD-build-archetype-and-run-its-with-existing-parent.xml, f:\jenkins\jenkins-slave\workspace\ven-archetype_ARCHETYPE-553-J4FOCNZGBVSFDFI4P3DBC7GXGJK62NFN5QH7Q5I46GZ5AP3FIVLQ@2\windows-jdk10-m3.5.x_build\maven-archetype-plugin\target\invoker-reports\BUILD-build-archetype-ignore-eol-encoding.xml, f:\jenkins\jenkins-slave\workspace\ven-archetype_ARCHETYPE-553-J4FOCNZGBVSFDFI4P3DBC7GXGJK62NFN5QH7Q5I46GZ5AP3FIVLQ@2\windows-jdk10-m3.5.x_build\maven-archetype-plugin\target\invoker-reports\BUILD-build-archetype.xml, f:\jenkins\jenkins-slave\workspace\ven-archetype_ARCHETYPE-553-J4FOCNZGBVSFDFI4P3DBC7GXGJK62NFN5QH7Q5I46GZ5AP3FIVLQ@2\windows-jdk10-m3.5.x_build\maven-archetype-plugin\target\invoker-reports\BUILD-create-from-project-exclude-patterns.xml, f:\jenkins\jenkins-slave\workspace\ven-archetype_ARCHETYPE-553-J4FOCNZGBVSFDFI4P3DBC7GXGJK62NFN5QH7Q5I46GZ5AP3FIVLQ@2\windows-jdk10-m3.5.x_build\maven-archetype-plugin\target\invoker-reports\BUILD-create-from-project.xml, f:\jenkins\jenkins-slave\workspace\ven-archetype_ARCHETYPE-553-J4FOCNZGBVSFDFI4P3DBC7GXGJK62NFN5QH7Q5I46GZ5AP3FIVLQ@2\windows-jdk10-m3.5.x_build\maven-archetype-plugin\target\invoker-reports\BUILD-generate-basic.xml, f:\jenkins\jenkins-slave\workspace\ven-archetype_ARCHETYPE-553-J4FOCNZGBVSFDFI4P3DBC7GXGJK62NFN5QH7Q5I46GZ5AP3FIVLQ@2\windows-jdk10-m3.5.x_build\maven-archetype-plugin\target\invoker-reports\BUILD-property-setting-cli.xml]
[windows-jdk10-m3.5.x_build] Found logs:[f:\jenkins\jenkins-slave\workspace\ven-archetype_ARCHETYPE-553-J4FOCNZGBVSFDFI4P3DBC7GXGJK62NFN5QH7Q5I46GZ5AP3FIVLQ@2\windows-jdk10-m3.5.x_build\maven-archetype-plugin\target\it\projects\ARCHETYPE-241_filter-directory\build.log, f:\jenkins\jenkins-slave\workspace\ven-archetype_ARCHETYPE-553-J4FOCNZGBVSFDFI4P3DBC7GXGJK62NFN5QH7Q5I46GZ5AP3FIVLQ@2\windows-jdk10-m3.5.x_build\maven-archetype-plugin\target\it\projects\ARCHETYPE-517_failing-goals\build.log, f:\jenkins\jenkins-slave\workspace\ven-archetype_ARCHETYPE-553-J4FOCNZGBVSFDFI4P3DBC7GXGJK62NFN5QH7Q5I46GZ5AP3FIVLQ@2\windows-jdk10-m3.5.x_build\maven-archetype-plugin\target\it\projects\ARCHETYPE-520_mirror\build.log, f:\jenkins\jenkins-slave\workspace\ven-archetype_ARCHETYPE-553-J4FOCNZGBVSFDFI4P3DBC7GXGJK62NFN5QH7Q5I46GZ5AP3FIVLQ@2\windows-jdk10-m3.5.x_build\maven-archetype-plugin\target\it\projects\ARCHETYPE-521_archetype-repo\build.log, f:\jenkins\jenkins-slave\workspace\ven-archetype_ARCHETYPE-553-J4FOCNZGBVSFDFI4P3DBC7GXGJK62NFN5QH7Q5I46GZ5AP3FIVLQ@2\windows-jdk10-m3.5.x_build\maven-archetype-plugin\target\it\projects\build-archetype-and-run-its-with-existing-parent\build.log, f:\jenkins\jenkins-slave\workspace\ven-archetype_ARCHETYPE-553-J4FOCNZGBVSFDFI4P3DBC7GXGJK62NFN5QH7Q5I46GZ5AP3FIVLQ@2\windows-jdk10-m3.5.x_build\maven-archetype-plugin\target\it\projects\build-archetype-and-run-its-with-existing-parent\target\test-classes\projects\basic\project\project\basic\build.log, f:\jenkins\jenkins-slave\workspace\ven-archetype_ARCHETYPE-553-J4FOCNZGBVSFDFI4P3DBC7GXGJK62NFN5QH7Q5I46GZ5AP3FIVLQ@2\windows-jdk10-m3.5.x_build\maven-archetype-plugin\target\it\projects\build-archetype-ignore-eol-encoding\build.log, f:\jenkins\jenkins-slave\workspace\ven-archetype_ARCHETYPE-553-J4FOCNZGBVSFDFI4P3DBC7GXGJK62NFN5QH7Q5I46GZ5AP3FIVLQ@2\windows-jdk10-m3.5.x_build\maven-archetype-plugin\target\it\projects\build-archetype-ignore-eol-encoding\target\test-classes\projects\basic\project\basic\build.log, f:\jenkins\jenkins-slave\workspace\ven-archetype_ARCHETYPE-553-J4FOCNZGBVSFDFI4P3DBC7GXGJK62NFN5QH7Q5I46GZ5AP3FIVLQ@2\windows-jdk10-m3.5.x_build\maven-archetype-plugin\target\it\projects\build-archetype\build.log, f:\jenkins\jenkins-slave\workspace\ven-archetype_ARCHETYPE-553-J4FOCNZGBVSFDFI4P3DBC7GXGJK62NFN5QH7Q5I46GZ5AP3FIVLQ@2\windows-jdk10-m3.5.x_build\maven-archetype-plugin\target\it\projects\build-archetype\target\test-classes\projects\basic\project\basic\build.log, f:\jenkins\jenkins-slave\workspace\ven-archetype_ARCHETYPE-553-J4FOCNZGBVSFDFI4P3DBC7GXGJK62NFN5QH7Q5I46GZ5AP3FIVLQ@2\windows-jdk10-m3.5.x_build\maven-archetype-plugin\target\it\projects\create-from-project-exclude-patterns\build.log, f:\jenkins\jenkins-slave\workspace\ven-archetype_ARCHETYPE-553-J4FOCNZGBVSFDFI4P3DBC7GXGJK62NFN5QH7Q5I46GZ5AP3FIVLQ@2\windows-jdk10-m3.5.x_build\maven-archetype-plugin\target\it\projects\create-from-project-exclude-patterns\target\generated-sources\archetype\src\main\resources\archetype-resources\build.log, f:\jenkins\jenkins-slave\workspace\ven-archetype_ARCHETYPE-553-J4FOCNZGBVSFDFI4P3DBC7GXGJK62NFN5QH7Q5I46GZ5AP3FIVLQ@2\windows-jdk10-m3.5.x_build\maven-archetype-plugin\target\it\projects\create-from-project-exclude-patterns\target\generated-sources\archetype\target\classes\archetype-resources\build.log, f:\jenkins\jenkins-slave\workspace\ven-archetype_ARCHETYPE-553-J4FOCNZGBVSFDFI4P3DBC7GXGJK62NFN5QH7Q5I46GZ5AP3FIVLQ@2\windows-jdk10-m3.5.x_build\maven-archetype-plugin\target\it\projects\create-from-project\build.log, f:\jenkins\jenkins-slave\workspace\ven-archetype_ARCHETYPE-553-J4FOCNZGBVSFDFI4P3DBC7GXGJK62NFN5QH7Q5I46GZ5AP3FIVLQ@2\windows-jdk10-m3.5.x_build\maven-archetype-plugin\target\it\projects\create-from-project\target\generated-sources\archetype\src\main\resources\archetype-resources\build.log, f:\jenkins\jenkins-slave\workspace\ven-archetype_ARCHETYPE-553-J4FOCNZGBVSFDFI4P3DBC7GXGJK62NFN5QH7Q5I46GZ5AP3FIVLQ@2\windows-jdk10-m3.5.x_build\maven-archetype-plugin\target\it\projects\create-from-project\target\generated-sources\archetype\target\classes\archetype-resources\build.log, f:\jenkins\jenkins-slave\workspace\ven-archetype_ARCHETYPE-553-J4FOCNZGBVSFDFI4P3DBC7GXGJK62NFN5QH7Q5I46GZ5AP3FIVLQ@2\windows-jdk10-m3.5.x_build\maven-archetype-plugin\target\it\projects\generate-basic\build.log, f:\jenkins\jenkins-slave\workspace\ven-archetype_ARCHETYPE-553-J4FOCNZGBVSFDFI4P3DBC7GXGJK62NFN5QH7Q5I46GZ5AP3FIVLQ@2\windows-jdk10-m3.5.x_build\maven-archetype-plugin\target\it\projects\property-setting-cli\build.log]
[windows-jdk10-m3.5.x_build] Finished parsing Maven Invoker results (found 11)
[windows-jdk10-m3.5.x_build] [withMaven] junitPublisher - Archive test results for Maven artifact org.apache.maven.archetype:archetype-catalog:3.0.2-SNAPSHOT generated by maven-surefire-plugin:test (default-test): windows-jdk10-m3.5.x_build\archetype-models\archetype-catalog\target\surefire-reports\*.xml
[windows-jdk10-m3.5.x_build] Recording test results
[windows-jdk10-m3.5.x_build] None of the test reports contained any result
[windows-jdk10-m3.5.x_build] [withMaven] junitPublisher - Archive test results for Maven artifact org.apache.maven.archetype:archetype-descriptor:3.0.2-SNAPSHOT generated by maven-surefire-plugin:test (default-test): windows-jdk10-m3.5.x_build\archetype-models\archetype-descriptor\target\surefire-reports\*.xml
[windows-jdk10-m3.5.x_build] Recording test results
[windows-jdk10-m3.5.x_build] None of the test reports contained any result
[windows-jdk10-m3.5.x_build] [withMaven] junitPublisher - Archive test results for Maven artifact org.apache.maven.archetype:archetype-repository:3.0.2-SNAPSHOT generated by maven-surefire-plugin:test (default-test): windows-jdk10-m3.5.x_build\archetype-testing\archetype-repository\target\surefire-reports\*.xml
[windows-jdk10-m3.5.x_build] Recording test results
[windows-jdk10-m3.5.x_build] None of the test reports contained any result
[windows-jdk10-m3.5.x_build] [withMaven] junitPublisher - Archive test results for Maven artifact org.apache.maven.archetype:archetype-proxy:3.0.2-SNAPSHOT generated by maven-surefire-plugin:test (default-test): windows-jdk10-m3.5.x_build\archetype-testing\archetype-proxy\target\surefire-reports\*.xml
[windows-jdk10-m3.5.x_build] Recording test results
[windows-jdk10-m3.5.x_build] None of the test reports contained any result
[windows-jdk10-m3.5.x_build] [withMaven] junitPublisher - Archive test results for Maven artifact org.apache.maven.archetype:archetype-common:3.0.2-SNAPSHOT generated by maven-surefire-plugin:test (default-test): windows-jdk10-m3.5.x_build\archetype-common\target\surefire-reports\*.xml
[windows-jdk10-m3.5.x_build] Recording test results
[windows-jdk10-m3.5.x_build] [withMaven] junitPublisher - Archive test results for Maven artifact org.apache.maven.archetype:archetype-packaging:3.0.2-SNAPSHOT generated by maven-surefire-plugin:test (default-test): windows-jdk10-m3.5.x_build\archetype-packaging\target\surefire-reports\*.xml
[windows-jdk10-m3.5.x_build] Recording test results
[windows-jdk10-m3.5.x_build] None of the test reports contained any result
[windows-jdk10-m3.5.x_build] [withMaven] junitPublisher - Archive test results for Maven artifact org.apache.maven.plugins:maven-archetype-plugin:3.0.2-SNAPSHOT generated by maven-surefire-plugin:test (default-test): windows-jdk10-m3.5.x_build\maven-archetype-plugin\target\surefire-reports\*.xml
[windows-jdk10-m3.5.x_build] Recording test results
[windows-jdk10-m3.5.x_build] [withMaven] junitPublisher - Archive test results for Maven artifact org.apache.maven.archetype:archetype-final:3.0.2-SNAPSHOT generated by maven-surefire-plugin:test (default-test): windows-jdk10-m3.5.x_build\archetype-testing\archetype-final\target\surefire-reports\*.xml
[windows-jdk10-m3.5.x_build] Recording test results
[windows-jdk10-m3.5.x_build] None of the test reports contained any result
[windows-jdk10-m3.5.x_build] [withMaven] junitPublisher - Archive test results for Maven artifact org.apache.maven.archetype:archetype-final:3.0.2-SNAPSHOT generated by maven-failsafe-plugin:integration-test (default): windows-jdk10-m3.5.x_build\archetype-testing\archetype-final\target\failsafe-reports\*.xml
[windows-jdk10-m3.5.x_build] Recording test results
[windows-jdk10-m3.5.x_build] [withMaven] openTasksPublisher - Scan Tasks for Maven artifact org.apache.maven.archetype:archetype-repository:3.0.2-SNAPSHOT in source directory windows-jdk10-m3.5.x_build\archetype-testing\archetype-repository\src\main\java
[windows-jdk10-m3.5.x_build] [withMaven] openTasksPublisher - Scan Tasks for Maven artifact org.apache.maven.archetype:archetype-proxy:3.0.2-SNAPSHOT in source directory windows-jdk10-m3.5.x_build\archetype-testing\archetype-proxy\src\main\java
[windows-jdk10-m3.5.x_build] [withMaven] openTasksPublisher - Scan Tasks for Maven artifact org.apache.maven.archetype:archetype-common:3.0.2-SNAPSHOT in source directory windows-jdk10-m3.5.x_build\archetype-common\src\main\java
[windows-jdk10-m3.5.x_build] [withMaven] openTasksPublisher - Scan Tasks for Maven artifact org.apache.maven.plugins:maven-archetype-plugin:3.0.2-SNAPSHOT in source directory windows-jdk10-m3.5.x_build\maven-archetype-plugin\src\main\java
[windows-jdk10-m3.5.x_build] [TASKS] Scanning folder 'f:\jenkins\jenkins-slave\workspace\ven-archetype_ARCHETYPE-553-J4FOCNZGBVSFDFI4P3DBC7GXGJK62NFN5QH7Q5I46GZ5AP3FIVLQ@2' for files matching the pattern 'windows-jdk10-m3.5.x_build\archetype-testing\archetype-repository\src\main\java\**\*,windows-jdk10-m3.5.x_build\archetype-testing\archetype-proxy\src\main\java\**\*,windows-jdk10-m3.5.x_build\archetype-common\src\main\java\**\*,windows-jdk10-m3.5.x_build\maven-archetype-plugin\src\main\java\**\*' - excludes: null
[windows-jdk10-m3.5.x_build] [TASKS] Found 91 files to scan for tasks
[windows-jdk10-m3.5.x_build] [TASKS] Found 27 open tasks.
[windows-jdk10-m3.5.x_build] Skipping warnings blame since pipelines do not have an SCM link.%n
[windows-jdk10-m3.5.x_build] [TASKS] Computing warning deltas based on reference build #15
[Pipeline] [windows-jdk10-m3.5.x_build] // withMaven
[Pipeline] [windows-jdk10-m3.5.x_build] cleanWs
[windows-jdk10-m3.5.x_build] [WS-CLEANUP] Deleting project workspace...[WS-CLEANUP] done
[Pipeline] [windows-jdk10-m3.5.x_build] }
[Pipeline] [windows-jdk10-m3.5.x_build] // stage
[Pipeline] [windows-jdk10-m3.5.x_build] }
[Pipeline] [windows-jdk10-m3.5.x_build] // node
[Pipeline] [windows-jdk10-m3.5.x_build] }
[Pipeline] // parallel
[Pipeline] stage
[Pipeline] { (Notifications)
[Pipeline] echo
Build result: UNSTABLE
[Pipeline] jiraIssueSelector
[Pipeline] emailext
Mime
  • Unnamed multipart/mixed (inline, None, 0 bytes)
View raw message