maven-notifications mailing list archives

Site index · List index
Message view « Date » · « Thread »
Top « Date » · « Thread »
From Apache Jenkins Server <jenk...@builds.apache.org>
Subject Build failed in Jenkins: Maven TLP » maven-javadoc-plugin » Jenkins_investigation #14
Date Fri, 14 Sep 2018 04:39:12 GMT
See https://builds.apache.org/job/maven-box/job/maven-javadoc-plugin/job/Jenkins_investigation/14/

No changes.

12 tests failed.
FAILED:  org.apache.maven.plugins.javadoc.FixJavadocMojoTest.testFix

Error Message:
Error when invoking Maven, consult the invoker log file: f:\jenkins\jenkins-slave\workspace\lugin_Jenkins_investigation-XMH53YEN2PKRRDIEGSSOM3JEJOBRY257ATPQFDZAASG7YO2URE4Q\m\target\invoker\FixJavadocMojoTest767912501.txt

Stack Trace:
org.apache.maven.shared.invoker.MavenInvocationException: Error when invoking Maven, consult the invoker log file: f:\jenkins\jenkins-slave\workspace\lugin_Jenkins_investigation-XMH53YEN2PKRRDIEGSSOM3JEJOBRY257ATPQFDZAASG7YO2URE4Q\m\target\invoker\FixJavadocMojoTest767912501.txt
	at org.apache.maven.plugins.javadoc.FixJavadocMojoTest.invokeCompileGoal(FixJavadocMojoTest.java:662)
	at org.apache.maven.plugins.javadoc.FixJavadocMojoTest.executeMojoAndTest(FixJavadocMojoTest.java:619)
	at org.apache.maven.plugins.javadoc.FixJavadocMojoTest.testFix(FixJavadocMojoTest.java:141)


FAILED:  org.apache.maven.plugins.javadoc.FixJavadocMojoTest.testFixJdk5

Error Message:
Error when invoking Maven, consult the invoker log file: f:\jenkins\jenkins-slave\workspace\lugin_Jenkins_investigation-XMH53YEN2PKRRDIEGSSOM3JEJOBRY257ATPQFDZAASG7YO2URE4Q\m\target\invoker\FixJavadocMojoTest281960307.txt

Stack Trace:
org.apache.maven.shared.invoker.MavenInvocationException: Error when invoking Maven, consult the invoker log file: f:\jenkins\jenkins-slave\workspace\lugin_Jenkins_investigation-XMH53YEN2PKRRDIEGSSOM3JEJOBRY257ATPQFDZAASG7YO2URE4Q\m\target\invoker\FixJavadocMojoTest281960307.txt
	at org.apache.maven.plugins.javadoc.FixJavadocMojoTest.invokeCompileGoal(FixJavadocMojoTest.java:662)
	at org.apache.maven.plugins.javadoc.FixJavadocMojoTest.executeMojoAndTest(FixJavadocMojoTest.java:619)
	at org.apache.maven.plugins.javadoc.FixJavadocMojoTest.testFixJdk5(FixJavadocMojoTest.java:159)


FAILED:  org.apache.maven.plugins.javadoc.FixJavadocMojoTest.testFixJdk6

Error Message:
Error when invoking Maven, consult the invoker log file: f:\jenkins\jenkins-slave\workspace\lugin_Jenkins_investigation-XMH53YEN2PKRRDIEGSSOM3JEJOBRY257ATPQFDZAASG7YO2URE4Q\m\target\invoker\FixJavadocMojoTest1683269900.txt

Stack Trace:
org.apache.maven.shared.invoker.MavenInvocationException: Error when invoking Maven, consult the invoker log file: f:\jenkins\jenkins-slave\workspace\lugin_Jenkins_investigation-XMH53YEN2PKRRDIEGSSOM3JEJOBRY257ATPQFDZAASG7YO2URE4Q\m\target\invoker\FixJavadocMojoTest1683269900.txt
	at org.apache.maven.plugins.javadoc.FixJavadocMojoTest.invokeCompileGoal(FixJavadocMojoTest.java:662)
	at org.apache.maven.plugins.javadoc.FixJavadocMojoTest.executeMojoAndTest(FixJavadocMojoTest.java:619)
	at org.apache.maven.plugins.javadoc.FixJavadocMojoTest.testFixJdk6(FixJavadocMojoTest.java:170)


FAILED:  org.apache.maven.plugins.javadoc.FixJavadocMojoTest.testFix

Error Message:
null

Stack Trace:
java.lang.NullPointerException
	at org.apache.maven.plugins.javadoc.FixJavadocMojoTest.executeMojoAndTest(FixJavadocMojoTest.java:622)
	at org.apache.maven.plugins.javadoc.FixJavadocMojoTest.testFix(FixJavadocMojoTest.java:141)


FAILED:  org.apache.maven.plugins.javadoc.FixJavadocMojoTest.testRemoveUnknownExceptions

Error Message:
null

Stack Trace:
java.lang.NullPointerException
	at org.apache.maven.plugins.javadoc.FixJavadocMojoTest.testRemoveUnknownExceptions(FixJavadocMojoTest.java:576)


FAILED:  org.apache.maven.plugins.javadoc.JavadocReportTest.testTagletArtifacts

Error Message:
expected:<20> but was:<0>

Stack Trace:
junit.framework.AssertionFailedError: expected:<20> but was:<0>
	at org.apache.maven.plugins.javadoc.JavadocReportTest.testTagletArtifacts(JavadocReportTest.java:1044)


FAILED:  org.apache.maven.plugins.javadoc.JavadocReportTest.testTaglets

Error Message:
An error has occurred in Javadoc report generation: 
Exit code: 1 - Picked up JAVA_TOOL_OPTIONS: -Dmaven.ext.class.path="f:\jenkins\jenkins-slave\workspace\lugin_Jenkins_investigation-XMH53YEN2PKRRDIEGSSOM3JEJOBRY257ATPQFDZAASG7YO2URE4Q@tmp\withMaven165cd5b1\pipeline-maven-spy.jar" -Dorg.jenkinsci.plugins.pipeline.maven.reportsFolder="f:\jenkins\jenkins-slave\workspace\lugin_Jenkins_investigation-XMH53YEN2PKRRDIEGSSOM3JEJOBRY257ATPQFDZAASG7YO2URE4Q@tmp\withMaven165cd5b1" 
javadoc: error - An internal exception has occurred. 
 (java.lang.NoClassDefFoundError: com/sun/tools/doclets/Taglet)
Please file a bug against the javadoc tool via the Java bug reporting page
(http://bugreport.java.com) after checking the Bug Database (http://bugs.java.com)
for duplicates. Include error messages and the following diagnostic in your report. Thank you.
java.lang.NoClassDefFoundError: com/sun/tools/doclets/Taglet
 at java.base/java.lang.ClassLoader.defineClass1(Native Method)
 at java.base/java.lang.ClassLoader.defineClass(ClassLoader.java:1009)
 at java.base/java.security.SecureClassLoader.defineClass(SecureClassLoader.java:174)
 at java.base/java.net.URLClassLoader.defineClass(URLClassLoader.java:545)
 at java.base/java.net.URLClassLoader.access$100(URLClassLoader.java:83)
 at java.base/java.net.URLClassLoader$1.run(URLClassLoader.java:453)
 at java.base/java.net.URLClassLoader$1.run(URLClassLoader.java:447)
 at java.base/java.security.AccessController.doPrivileged(Native Method)
 at java.base/java.net.URLClassLoader.findClass(URLClassLoader.java:446)
 at java.base/java.lang.ClassLoader.loadClass(ClassLoader.java:566)
 at java.base/java.lang.ClassLoader.loadClass(ClassLoader.java:499)
 at java.base/java.lang.ClassLoader.defineClass1(Native Method)
 at java.base/java.lang.ClassLoader.defineClass(ClassLoader.java:1009)
 at java.base/java.security.SecureClassLoader.defineClass(SecureClassLoader.java:174)
 at java.base/java.net.URLClassLoader.defineClass(URLClassLoader.java:545)
 at java.base/java.net.URLClassLoader.access$100(URLClassLoader.java:83)
 at java.base/java.net.URLClassLoader$1.run(URLClassLoader.java:453)
 at java.base/java.net.URLClassLoader$1.run(URLClassLoader.java:447)
 at java.base/java.security.AccessController.doPrivileged(Native Method)
 at java.base/java.net.URLClassLoader.findClass(URLClassLoader.java:446)
 at java.base/java.lang.ClassLoader.loadClass(ClassLoader.java:566)
 at java.base/java.lang.ClassLoader.loadClass(ClassLoader.java:499)
 at jdk.javadoc/jdk.javadoc.internal.doclets.toolkit.taglets.TagletManager.addCustomTag(TagletManager.java:262)
 at jdk.javadoc/jdk.javadoc.internal.doclets.toolkit.BaseConfiguration.initTagletManager(BaseConfiguration.java:786)
 at jdk.javadoc/jdk.javadoc.internal.doclets.toolkit.BaseConfiguration.finishOptionSettings0(BaseConfiguration.java:726)
 at jdk.javadoc/jdk.javadoc.internal.doclets.formats.html.HtmlConfiguration.finishOptionSettings0(HtmlConfiguration.java:867)
 at jdk.javadoc/jdk.javadoc.internal.doclets.toolkit.BaseConfiguration.setOptions(BaseConfiguration.java:747)
 at jdk.javadoc/jdk.javadoc.internal.doclets.toolkit.AbstractDoclet.startGeneration(AbstractDoclet.java:204)
 at jdk.javadoc/jdk.javadoc.internal.doclets.toolkit.AbstractDoclet.run(AbstractDoclet.java:117)
 at jdk.javadoc/jdk.javadoc.doclet.StandardDoclet.run(StandardDoclet.java:72)
 at jdk.javadoc/jdk.javadoc.internal.tool.Start.parseAndExecute(Start.java:581)
 at jdk.javadoc/jdk.javadoc.internal.tool.Start.begin(Start.java:430)
 at jdk.javadoc/jdk.javadoc.internal.tool.Start.begin(Start.java:343)
 at jdk.javadoc/jdk.javadoc.internal.tool.Main.execute(Main.java:63)
 at jdk.javadoc/jdk.javadoc.internal.tool.Main.main(Main.java:52)
Caused by: java.lang.ClassNotFoundException: com.sun.tools.doclets.Taglet
 at java.base/java.net.URLClassLoader.findClass(URLClassLoader.java:466)
 at java.base/java.lang.ClassLoader.loadClass(ClassLoader.java:566)
 at java.base/java.lang.ClassLoader.loadClass(ClassLoader.java:499)
 ... 35 more

Command line was: f:\jenkins\tools\java\latest10\bin\javadoc.exe @options @argfile

Refer to the generated Javadoc files in 'f:\jenkins\jenkins-slave\workspace\lugin_Jenkins_investigation-XMH53YEN2PKRRDIEGSSOM3JEJOBRY257ATPQFDZAASG7YO2URE4Q\m\target\test\unit\taglet-test\target\site\apidocs' dir.


Stack Trace:
org.apache.maven.plugin.MojoExecutionException: 
An error has occurred in Javadoc report generation: 
Exit code: 1 - Picked up JAVA_TOOL_OPTIONS: -Dmaven.ext.class.path="f:\jenkins\jenkins-slave\workspace\lugin_Jenkins_investigation-XMH53YEN2PKRRDIEGSSOM3JEJOBRY257ATPQFDZAASG7YO2URE4Q@tmp\withMaven165cd5b1\pipeline-maven-spy.jar" -Dorg.jenkinsci.plugins.pipeline.maven.reportsFolder="f:\jenkins\jenkins-slave\workspace\lugin_Jenkins_investigation-XMH53YEN2PKRRDIEGSSOM3JEJOBRY257ATPQFDZAASG7YO2URE4Q@tmp\withMaven165cd5b1" 
javadoc: error - An internal exception has occurred. 
	(java.lang.NoClassDefFoundError: com/sun/tools/doclets/Taglet)
Please file a bug against the javadoc tool via the Java bug reporting page
(http://bugreport.java.com) after checking the Bug Database (http://bugs.java.com)
for duplicates. Include error messages and the following diagnostic in your report. Thank you.
java.lang.NoClassDefFoundError: com/sun/tools/doclets/Taglet
	at java.base/java.lang.ClassLoader.defineClass1(Native Method)
	at java.base/java.lang.ClassLoader.defineClass(ClassLoader.java:1009)
	at java.base/java.security.SecureClassLoader.defineClass(SecureClassLoader.java:174)
	at java.base/java.net.URLClassLoader.defineClass(URLClassLoader.java:545)
	at java.base/java.net.URLClassLoader.access$100(URLClassLoader.java:83)
	at java.base/java.net.URLClassLoader$1.run(URLClassLoader.java:453)
	at java.base/java.net.URLClassLoader$1.run(URLClassLoader.java:447)
	at java.base/java.security.AccessController.doPrivileged(Native Method)
	at java.base/java.net.URLClassLoader.findClass(URLClassLoader.java:446)
	at java.base/java.lang.ClassLoader.loadClass(ClassLoader.java:566)
	at java.base/java.lang.ClassLoader.loadClass(ClassLoader.java:499)
	at java.base/java.lang.ClassLoader.defineClass1(Native Method)
	at java.base/java.lang.ClassLoader.defineClass(ClassLoader.java:1009)
	at java.base/java.security.SecureClassLoader.defineClass(SecureClassLoader.java:174)
	at java.base/java.net.URLClassLoader.defineClass(URLClassLoader.java:545)
	at java.base/java.net.URLClassLoader.access$100(URLClassLoader.java:83)
	at java.base/java.net.URLClassLoader$1.run(URLClassLoader.java:453)
	at java.base/java.net.URLClassLoader$1.run(URLClassLoader.java:447)
	at java.base/java.security.AccessController.doPrivileged(Native Method)
	at java.base/java.net.URLClassLoader.findClass(URLClassLoader.java:446)
	at java.base/java.lang.ClassLoader.loadClass(ClassLoader.java:566)
	at java.base/java.lang.ClassLoader.loadClass(ClassLoader.java:499)
	at jdk.javadoc/jdk.javadoc.internal.doclets.toolkit.taglets.TagletManager.addCustomTag(TagletManager.java:262)
	at jdk.javadoc/jdk.javadoc.internal.doclets.toolkit.BaseConfiguration.initTagletManager(BaseConfiguration.java:786)
	at jdk.javadoc/jdk.javadoc.internal.doclets.toolkit.BaseConfiguration.finishOptionSettings0(BaseConfiguration.java:726)
	at jdk.javadoc/jdk.javadoc.internal.doclets.formats.html.HtmlConfiguration.finishOptionSettings0(HtmlConfiguration.java:867)
	at jdk.javadoc/jdk.javadoc.internal.doclets.toolkit.BaseConfiguration.setOptions(BaseConfiguration.java:747)
	at jdk.javadoc/jdk.javadoc.internal.doclets.toolkit.AbstractDoclet.startGeneration(AbstractDoclet.java:204)
	at jdk.javadoc/jdk.javadoc.internal.doclets.toolkit.AbstractDoclet.run(AbstractDoclet.java:117)
	at jdk.javadoc/jdk.javadoc.doclet.StandardDoclet.run(StandardDoclet.java:72)
	at jdk.javadoc/jdk.javadoc.internal.tool.Start.parseAndExecute(Start.java:581)
	at jdk.javadoc/jdk.javadoc.internal.tool.Start.begin(Start.java:430)
	at jdk.javadoc/jdk.javadoc.internal.tool.Start.begin(Start.java:343)
	at jdk.javadoc/jdk.javadoc.internal.tool.Main.execute(Main.java:63)
	at jdk.javadoc/jdk.javadoc.internal.tool.Main.main(Main.java:52)
Caused by: java.lang.ClassNotFoundException: com.sun.tools.doclets.Taglet
	at java.base/java.net.URLClassLoader.findClass(URLClassLoader.java:466)
	at java.base/java.lang.ClassLoader.loadClass(ClassLoader.java:566)
	at java.base/java.lang.ClassLoader.loadClass(ClassLoader.java:499)
	... 35 more

Command line was: f:\jenkins\tools\java\latest10\bin\javadoc.exe @options @argfile

Refer to the generated Javadoc files in 'f:\jenkins\jenkins-slave\workspace\lugin_Jenkins_investigation-XMH53YEN2PKRRDIEGSSOM3JEJOBRY257ATPQFDZAASG7YO2URE4Q\m\target\test\unit\taglet-test\target\site\apidocs' dir.

	at org.apache.maven.plugins.javadoc.JavadocReportTest.testTaglets(JavadocReportTest.java:559)
Caused by: org.apache.maven.reporting.MavenReportException: 

Exit code: 1 - Picked up JAVA_TOOL_OPTIONS: -Dmaven.ext.class.path="f:\jenkins\jenkins-slave\workspace\lugin_Jenkins_investigation-XMH53YEN2PKRRDIEGSSOM3JEJOBRY257ATPQFDZAASG7YO2URE4Q@tmp\withMaven165cd5b1\pipeline-maven-spy.jar" -Dorg.jenkinsci.plugins.pipeline.maven.reportsFolder="f:\jenkins\jenkins-slave\workspace\lugin_Jenkins_investigation-XMH53YEN2PKRRDIEGSSOM3JEJOBRY257ATPQFDZAASG7YO2URE4Q@tmp\withMaven165cd5b1" 
javadoc: error - An internal exception has occurred. 
	(java.lang.NoClassDefFoundError: com/sun/tools/doclets/Taglet)
Please file a bug against the javadoc tool via the Java bug reporting page
(http://bugreport.java.com) after checking the Bug Database (http://bugs.java.com)
for duplicates. Include error messages and the following diagnostic in your report. Thank you.
java.lang.NoClassDefFoundError: com/sun/tools/doclets/Taglet
	at java.base/java.lang.ClassLoader.defineClass1(Native Method)
	at java.base/java.lang.ClassLoader.defineClass(ClassLoader.java:1009)
	at java.base/java.security.SecureClassLoader.defineClass(SecureClassLoader.java:174)
	at java.base/java.net.URLClassLoader.defineClass(URLClassLoader.java:545)
	at java.base/java.net.URLClassLoader.access$100(URLClassLoader.java:83)
	at java.base/java.net.URLClassLoader$1.run(URLClassLoader.java:453)
	at java.base/java.net.URLClassLoader$1.run(URLClassLoader.java:447)
	at java.base/java.security.AccessController.doPrivileged(Native Method)
	at java.base/java.net.URLClassLoader.findClass(URLClassLoader.java:446)
	at java.base/java.lang.ClassLoader.loadClass(ClassLoader.java:566)
	at java.base/java.lang.ClassLoader.loadClass(ClassLoader.java:499)
	at java.base/java.lang.ClassLoader.defineClass1(Native Method)
	at java.base/java.lang.ClassLoader.defineClass(ClassLoader.java:1009)
	at java.base/java.security.SecureClassLoader.defineClass(SecureClassLoader.java:174)
	at java.base/java.net.URLClassLoader.defineClass(URLClassLoader.java:545)
	at java.base/java.net.URLClassLoader.access$100(URLClassLoader.java:83)
	at java.base/java.net.URLClassLoader$1.run(URLClassLoader.java:453)
	at java.base/java.net.URLClassLoader$1.run(URLClassLoader.java:447)
	at java.base/java.security.AccessController.doPrivileged(Native Method)
	at java.base/java.net.URLClassLoader.findClass(URLClassLoader.java:446)
	at java.base/java.lang.ClassLoader.loadClass(ClassLoader.java:566)
	at java.base/java.lang.ClassLoader.loadClass(ClassLoader.java:499)
	at jdk.javadoc/jdk.javadoc.internal.doclets.toolkit.taglets.TagletManager.addCustomTag(TagletManager.java:262)
	at jdk.javadoc/jdk.javadoc.internal.doclets.toolkit.BaseConfiguration.initTagletManager(BaseConfiguration.java:786)
	at jdk.javadoc/jdk.javadoc.internal.doclets.toolkit.BaseConfiguration.finishOptionSettings0(BaseConfiguration.java:726)
	at jdk.javadoc/jdk.javadoc.internal.doclets.formats.html.HtmlConfiguration.finishOptionSettings0(HtmlConfiguration.java:867)
	at jdk.javadoc/jdk.javadoc.internal.doclets.toolkit.BaseConfiguration.setOptions(BaseConfiguration.java:747)
	at jdk.javadoc/jdk.javadoc.internal.doclets.toolkit.AbstractDoclet.startGeneration(AbstractDoclet.java:204)
	at jdk.javadoc/jdk.javadoc.internal.doclets.toolkit.AbstractDoclet.run(AbstractDoclet.java:117)
	at jdk.javadoc/jdk.javadoc.doclet.StandardDoclet.run(StandardDoclet.java:72)
	at jdk.javadoc/jdk.javadoc.internal.tool.Start.parseAndExecute(Start.java:581)
	at jdk.javadoc/jdk.javadoc.internal.tool.Start.begin(Start.java:430)
	at jdk.javadoc/jdk.javadoc.internal.tool.Start.begin(Start.java:343)
	at jdk.javadoc/jdk.javadoc.internal.tool.Main.execute(Main.java:63)
	at jdk.javadoc/jdk.javadoc.internal.tool.Main.main(Main.java:52)
Caused by: java.lang.ClassNotFoundException: com.sun.tools.doclets.Taglet
	at java.base/java.net.URLClassLoader.findClass(URLClassLoader.java:466)
	at java.base/java.lang.ClassLoader.loadClass(ClassLoader.java:566)
	at java.base/java.lang.ClassLoader.loadClass(ClassLoader.java:499)
	... 35 more

Command line was: f:\jenkins\tools\java\latest10\bin\javadoc.exe @options @argfile

Refer to the generated Javadoc files in 'f:\jenkins\jenkins-slave\workspace\lugin_Jenkins_investigation-XMH53YEN2PKRRDIEGSSOM3JEJOBRY257ATPQFDZAASG7YO2URE4Q\m\target\test\unit\taglet-test\target\site\apidocs' dir.

	at org.apache.maven.plugins.javadoc.JavadocReportTest.testTaglets(JavadocReportTest.java:559)


FAILED:  org.apache.maven.plugins.javadoc.JavadocReportTest.testQuotedPath

Error Message:
null

Stack Trace:
junit.framework.AssertionFailedError
	at org.apache.maven.plugins.javadoc.JavadocReportTest.testQuotedPath(JavadocReportTest.java:498)


FAILED:  org.apache.maven.plugins.javadoc.JavadocReportTest.testDocfiles

Error Message:
null

Stack Trace:
junit.framework.AssertionFailedError
	at org.apache.maven.plugins.javadoc.JavadocReportTest.testDocfiles(JavadocReportTest.java:330)


FAILED:  org.apache.maven.plugins.javadoc.JavadocReportTest.testStylesheetfile

Error Message:
null

Stack Trace:
junit.framework.AssertionFailedError
	at org.apache.maven.plugins.javadoc.JavadocReportTest.testStylesheetfile(JavadocReportTest.java:1115)


FAILED:  org.apache.maven.plugins.javadoc.JavadocReportTest.testDefaultConfiguration

Error Message:
<!DOCTYPE HTML PUBLIC "-//W3C//DTD HTML 4.01 Transitional//EN" "http://www.w3.org/TR/html4/loose.dtd">
<!-- NewPage -->
<html lang="en">
<head>
<!-- Generated by javadoc (9.0.1) on Fri Sep 14 04:27:28 UTC 2018 -->
<title>App (Maven Javadoc Plugin Default configuration Test 1.0-SNAPSHOT API)</title>
<meta http-equiv="Content-Type" content="text/html; charset=UTF-8">
<meta name="date" content="2018-09-14">
<link rel="stylesheet" type="text/css" href="../../stylesheet.css" title="Style">
<link rel="stylesheet" type="text/css" href="../../jquery/jquery-ui.css" title="Style">
<script type="text/javascript" src="../../script.js"></script>
<script type="text/javascript" src="../../jquery/jszip/dist/jszip.min.js"></script>
<script type="text/javascript" src="../../jquery/jszip-utils/dist/jszip-utils.min.js"></script>
<!--[if IE]>
<script type="text/javascript" src="../../jquery/jszip-utils/dist/jszip-utils-ie.min.js"></script>
<![endif]-->
<script type="text/javascript" src="../../jquery/jquery-1.10.2.js"></script>
<script type="text/javascript" src="../../jquery/jquery-ui.js"></script>
</head>
<body>
<script type="text/javascript"><!--
    try {
        if (location.href.indexOf('is-external=true') == -1) {
            parent.document.title="App (Maven Javadoc Plugin Default configuration Test 1.0-SNAPSHOT API)";
        }
    }
    catch(err) {
    }
//-->
var methods = {"i0":9,"i1":10};
var tabs = {65535:["t0","All Methods"],1:["t1","Static Methods"],2:["t2","Instance Methods"],8:["t4","Concrete Methods"]};
var altColor = "altColor";
var rowColor = "rowColor";
var tableTab = "tableTab";
var activeTableTab = "activeTableTab";
var pathtoroot = "../../";loadScripts(document, 'script');</script>
<noscript>
<div>JavaScript is disabled on your browser.</div>
</noscript>
<div class="fixedNav">
<!-- ========= START OF TOP NAVBAR ======= -->
<div class="topNav"><a name="navbar.top">
<!--   -->
</a>
<div class="skipNav"><a href="#skip.navbar.top" title="Skip navigation links">Skip navigation links</a></div>
<a name="navbar.top.firstrow">
<!--   -->
</a>
<ul class="navList" title="Navigation">
<li><a href="../../def/configuration/package-summary.html">Package</a></li>
<li class="navBarCell1Rev">Class</li>
<li><a href="class-use/App.html">Use</a></li>
<li><a href="package-tree.html">Tree</a></li>
<li><a href="../../deprecated-list.html">Deprecated</a></li>
<li><a href="../../index-all.html">Index</a></li>
<li><a href="../../help-doc.html">Help</a></li>
</ul>
</div>
<div class="subNav">
<ul class="navList">
<li>Prev&nbsp;Class</li>
<li><a href="../../def/configuration/AppSample.html" title="class in def.configuration"><span class="typeNameLink">Next&nbsp;Class</span></a></li>
</ul>
<ul class="navList">
<li><a href="../../index.html?def/configuration/App.html" target="_top">Frames</a></li>
<li><a href="App.html" target="_top">No&nbsp;Frames</a></li>
</ul>
<ul class="navList" id="allclasses_navbar_top">
<li><a href="../../allclasses-noframe.html">All&nbsp;Classes</a></li>
</ul>
<ul class="navListSearch">
<li><span>SEARCH:&nbsp;</span>
<input type="text" id="search" value=" " disabled="disabled">
<input type="reset" id="reset" value=" " disabled="disabled">
</li>
</ul>
<div>
<script type="text/javascript"><!--
  allClassesLink = document.getElementById("allclasses_navbar_top");
  if(window==top) {
    allClassesLink.style.display = "block";
  }
  else {
    allClassesLink.style.display = "none";
  }
  //-->
</script>
<noscript>
<div>JavaScript is disabled on your browser.</div>
</noscript>
</div>
<div>
<ul class="subNavList">
<li>Summary:&nbsp;</li>
<li>Nested&nbsp;|&nbsp;</li>
<li>Field&nbsp;|&nbsp;</li>
<li><a href="#constructor.summary">Constr</a>&nbsp;|&nbsp;</li>
<li><a href="#method.summary">Method</a></li>
</ul>
<ul class="subNavList">
<li>Detail:&nbsp;</li>
<li>Field&nbsp;|&nbsp;</li>
<li><a href="#constructor.detail">Constr</a>&nbsp;|&nbsp;</li>
<li><a href="#method.detail">Method</a></li>
</ul>
</div>
<a name="skip.navbar.top">
<!--   -->
</a></div>
<!-- ========= END OF TOP NAVBAR ========= -->
</div>
<div class="navPadding">&nbsp;</div>
<script type="text/javascript"><!--
$('.navPadding').css('padding-top', $('.fixedNav').css("height"));
//-->
</script>
<!-- ======== START OF CLASS DATA ======== -->
<div class="header">
<div class="subTitle"><span class="packageLabelInType">Package</span>&nbsp;<a href="../../def/configuration/package-summary.html">def.configuration</a></div>
<h2 title="Class App" class="title">Class App</h2>
</div>
<div class="contentContainer">
<ul class="inheritance">
<li>java.lang.Object</li>
<li>
<ul class="inheritance">
<li>def.configuration.App</li>
</ul>
</li>
</ul>
<div class="description">
<ul class="blockList">
<li class="blockList">
<hr>
<br>
<pre>public class <span class="typeNameLabel">App</span>
extends java.lang.Object</pre>
</li>
</ul>
</div>
<div class="summary">
<ul class="blockList">
<li class="blockList">
<!-- ======== CONSTRUCTOR SUMMARY ======== -->
<ul class="blockList">
<li class="blockList"><a name="constructor.summary">
<!--   -->
</a>
<h3>Constructor Summary</h3>
<table class="memberSummary" summary="Constructor Summary table, listing constructors, and an explanation">
<caption><span>Constructors</span><span class="tabEnd">&nbsp;</span></caption>
<tr>
<th class="colFirst" scope="col">Constructor</th>
<th class="colLast" scope="col">Description</th>
</tr>
<tr class="altColor">
<th class="colConstructorName" scope="row"><code><span class="memberNameLink"><a href="../../def/configuration/App.html#App--">App</a></span>&#8203;()</code></th>
<td class="colLast">&nbsp;</td>
</tr>
</table>
</li>
</ul>
<!-- ========== METHOD SUMMARY =========== -->
<ul class="blockList">
<li class="blockList"><a name="method.summary">
<!--   -->
</a>
<h3>Method Summary</h3>
<table class="memberSummary" summary="Method Summary table, listing methods, and an explanation">
<caption><span id="t0" class="activeTableTab"><span>All Methods</span><span class="tabEnd">&nbsp;</span></span><span id="t1" class="tableTab"><span><a href="javascript:show(1);">Static Methods</a></span><span class="tabEnd">&nbsp;</span></span><span id="t2" class="tableTab"><span><a href="javascript:show(2);">Instance Methods</a></span><span class="tabEnd">&nbsp;</span></span><span id="t4" class="tableTab"><span><a href="javascript:show(8);">Concrete Methods</a></span><span class="tabEnd">&nbsp;</span></span></caption>
<tr>
<th class="colFirst" scope="col">Modifier and Type</th>
<th class="colSecond" scope="col">Method</th>
<th class="colLast" scope="col">Description</th>
</tr>
<tr id="i0" class="altColor">
<td class="colFirst"><code>static void</code></td>
<th class="colSecond" scope="row"><code><span class="memberNameLink"><a href="../../def/configuration/App.html#main-java.lang.String:A-">main</a></span>&#8203;(java.lang.String[]&nbsp;args)</code></th>
<td class="colLast">&nbsp;</td>
</tr>
<tr id="i1" class="rowColor">
<td class="colFirst"><code>protected void</code></td>
<th class="colSecond" scope="row"><code><span class="memberNameLink"><a href="../../def/configuration/App.html#sampleMethod-java.lang.String-">sampleMethod</a></span>&#8203;(java.lang.String&nbsp;str)</code></th>
<td class="colLast">&nbsp;</td>
</tr>
</table>
<ul class="blockList">
<li class="blockList"><a name="methods.inherited.from.class.java.lang.Object">
<!--   -->
</a>
<h3>Methods inherited from class&nbsp;java.lang.Object</h3>
<code>clone, equals, finalize, getClass, hashCode, notify, notifyAll, toString, wait, wait, wait</code></li>
</ul>
</li>
</ul>
</li>
</ul>
</div>
<div class="details">
<ul class="blockList">
<li class="blockList">
<!-- ========= CONSTRUCTOR DETAIL ======== -->
<ul class="blockList">
<li class="blockList"><a name="constructor.detail">
<!--   -->
</a>
<h3>Constructor Detail</h3>
<a name="App--">
<!--   -->
</a>
<ul class="blockListLast">
<li class="blockList">
<h4>App</h4>
<pre>public&nbsp;App&#8203;()</pre>
</li>
</ul>
</li>
</ul>
<!-- ============ METHOD DETAIL ========== -->
<ul class="blockList">
<li class="blockList"><a name="method.detail">
<!--   -->
</a>
<h3>Method Detail</h3>
<a name="main-java.lang.String:A-">
<!--   -->
</a>
<ul class="blockList">
<li class="blockList">
<h4>main</h4>
<pre>public static&nbsp;void&nbsp;main&#8203;(java.lang.String[]&nbsp;args)</pre>
</li>
</ul>
<a name="sampleMethod-java.lang.String-">
<!--   -->
</a>
<ul class="blockListLast">
<li class="blockList">
<h4>sampleMethod</h4>
<pre>protected&nbsp;void&nbsp;sampleMethod&#8203;(java.lang.String&nbsp;str)</pre>
</li>
</ul>
</li>
</ul>
</li>
</ul>
</div>
</div>
<!-- ========= END OF CLASS DATA ========= -->
<!-- ======= START OF BOTTOM NAVBAR ====== -->
<div class="bottomNav"><a name="navbar.bottom">
<!--   -->
</a>
<div class="skipNav"><a href="#skip.navbar.bottom" title="Skip navigation links">Skip navigation links</a></div>
<a name="navbar.bottom.firstrow">
<!--   -->
</a>
<ul class="navList" title="Navigation">
<li><a href="../../def/configuration/package-summary.html">Package</a></li>
<li class="navBarCell1Rev">Class</li>
<li><a href="class-use/App.html">Use</a></li>
<li><a href="package-tree.html">Tree</a></li>
<li><a href="../../deprecated-list.html">Deprecated</a></li>
<li><a href="../../index-all.html">Index</a></li>
<li><a href="../../help-doc.html">Help</a></li>
</ul>
</div>
<div class="subNav">
<ul class="navList">
<li>Prev&nbsp;Class</li>
<li><a href="../../def/configuration/AppSample.html" title="class in def.configuration"><span class="typeNameLink">Next&nbsp;Class</span></a></li>
</ul>
<ul class="navList">
<li><a href="../../index.html?def/configuration/App.html" target="_top">Frames</a></li>
<li><a href="App.html" target="_top">No&nbsp;Frames</a></li>
</ul>
<ul class="navList" id="allclasses_navbar_bottom">
<li><a href="../../allclasses-noframe.html">All&nbsp;Classes</a></li>
</ul>
<div>
<script type="text/javascript"><!--
  allClassesLink = document.getElementById("allclasses_navbar_bottom");
  if(window==top) {
    allClassesLink.style.display = "block";
  }
  else {
    allClassesLink.style.display = "none";
  }
  //-->
</script>
<noscript>
<div>JavaScript is disabled on your browser.</div>
</noscript>
</div>
<div>
<ul class="subNavList">
<li>Summary:&nbsp;</li>
<li>Nested&nbsp;|&nbsp;</li>
<li>Field&nbsp;|&nbsp;</li>
<li><a href="#constructor.summary">Constr</a>&nbsp;|&nbsp;</li>
<li><a href="#method.summary">Method</a></li>
</ul>
<ul class="subNavList">
<li>Detail:&nbsp;</li>
<li>Field&nbsp;|&nbsp;</li>
<li><a href="#constructor.detail">Constr</a>&nbsp;|&nbsp;</li>
<li><a href="#method.detail">Method</a></li>
</ul>
</div>
<a name="skip.navbar.bottom">
<!--   -->
</a></div>
<!-- ======== END OF BOTTOM NAVBAR ======= -->
</body>
</html>


Stack Trace:
junit.framework.AssertionFailedError: 
<!DOCTYPE HTML PUBLIC "-//W3C//DTD HTML 4.01 Transitional//EN" "http://www.w3.org/TR/html4/loose.dtd">
<!-- NewPage -->
<html lang="en">
<head>
<!-- Generated by javadoc (9.0.1) on Fri Sep 14 04:27:28 UTC 2018 -->
<title>App (Maven Javadoc Plugin Default configuration Test 1.0-SNAPSHOT API)</title>
<meta http-equiv="Content-Type" content="text/html; charset=UTF-8">
<meta name="date" content="2018-09-14">
<link rel="stylesheet" type="text/css" href="../../stylesheet.css" title="Style">
<link rel="stylesheet" type="text/css" href="../../jquery/jquery-ui.css" title="Style">
<script type="text/javascript" src="../../script.js"></script>
<script type="text/javascript" src="../../jquery/jszip/dist/jszip.min.js"></script>
<script type="text/javascript" src="../../jquery/jszip-utils/dist/jszip-utils.min.js"></script>
<!--[if IE]>
<script type="text/javascript" src="../../jquery/jszip-utils/dist/jszip-utils-ie.min.js"></script>
<![endif]-->
<script type="text/javascript" src="../../jquery/jquery-1.10.2.js"></script>
<script type="text/javascript" src="../../jquery/jquery-ui.js"></script>
</head>
<body>
<script type="text/javascript"><!--
    try {
        if (location.href.indexOf('is-external=true') == -1) {
            parent.document.title="App (Maven Javadoc Plugin Default configuration Test 1.0-SNAPSHOT API)";
        }
    }
    catch(err) {
    }
//-->
var methods = {"i0":9,"i1":10};
var tabs = {65535:["t0","All Methods"],1:["t1","Static Methods"],2:["t2","Instance Methods"],8:["t4","Concrete Methods"]};
var altColor = "altColor";
var rowColor = "rowColor";
var tableTab = "tableTab";
var activeTableTab = "activeTableTab";
var pathtoroot = "../../";loadScripts(document, 'script');</script>
<noscript>
<div>JavaScript is disabled on your browser.</div>
</noscript>
<div class="fixedNav">
<!-- ========= START OF TOP NAVBAR ======= -->
<div class="topNav"><a name="navbar.top">
<!--   -->
</a>
<div class="skipNav"><a href="#skip.navbar.top" title="Skip navigation links">Skip navigation links</a></div>
<a name="navbar.top.firstrow">
<!--   -->
</a>
<ul class="navList" title="Navigation">
<li><a href="../../def/configuration/package-summary.html">Package</a></li>
<li class="navBarCell1Rev">Class</li>
<li><a href="class-use/App.html">Use</a></li>
<li><a href="package-tree.html">Tree</a></li>
<li><a href="../../deprecated-list.html">Deprecated</a></li>
<li><a href="../../index-all.html">Index</a></li>
<li><a href="../../help-doc.html">Help</a></li>
</ul>
</div>
<div class="subNav">
<ul class="navList">
<li>Prev&nbsp;Class</li>
<li><a href="../../def/configuration/AppSample.html" title="class in def.configuration"><span class="typeNameLink">Next&nbsp;Class</span></a></li>
</ul>
<ul class="navList">
<li><a href="../../index.html?def/configuration/App.html" target="_top">Frames</a></li>
<li><a href="App.html" target="_top">No&nbsp;Frames</a></li>
</ul>
<ul class="navList" id="allclasses_navbar_top">
<li><a href="../../allclasses-noframe.html">All&nbsp;Classes</a></li>
</ul>
<ul class="navListSearch">
<li><span>SEARCH:&nbsp;</span>
<input type="text" id="search" value=" " disabled="disabled">
<input type="reset" id="reset" value=" " disabled="disabled">
</li>
</ul>
<div>
<script type="text/javascript"><!--
  allClassesLink = document.getElementById("allclasses_navbar_top");
  if(window==top) {
    allClassesLink.style.display = "block";
  }
  else {
    allClassesLink.style.display = "none";
  }
  //-->
</script>
<noscript>
<div>JavaScript is disabled on your browser.</div>
</noscript>
</div>
<div>
<ul class="subNavList">
<li>Summary:&nbsp;</li>
<li>Nested&nbsp;|&nbsp;</li>
<li>Field&nbsp;|&nbsp;</li>
<li><a href="#constructor.summary">Constr</a>&nbsp;|&nbsp;</li>
<li><a href="#method.summary">Method</a></li>
</ul>
<ul class="subNavList">
<li>Detail:&nbsp;</li>
<li>Field&nbsp;|&nbsp;</li>
<li><a href="#constructor.detail">Constr</a>&nbsp;|&nbsp;</li>
<li><a href="#method.detail">Method</a></li>
</ul>
</div>
<a name="skip.navbar.top">
<!--   -->
</a></div>
<!-- ========= END OF TOP NAVBAR ========= -->
</div>
<div class="navPadding">&nbsp;</div>
<script type="text/javascript"><!--
$('.navPadding').css('padding-top', $('.fixedNav').css("height"));
//-->
</script>
<!-- ======== START OF CLASS DATA ======== -->
<div class="header">
<div class="subTitle"><span class="packageLabelInType">Package</span>&nbsp;<a href="../../def/configuration/package-summary.html">def.configuration</a></div>
<h2 title="Class App" class="title">Class App</h2>
</div>
<div class="contentContainer">
<ul class="inheritance">
<li>java.lang.Object</li>
<li>
<ul class="inheritance">
<li>def.configuration.App</li>
</ul>
</li>
</ul>
<div class="description">
<ul class="blockList">
<li class="blockList">
<hr>
<br>
<pre>public class <span class="typeNameLabel">App</span>
extends java.lang.Object</pre>
</li>
</ul>
</div>
<div class="summary">
<ul class="blockList">
<li class="blockList">
<!-- ======== CONSTRUCTOR SUMMARY ======== -->
<ul class="blockList">
<li class="blockList"><a name="constructor.summary">
<!--   -->
</a>
<h3>Constructor Summary</h3>
<table class="memberSummary" summary="Constructor Summary table, listing constructors, and an explanation">
<caption><span>Constructors</span><span class="tabEnd">&nbsp;</span></caption>
<tr>
<th class="colFirst" scope="col">Constructor</th>
<th class="colLast" scope="col">Description</th>
</tr>
<tr class="altColor">
<th class="colConstructorName" scope="row"><code><span class="memberNameLink"><a href="../../def/configuration/App.html#App--">App</a></span>&#8203;()</code></th>
<td class="colLast">&nbsp;</td>
</tr>
</table>
</li>
</ul>
<!-- ========== METHOD SUMMARY =========== -->
<ul class="blockList">
<li class="blockList"><a name="method.summary">
<!--   -->
</a>
<h3>Method Summary</h3>
<table class="memberSummary" summary="Method Summary table, listing methods, and an explanation">
<caption><span id="t0" class="activeTableTab"><span>All Methods</span><span class="tabEnd">&nbsp;</span></span><span id="t1" class="tableTab"><span><a href="javascript:show(1);">Static Methods</a></span><span class="tabEnd">&nbsp;</span></span><span id="t2" class="tableTab"><span><a href="javascript:show(2);">Instance Methods</a></span><span class="tabEnd">&nbsp;</span></span><span id="t4" class="tableTab"><span><a href="javascript:show(8);">Concrete Methods</a></span><span class="tabEnd">&nbsp;</span></span></caption>
<tr>
<th class="colFirst" scope="col">Modifier and Type</th>
<th class="colSecond" scope="col">Method</th>
<th class="colLast" scope="col">Description</th>
</tr>
<tr id="i0" class="altColor">
<td class="colFirst"><code>static void</code></td>
<th class="colSecond" scope="row"><code><span class="memberNameLink"><a href="../../def/configuration/App.html#main-java.lang.String:A-">main</a></span>&#8203;(java.lang.String[]&nbsp;args)</code></th>
<td class="colLast">&nbsp;</td>
</tr>
<tr id="i1" class="rowColor">
<td class="colFirst"><code>protected void</code></td>
<th class="colSecond" scope="row"><code><span class="memberNameLink"><a href="../../def/configuration/App.html#sampleMethod-java.lang.String-">sampleMethod</a></span>&#8203;(java.lang.String&nbsp;str)</code></th>
<td class="colLast">&nbsp;</td>
</tr>
</table>
<ul class="blockList">
<li class="blockList"><a name="methods.inherited.from.class.java.lang.Object">
<!--   -->
</a>
<h3>Methods inherited from class&nbsp;java.lang.Object</h3>
<code>clone, equals, finalize, getClass, hashCode, notify, notifyAll, toString, wait, wait, wait</code></li>
</ul>
</li>
</ul>
</li>
</ul>
</div>
<div class="details">
<ul class="blockList">
<li class="blockList">
<!-- ========= CONSTRUCTOR DETAIL ======== -->
<ul class="blockList">
<li class="blockList"><a name="constructor.detail">
<!--   -->
</a>
<h3>Constructor Detail</h3>
<a name="App--">
<!--   -->
</a>
<ul class="blockListLast">
<li class="blockList">
<h4>App</h4>
<pre>public&nbsp;App&#8203;()</pre>
</li>
</ul>
</li>
</ul>
<!-- ============ METHOD DETAIL ========== -->
<ul class="blockList">
<li class="blockList"><a name="method.detail">
<!--   -->
</a>
<h3>Method Detail</h3>
<a name="main-java.lang.String:A-">
<!--   -->
</a>
<ul class="blockList">
<li class="blockList">
<h4>main</h4>
<pre>public static&nbsp;void&nbsp;main&#8203;(java.lang.String[]&nbsp;args)</pre>
</li>
</ul>
<a name="sampleMethod-java.lang.String-">
<!--   -->
</a>
<ul class="blockListLast">
<li class="blockList">
<h4>sampleMethod</h4>
<pre>protected&nbsp;void&nbsp;sampleMethod&#8203;(java.lang.String&nbsp;str)</pre>
</li>
</ul>
</li>
</ul>
</li>
</ul>
</div>
</div>
<!-- ========= END OF CLASS DATA ========= -->
<!-- ======= START OF BOTTOM NAVBAR ====== -->
<div class="bottomNav"><a name="navbar.bottom">
<!--   -->
</a>
<div class="skipNav"><a href="#skip.navbar.bottom" title="Skip navigation links">Skip navigation links</a></div>
<a name="navbar.bottom.firstrow">
<!--   -->
</a>
<ul class="navList" title="Navigation">
<li><a href="../../def/configuration/package-summary.html">Package</a></li>
<li class="navBarCell1Rev">Class</li>
<li><a href="class-use/App.html">Use</a></li>
<li><a href="package-tree.html">Tree</a></li>
<li><a href="../../deprecated-list.html">Deprecated</a></li>
<li><a href="../../index-all.html">Index</a></li>
<li><a href="../../help-doc.html">Help</a></li>
</ul>
</div>
<div class="subNav">
<ul class="navList">
<li>Prev&nbsp;Class</li>
<li><a href="../../def/configuration/AppSample.html" title="class in def.configuration"><span class="typeNameLink">Next&nbsp;Class</span></a></li>
</ul>
<ul class="navList">
<li><a href="../../index.html?def/configuration/App.html" target="_top">Frames</a></li>
<li><a href="App.html" target="_top">No&nbsp;Frames</a></li>
</ul>
<ul class="navList" id="allclasses_navbar_bottom">
<li><a href="../../allclasses-noframe.html">All&nbsp;Classes</a></li>
</ul>
<div>
<script type="text/javascript"><!--
  allClassesLink = document.getElementById("allclasses_navbar_bottom");
  if(window==top) {
    allClassesLink.style.display = "block";
  }
  else {
    allClassesLink.style.display = "none";
  }
  //-->
</script>
<noscript>
<div>JavaScript is disabled on your browser.</div>
</noscript>
</div>
<div>
<ul class="subNavList">
<li>Summary:&nbsp;</li>
<li>Nested&nbsp;|&nbsp;</li>
<li>Field&nbsp;|&nbsp;</li>
<li><a href="#constructor.summary">Constr</a>&nbsp;|&nbsp;</li>
<li><a href="#method.summary">Method</a></li>
</ul>
<ul class="subNavList">
<li>Detail:&nbsp;</li>
<li>Field&nbsp;|&nbsp;</li>
<li><a href="#constructor.detail">Constr</a>&nbsp;|&nbsp;</li>
<li><a href="#method.detail">Method</a></li>
</ul>
</div>
<a name="skip.navbar.bottom">
<!--   -->
</a></div>
<!-- ======== END OF BOTTOM NAVBAR ======= -->
</body>
</html>

	at org.apache.maven.plugins.javadoc.JavadocReportTest.testDefaultConfiguration(JavadocReportTest.java:240)


FAILED:  org.apache.maven.plugins.javadoc.JavadocReportTest.testDefaultConfiguration

Error Message:
<!DOCTYPE HTML PUBLIC "-//W3C//DTD HTML 4.01 Transitional//EN" "http://www.w3.org/TR/html4/loose.dtd">
<!-- NewPage -->
<html lang="en">
<head>
<!-- Generated by javadoc (10) on Thu Sep 13 21:28:38 PDT 2018 -->
<title>App (Maven Javadoc Plugin Default configuration Test 1.0-SNAPSHOT API)</title>
<meta http-equiv="Content-Type" content="text/html; charset=UTF-8">
<meta name="date" content="2018-09-13">
<link rel="stylesheet" type="text/css" href="../../stylesheet.css" title="Style">
<link rel="stylesheet" type="text/css" href="../../jquery/jquery-ui.css" title="Style">
<script type="text/javascript" src="../../script.js"></script>
<script type="text/javascript" src="../../jquery/jszip/dist/jszip.min.js"></script>
<script type="text/javascript" src="../../jquery/jszip-utils/dist/jszip-utils.min.js"></script>
<!--[if IE]>
<script type="text/javascript" src="../../jquery/jszip-utils/dist/jszip-utils-ie.min.js"></script>
<![endif]-->
<script type="text/javascript" src="../../jquery/jquery-1.10.2.js"></script>
<script type="text/javascript" src="../../jquery/jquery-ui.js"></script>
</head>
<body>
<script type="text/javascript"><!--
    try {
        if (location.href.indexOf('is-external=true') == -1) {
            parent.document.title="App (Maven Javadoc Plugin Default configuration Test 1.0-SNAPSHOT API)";
        }
    }
    catch(err) {
    }
//-->
var methods = {"i0":9,"i1":10};
var tabs = {65535:["t0","All Methods"],1:["t1","Static Methods"],2:["t2","Instance Methods"],8:["t4","Concrete Methods"]};
var altColor = "altColor";
var rowColor = "rowColor";
var tableTab = "tableTab";
var activeTableTab = "activeTableTab";
var pathtoroot = "../../";loadScripts(document, 'script');</script>
<noscript>
<div>JavaScript is disabled on your browser.</div>
</noscript>
<div class="fixedNav">
<!-- ========= START OF TOP NAVBAR ======= -->
<div class="topNav"><a name="navbar.top">
<!--   -->
</a>
<div class="skipNav"><a href="#skip.navbar.top" title="Skip navigation links">Skip navigation links</a></div>
<a name="navbar.top.firstrow">
<!--   -->
</a>
<ul class="navList" title="Navigation">
<li><a href="../../def/configuration/package-summary.html">Package</a></li>
<li class="navBarCell1Rev">Class</li>
<li><a href="class-use/App.html">Use</a></li>
<li><a href="package-tree.html">Tree</a></li>
<li><a href="../../deprecated-list.html">Deprecated</a></li>
<li><a href="../../index-all.html">Index</a></li>
<li><a href="../../help-doc.html">Help</a></li>
</ul>
</div>
<div class="subNav">
<ul class="navList">
<li>Prev&nbsp;Class</li>
<li><a href="../../def/configuration/AppSample.html" title="class in def.configuration"><span class="typeNameLink">Next&nbsp;Class</span></a></li>
</ul>
<ul class="navList">
<li><a href="../../index.html?def/configuration/App.html" target="_top">Frames</a></li>
<li><a href="App.html" target="_top">No&nbsp;Frames</a></li>
</ul>
<ul class="navList" id="allclasses_navbar_top">
<li><a href="../../allclasses-noframe.html">All&nbsp;Classes</a></li>
</ul>
<ul class="navListSearch">
<li><label for="search">SEARCH:</label>
<input type="text" id="search" value="search" disabled="disabled">
<input type="reset" id="reset" value="reset" disabled="disabled">
</li>
</ul>
<div>
<script type="text/javascript"><!--
  allClassesLink = document.getElementById("allclasses_navbar_top");
  if(window==top) {
    allClassesLink.style.display = "block";
  }
  else {
    allClassesLink.style.display = "none";
  }
  //-->
</script>
<noscript>
<div>JavaScript is disabled on your browser.</div>
</noscript>
</div>
<div>
<ul class="subNavList">
<li>Summary:&nbsp;</li>
<li>Nested&nbsp;|&nbsp;</li>
<li>Field&nbsp;|&nbsp;</li>
<li><a href="#constructor.summary">Constr</a>&nbsp;|&nbsp;</li>
<li><a href="#method.summary">Method</a></li>
</ul>
<ul class="subNavList">
<li>Detail:&nbsp;</li>
<li>Field&nbsp;|&nbsp;</li>
<li><a href="#constructor.detail">Constr</a>&nbsp;|&nbsp;</li>
<li><a href="#method.detail">Method</a></li>
</ul>
</div>
<a name="skip.navbar.top">
<!--   -->
</a></div>
<!-- ========= END OF TOP NAVBAR ========= -->
</div>
<div class="navPadding">&nbsp;</div>
<script type="text/javascript"><!--
$('.navPadding').css('padding-top', $('.fixedNav').css("height"));
//-->
</script>
<!-- ======== START OF CLASS DATA ======== -->
<div class="header">
<div class="subTitle"><span class="packageLabelInType">Package</span>&nbsp;<a href="../../def/configuration/package-summary.html">def.configuration</a></div>
<h2 title="Class App" class="title">Class App</h2>
</div>
<div class="contentContainer">
<ul class="inheritance">
<li>java.lang.Object</li>
<li>
<ul class="inheritance">
<li>def.configuration.App</li>
</ul>
</li>
</ul>
<div class="description">
<ul class="blockList">
<li class="blockList">
<hr>
<pre>public class <span class="typeNameLabel">App</span>
extends java.lang.Object</pre>
</li>
</ul>
</div>
<div class="summary">
<ul class="blockList">
<li class="blockList">
<!-- ======== CONSTRUCTOR SUMMARY ======== -->
<ul class="blockList">
<li class="blockList"><a name="constructor.summary">
<!--   -->
</a>
<h3>Constructor Summary</h3>
<table class="memberSummary" summary="Constructor Summary table, listing constructors, and an explanation">
<caption><span>Constructors</span><span class="tabEnd">&nbsp;</span></caption>
<tr>
<th class="colFirst" scope="col">Constructor</th>
<th class="colLast" scope="col">Description</th>
</tr>
<tr class="altColor">
<th class="colConstructorName" scope="row"><code><span class="memberNameLink"><a href="../../def/configuration/App.html#App--">App</a></span>()</code></th>
<td class="colLast">&nbsp;</td>
</tr>
</table>
</li>
</ul>
<!-- ========== METHOD SUMMARY =========== -->
<ul class="blockList">
<li class="blockList"><a name="method.summary">
<!--   -->
</a>
<h3>Method Summary</h3>
<table class="memberSummary" summary="Method Summary table, listing methods, and an explanation">
<caption><span id="t0" class="activeTableTab"><span>All Methods</span><span class="tabEnd">&nbsp;</span></span><span id="t1" class="tableTab"><span><a href="javascript:show(1);">Static Methods</a></span><span class="tabEnd">&nbsp;</span></span><span id="t2" class="tableTab"><span><a href="javascript:show(2);">Instance Methods</a></span><span class="tabEnd">&nbsp;</span></span><span id="t4" class="tableTab"><span><a href="javascript:show(8);">Concrete Methods</a></span><span class="tabEnd">&nbsp;</span></span></caption>
<tr>
<th class="colFirst" scope="col">Modifier and Type</th>
<th class="colSecond" scope="col">Method</th>
<th class="colLast" scope="col">Description</th>
</tr>
<tr id="i0" class="altColor">
<td class="colFirst"><code>static void</code></td>
<th class="colSecond" scope="row"><code><span class="memberNameLink"><a href="../../def/configuration/App.html#main-java.lang.String:A-">main</a></span>&#8203;(java.lang.String[]&nbsp;args)</code></th>
<td class="colLast">&nbsp;</td>
</tr>
<tr id="i1" class="rowColor">
<td class="colFirst"><code>protected void</code></td>
<th class="colSecond" scope="row"><code><span class="memberNameLink"><a href="../../def/configuration/App.html#sampleMethod-java.lang.String-">sampleMethod</a></span>&#8203;(java.lang.String&nbsp;str)</code></th>
<td class="colLast">&nbsp;</td>
</tr>
</table>
<ul class="blockList">
<li class="blockList"><a name="methods.inherited.from.class.java.lang.Object">
<!--   -->
</a>
<h3>Methods inherited from class&nbsp;java.lang.Object</h3>
<code>clone, equals, finalize, getClass, hashCode, notify, notifyAll, toString, wait, wait, wait</code></li>
</ul>
</li>
</ul>
</li>
</ul>
</div>
<div class="details">
<ul class="blockList">
<li class="blockList">
<!-- ========= CONSTRUCTOR DETAIL ======== -->
<ul class="blockList">
<li class="blockList"><a name="constructor.detail">
<!--   -->
</a>
<h3>Constructor Detail</h3>
<a name="App--">
<!--   -->
</a>
<ul class="blockListLast">
<li class="blockList">
<h4>App</h4>
<pre>public&nbsp;App()</pre>
</li>
</ul>
</li>
</ul>
<!-- ============ METHOD DETAIL ========== -->
<ul class="blockList">
<li class="blockList"><a name="method.detail">
<!--   -->
</a>
<h3>Method Detail</h3>
<a name="main-java.lang.String:A-">
<!--   -->
</a>
<ul class="blockList">
<li class="blockList">
<h4>main</h4>
<pre>public static&nbsp;void&nbsp;main&#8203;(java.lang.String[]&nbsp;args)</pre>
</li>
</ul>
<a name="sampleMethod-java.lang.String-">
<!--   -->
</a>
<ul class="blockListLast">
<li class="blockList">
<h4>sampleMethod</h4>
<pre>protected&nbsp;void&nbsp;sampleMethod&#8203;(java.lang.String&nbsp;str)</pre>
</li>
</ul>
</li>
</ul>
</li>
</ul>
</div>
</div>
<!-- ========= END OF CLASS DATA ========= -->
<!-- ======= START OF BOTTOM NAVBAR ====== -->
<div class="bottomNav"><a name="navbar.bottom">
<!--   -->
</a>
<div class="skipNav"><a href="#skip.navbar.bottom" title="Skip navigation links">Skip navigation links</a></div>
<a name="navbar.bottom.firstrow">
<!--   -->
</a>
<ul class="navList" title="Navigation">
<li><a href="../../def/configuration/package-summary.html">Package</a></li>
<li class="navBarCell1Rev">Class</li>
<li><a href="class-use/App.html">Use</a></li>
<li><a href="package-tree.html">Tree</a></li>
<li><a href="../../deprecated-list.html">Deprecated</a></li>
<li><a href="../../index-all.html">Index</a></li>
<li><a href="../../help-doc.html">Help</a></li>
</ul>
</div>
<div class="subNav">
<ul class="navList">
<li>Prev&nbsp;Class</li>
<li><a href="../../def/configuration/AppSample.html" title="class in def.configuration"><span class="typeNameLink">Next&nbsp;Class</span></a></li>
</ul>
<ul class="navList">
<li><a href="../../index.html?def/configuration/App.html" target="_top">Frames</a></li>
<li><a href="App.html" target="_top">No&nbsp;Frames</a></li>
</ul>
<ul class="navList" id="allclasses_navbar_bottom">
<li><a href="../../allclasses-noframe.html">All&nbsp;Classes</a></li>
</ul>
<div>
<script type="text/javascript"><!--
  allClassesLink = document.getElementById("allclasses_navbar_bottom");
  if(window==top) {
    allClassesLink.style.display = "block";
  }
  else {
    allClassesLink.style.display = "none";
  }
  //-->
</script>
<noscript>
<div>JavaScript is disabled on your browser.</div>
</noscript>
</div>
<div>
<ul class="subNavList">
<li>Summary:&nbsp;</li>
<li>Nested&nbsp;|&nbsp;</li>
<li>Field&nbsp;|&nbsp;</li>
<li><a href="#constructor.summary">Constr</a>&nbsp;|&nbsp;</li>
<li><a href="#method.summary">Method</a></li>
</ul>
<ul class="subNavList">
<li>Detail:&nbsp;</li>
<li>Field&nbsp;|&nbsp;</li>
<li><a href="#constructor.detail">Constr</a>&nbsp;|&nbsp;</li>
<li><a href="#method.detail">Method</a></li>
</ul>
</div>
<a name="skip.navbar.bottom">
<!--   -->
</a></div>
<!-- ======== END OF BOTTOM NAVBAR ======= -->
</body>
</html>


Stack Trace:
junit.framework.AssertionFailedError: 
<!DOCTYPE HTML PUBLIC "-//W3C//DTD HTML 4.01 Transitional//EN" "http://www.w3.org/TR/html4/loose.dtd">
<!-- NewPage -->
<html lang="en">
<head>
<!-- Generated by javadoc (10) on Thu Sep 13 21:28:38 PDT 2018 -->
<title>App (Maven Javadoc Plugin Default configuration Test 1.0-SNAPSHOT API)</title>
<meta http-equiv="Content-Type" content="text/html; charset=UTF-8">
<meta name="date" content="2018-09-13">
<link rel="stylesheet" type="text/css" href="../../stylesheet.css" title="Style">
<link rel="stylesheet" type="text/css" href="../../jquery/jquery-ui.css" title="Style">
<script type="text/javascript" src="../../script.js"></script>
<script type="text/javascript" src="../../jquery/jszip/dist/jszip.min.js"></script>
<script type="text/javascript" src="../../jquery/jszip-utils/dist/jszip-utils.min.js"></script>
<!--[if IE]>
<script type="text/javascript" src="../../jquery/jszip-utils/dist/jszip-utils-ie.min.js"></script>
<![endif]-->
<script type="text/javascript" src="../../jquery/jquery-1.10.2.js"></script>
<script type="text/javascript" src="../../jquery/jquery-ui.js"></script>
</head>
<body>
<script type="text/javascript"><!--
    try {
        if (location.href.indexOf('is-external=true') == -1) {
            parent.document.title="App (Maven Javadoc Plugin Default configuration Test 1.0-SNAPSHOT API)";
        }
    }
    catch(err) {
    }
//-->
var methods = {"i0":9,"i1":10};
var tabs = {65535:["t0","All Methods"],1:["t1","Static Methods"],2:["t2","Instance Methods"],8:["t4","Concrete Methods"]};
var altColor = "altColor";
var rowColor = "rowColor";
var tableTab = "tableTab";
var activeTableTab = "activeTableTab";
var pathtoroot = "../../";loadScripts(document, 'script');</script>
<noscript>
<div>JavaScript is disabled on your browser.</div>
</noscript>
<div class="fixedNav">
<!-- ========= START OF TOP NAVBAR ======= -->
<div class="topNav"><a name="navbar.top">
<!--   -->
</a>
<div class="skipNav"><a href="#skip.navbar.top" title="Skip navigation links">Skip navigation links</a></div>
<a name="navbar.top.firstrow">
<!--   -->
</a>
<ul class="navList" title="Navigation">
<li><a href="../../def/configuration/package-summary.html">Package</a></li>
<li class="navBarCell1Rev">Class</li>
<li><a href="class-use/App.html">Use</a></li>
<li><a href="package-tree.html">Tree</a></li>
<li><a href="../../deprecated-list.html">Deprecated</a></li>
<li><a href="../../index-all.html">Index</a></li>
<li><a href="../../help-doc.html">Help</a></li>
</ul>
</div>
<div class="subNav">
<ul class="navList">
<li>Prev&nbsp;Class</li>
<li><a href="../../def/configuration/AppSample.html" title="class in def.configuration"><span class="typeNameLink">Next&nbsp;Class</span></a></li>
</ul>
<ul class="navList">
<li><a href="../../index.html?def/configuration/App.html" target="_top">Frames</a></li>
<li><a href="App.html" target="_top">No&nbsp;Frames</a></li>
</ul>
<ul class="navList" id="allclasses_navbar_top">
<li><a href="../../allclasses-noframe.html">All&nbsp;Classes</a></li>
</ul>
<ul class="navListSearch">
<li><label for="search">SEARCH:</label>
<input type="text" id="search" value="search" disabled="disabled">
<input type="reset" id="reset" value="reset" disabled="disabled">
</li>
</ul>
<div>
<script type="text/javascript"><!--
  allClassesLink = document.getElementById("allclasses_navbar_top");
  if(window==top) {
    allClassesLink.style.display = "block";
  }
  else {
    allClassesLink.style.display = "none";
  }
  //-->
</script>
<noscript>
<div>JavaScript is disabled on your browser.</div>
</noscript>
</div>
<div>
<ul class="subNavList">
<li>Summary:&nbsp;</li>
<li>Nested&nbsp;|&nbsp;</li>
<li>Field&nbsp;|&nbsp;</li>
<li><a href="#constructor.summary">Constr</a>&nbsp;|&nbsp;</li>
<li><a href="#method.summary">Method</a></li>
</ul>
<ul class="subNavList">
<li>Detail:&nbsp;</li>
<li>Field&nbsp;|&nbsp;</li>
<li><a href="#constructor.detail">Constr</a>&nbsp;|&nbsp;</li>
<li><a href="#method.detail">Method</a></li>
</ul>
</div>
<a name="skip.navbar.top">
<!--   -->
</a></div>
<!-- ========= END OF TOP NAVBAR ========= -->
</div>
<div class="navPadding">&nbsp;</div>
<script type="text/javascript"><!--
$('.navPadding').css('padding-top', $('.fixedNav').css("height"));
//-->
</script>
<!-- ======== START OF CLASS DATA ======== -->
<div class="header">
<div class="subTitle"><span class="packageLabelInType">Package</span>&nbsp;<a href="../../def/configuration/package-summary.html">def.configuration</a></div>
<h2 title="Class App" class="title">Class App</h2>
</div>
<div class="contentContainer">
<ul class="inheritance">
<li>java.lang.Object</li>
<li>
<ul class="inheritance">
<li>def.configuration.App</li>
</ul>
</li>
</ul>
<div class="description">
<ul class="blockList">
<li class="blockList">
<hr>
<pre>public class <span class="typeNameLabel">App</span>
extends java.lang.Object</pre>
</li>
</ul>
</div>
<div class="summary">
<ul class="blockList">
<li class="blockList">
<!-- ======== CONSTRUCTOR SUMMARY ======== -->
<ul class="blockList">
<li class="blockList"><a name="constructor.summary">
<!--   -->
</a>
<h3>Constructor Summary</h3>
<table class="memberSummary" summary="Constructor Summary table, listing constructors, and an explanation">
<caption><span>Constructors</span><span class="tabEnd">&nbsp;</span></caption>
<tr>
<th class="colFirst" scope="col">Constructor</th>
<th class="colLast" scope="col">Description</th>
</tr>
<tr class="altColor">
<th class="colConstructorName" scope="row"><code><span class="memberNameLink"><a href="../../def/configuration/App.html#App--">App</a></span>()</code></th>
<td class="colLast">&nbsp;</td>
</tr>
</table>
</li>
</ul>
<!-- ========== METHOD SUMMARY =========== -->
<ul class="blockList">
<li class="blockList"><a name="method.summary">
<!--   -->
</a>
<h3>Method Summary</h3>
<table class="memberSummary" summary="Method Summary table, listing methods, and an explanation">
<caption><span id="t0" class="activeTableTab"><span>All Methods</span><span class="tabEnd">&nbsp;</span></span><span id="t1" class="tableTab"><span><a href="javascript:show(1);">Static Methods</a></span><span class="tabEnd">&nbsp;</span></span><span id="t2" class="tableTab"><span><a href="javascript:show(2);">Instance Methods</a></span><span class="tabEnd">&nbsp;</span></span><span id="t4" class="tableTab"><span><a href="javascript:show(8);">Concrete Methods</a></span><span class="tabEnd">&nbsp;</span></span></caption>
<tr>
<th class="colFirst" scope="col">Modifier and Type</th>
<th class="colSecond" scope="col">Method</th>
<th class="colLast" scope="col">Description</th>
</tr>
<tr id="i0" class="altColor">
<td class="colFirst"><code>static void</code></td>
<th class="colSecond" scope="row"><code><span class="memberNameLink"><a href="../../def/configuration/App.html#main-java.lang.String:A-">main</a></span>&#8203;(java.lang.String[]&nbsp;args)</code></th>
<td class="colLast">&nbsp;</td>
</tr>
<tr id="i1" class="rowColor">
<td class="colFirst"><code>protected void</code></td>
<th class="colSecond" scope="row"><code><span class="memberNameLink"><a href="../../def/configuration/App.html#sampleMethod-java.lang.String-">sampleMethod</a></span>&#8203;(java.lang.String&nbsp;str)</code></th>
<td class="colLast">&nbsp;</td>
</tr>
</table>
<ul class="blockList">
<li class="blockList"><a name="methods.inherited.from.class.java.lang.Object">
<!--   -->
</a>
<h3>Methods inherited from class&nbsp;java.lang.Object</h3>
<code>clone, equals, finalize, getClass, hashCode, notify, notifyAll, toString, wait, wait, wait</code></li>
</ul>
</li>
</ul>
</li>
</ul>
</div>
<div class="details">
<ul class="blockList">
<li class="blockList">
<!-- ========= CONSTRUCTOR DETAIL ======== -->
<ul class="blockList">
<li class="blockList"><a name="constructor.detail">
<!--   -->
</a>
<h3>Constructor Detail</h3>
<a name="App--">
<!--   -->
</a>
<ul class="blockListLast">
<li class="blockList">
<h4>App</h4>
<pre>public&nbsp;App()</pre>
</li>
</ul>
</li>
</ul>
<!-- ============ METHOD DETAIL ========== -->
<ul class="blockList">
<li class="blockList"><a name="method.detail">
<!--   -->
</a>
<h3>Method Detail</h3>
<a name="main-java.lang.String:A-">
<!--   -->
</a>
<ul class="blockList">
<li class="blockList">
<h4>main</h4>
<pre>public static&nbsp;void&nbsp;main&#8203;(java.lang.String[]&nbsp;args)</pre>
</li>
</ul>
<a name="sampleMethod-java.lang.String-">
<!--   -->
</a>
<ul class="blockListLast">
<li class="blockList">
<h4>sampleMethod</h4>
<pre>protected&nbsp;void&nbsp;sampleMethod&#8203;(java.lang.String&nbsp;str)</pre>
</li>
</ul>
</li>
</ul>
</li>
</ul>
</div>
</div>
<!-- ========= END OF CLASS DATA ========= -->
<!-- ======= START OF BOTTOM NAVBAR ====== -->
<div class="bottomNav"><a name="navbar.bottom">
<!--   -->
</a>
<div class="skipNav"><a href="#skip.navbar.bottom" title="Skip navigation links">Skip navigation links</a></div>
<a name="navbar.bottom.firstrow">
<!--   -->
</a>
<ul class="navList" title="Navigation">
<li><a href="../../def/configuration/package-summary.html">Package</a></li>
<li class="navBarCell1Rev">Class</li>
<li><a href="class-use/App.html">Use</a></li>
<li><a href="package-tree.html">Tree</a></li>
<li><a href="../../deprecated-list.html">Deprecated</a></li>
<li><a href="../../index-all.html">Index</a></li>
<li><a href="../../help-doc.html">Help</a></li>
</ul>
</div>
<div class="subNav">
<ul class="navList">
<li>Prev&nbsp;Class</li>
<li><a href="../../def/configuration/AppSample.html" title="class in def.configuration"><span class="typeNameLink">Next&nbsp;Class</span></a></li>
</ul>
<ul class="navList">
<li><a href="../../index.html?def/configuration/App.html" target="_top">Frames</a></li>
<li><a href="App.html" target="_top">No&nbsp;Frames</a></li>
</ul>
<ul class="navList" id="allclasses_navbar_bottom">
<li><a href="../../allclasses-noframe.html">All&nbsp;Classes</a></li>
</ul>
<div>
<script type="text/javascript"><!--
  allClassesLink = document.getElementById("allclasses_navbar_bottom");
  if(window==top) {
    allClassesLink.style.display = "block";
  }
  else {
    allClassesLink.style.display = "none";
  }
  //-->
</script>
<noscript>
<div>JavaScript is disabled on your browser.</div>
</noscript>
</div>
<div>
<ul class="subNavList">
<li>Summary:&nbsp;</li>
<li>Nested&nbsp;|&nbsp;</li>
<li>Field&nbsp;|&nbsp;</li>
<li><a href="#constructor.summary">Constr</a>&nbsp;|&nbsp;</li>
<li><a href="#method.summary">Method</a></li>
</ul>
<ul class="subNavList">
<li>Detail:&nbsp;</li>
<li>Field&nbsp;|&nbsp;</li>
<li><a href="#constructor.detail">Constr</a>&nbsp;|&nbsp;</li>
<li><a href="#method.detail">Method</a></li>
</ul>
</div>
<a name="skip.navbar.bottom">
<!--   -->
</a></div>
<!-- ======== END OF BOTTOM NAVBAR ======= -->
</body>
</html>

	at org.apache.maven.plugins.javadoc.JavadocReportTest.testDefaultConfiguration(JavadocReportTest.java:240)




Build log:
[...truncated 1.83 MB...]
[windows-jdk8] [INFO] Downloaded from central: https://repo.maven.apache.org/maven2/org/antlr/antlr4-runtime/4.3/antlr4-runtime-4.3.pom (4.8 kB at 266 kB/s)
[windows-jdk8] [INFO] Downloading from central: https://repo.maven.apache.org/maven2/org/antlr/antlr4-master/4.3/antlr4-master-4.3.pom
[windows-jdk8] [INFO] Downloaded from central: https://repo.maven.apache.org/maven2/org/antlr/antlr4-master/4.3/antlr4-master-4.3.pom (7.9 kB at 377 kB/s)
[windows-jdk8] [INFO] Downloading from central: https://repo.maven.apache.org/maven2/org/abego/treelayout/org.abego.treelayout.core/1.0.1/org.abego.treelayout.core-1.0.1.pom
[windows-jdk8] [INFO] Downloaded from central: https://repo.maven.apache.org/maven2/org/abego/treelayout/org.abego.treelayout.core/1.0.1/org.abego.treelayout.core-1.0.1.pom (3.1 kB at 148 kB/s)
[windows-jdk8] [INFO] Downloading from central: https://repo.maven.apache.org/maven2/org/antlr/antlr4-annotations/4.3/antlr4-annotations-4.3.pom
[windows-jdk8] [INFO] Downloaded from central: https://repo.maven.apache.org/maven2/org/antlr/antlr4-annotations/4.3/antlr4-annotations-4.3.pom (1.3 kB at 75 kB/s)
[windows-jdk8] [INFO] Downloading from central: https://repo.maven.apache.org/maven2/commons-beanutils/commons-beanutils-core/1.8.3/commons-beanutils-core-1.8.3.pom
[windows-jdk8] [INFO] Downloaded from central: https://repo.maven.apache.org/maven2/commons-beanutils/commons-beanutils-core/1.8.3/commons-beanutils-core-1.8.3.pom (1.6 kB at 102 kB/s)
[windows-jdk8] [INFO] Downloading from central: https://repo.maven.apache.org/maven2/com/google/guava/guava/18.0/guava-18.0.pom
[windows-jdk8] [INFO] Downloaded from central: https://repo.maven.apache.org/maven2/com/google/guava/guava/18.0/guava-18.0.pom (5.7 kB at 298 kB/s)
[windows-jdk8] [INFO] Downloading from central: https://repo.maven.apache.org/maven2/com/google/guava/guava-parent/18.0/guava-parent-18.0.pom
[windows-jdk8] [INFO] Downloaded from central: https://repo.maven.apache.org/maven2/com/google/guava/guava-parent/18.0/guava-parent-18.0.pom (7.7 kB at 384 kB/s)
[windows-jdk8] [INFO] Downloading from central: https://repo.maven.apache.org/maven2/org/apache/maven/shared/maven-shared-resources/2/maven-shared-resources-2.jar
[windows-jdk8] [INFO] Downloading from central: https://repo.maven.apache.org/maven2/org/apache/maven/doxia/doxia-integration-tools/1.6/doxia-integration-tools-1.6.jar
[windows-jdk8] [INFO] Downloading from central: https://repo.maven.apache.org/maven2/org/codehaus/plexus/plexus-resources/1.0.1/plexus-resources-1.0.1.jar
[windows-jdk8] [INFO] Downloading from central: https://repo.maven.apache.org/maven2/org/antlr/antlr4-runtime/4.3/antlr4-runtime-4.3.jar
[windows-jdk8] [INFO] Downloading from central: https://repo.maven.apache.org/maven2/com/puppycrawl/tools/checkstyle/6.1.1/checkstyle-6.1.1.jar
[windows-jdk8] [INFO] Downloaded from central: https://repo.maven.apache.org/maven2/org/antlr/antlr4-runtime/4.3/antlr4-runtime-4.3.jar (345 kB at 4.1 MB/s)
[windows-jdk8] [INFO] Downloading from central: https://repo.maven.apache.org/maven2/org/abego/treelayout/org.abego.treelayout.core/1.0.1/org.abego.treelayout.core-1.0.1.jar
[windows-jdk8] [INFO] Downloaded from central: https://repo.maven.apache.org/maven2/org/apache/maven/shared/maven-shared-resources/2/maven-shared-resources-2.jar (13 kB at 142 kB/s)
[windows-jdk8] [INFO] Downloading from central: https://repo.maven.apache.org/maven2/org/antlr/antlr4-annotations/4.3/antlr4-annotations-4.3.jar
[windows-jdk8] [INFO] Downloaded from central: https://repo.maven.apache.org/maven2/com/puppycrawl/tools/checkstyle/6.1.1/checkstyle-6.1.1.jar (1.0 MB at 10 MB/s)
[windows-jdk8] [INFO] Downloading from central: https://repo.maven.apache.org/maven2/commons-beanutils/commons-beanutils-core/1.8.3/commons-beanutils-core-1.8.3.jar
[windows-jdk8] [INFO] Downloaded from central: https://repo.maven.apache.org/maven2/org/antlr/antlr4-annotations/4.3/antlr4-annotations-4.3.jar (10 kB at 63 kB/s)
[windows-jdk8] [INFO] Downloading from central: https://repo.maven.apache.org/maven2/com/google/guava/guava/18.0/guava-18.0.jar
[windows-jdk8] [INFO] Downloaded from central: https://repo.maven.apache.org/maven2/org/codehaus/plexus/plexus-resources/1.0.1/plexus-resources-1.0.1.jar (22 kB at 130 kB/s)
[windows-jdk8] [INFO] Downloading from central: https://repo.maven.apache.org/maven2/commons-lang/commons-lang/2.1/commons-lang-2.1.jar
[windows-jdk8] [INFO] Downloaded from central: https://repo.maven.apache.org/maven2/commons-beanutils/commons-beanutils-core/1.8.3/commons-beanutils-core-1.8.3.jar (207 kB at 1.1 MB/s)
[windows-jdk8] [INFO] Downloaded from central: https://repo.maven.apache.org/maven2/commons-lang/commons-lang/2.1/commons-lang-2.1.jar (208 kB at 1.0 MB/s)
[windows-jdk8] [INFO] Downloaded from central: https://repo.maven.apache.org/maven2/org/apache/maven/doxia/doxia-integration-tools/1.6/doxia-integration-tools-1.6.jar (45 kB at 192 kB/s)
[windows-jdk8] [INFO] Downloaded from central: https://repo.maven.apache.org/maven2/org/abego/treelayout/org.abego.treelayout.core/1.0.1/org.abego.treelayout.core-1.0.1.jar (26 kB at 102 kB/s)
[windows-jdk8] [INFO] Downloaded from central: https://repo.maven.apache.org/maven2/com/google/guava/guava/18.0/guava-18.0.jar (2.3 MB at 7.6 MB/s)
[windows-jdk8] [INFO] There are 8 errors reported by Checkstyle 6.1.1 with config/maven_checks.xml ruleset.
[windows-jdk8] [ERROR] src\main\java\org\apache\maven\plugins\javadoc\JavadocUtil.java[543:30] (whitespace) WhitespaceAround: '=' is not preceded with whitespace.
[windows-jdk8] [ERROR] src\main\java\org\apache\maven\plugins\javadoc\JavadocUtil.java[545:13] (blocks) AvoidNestedBlocks: Avoid nested blocks.
[windows-jdk8] [ERROR] src\main\java\org\apache\maven\plugins\javadoc\JavadocUtil.java[552:30] (whitespace) WhitespaceAround: '=' is not preceded with whitespace.
[windows-jdk8] [ERROR] src\main\java\org\apache\maven\plugins\javadoc\JavadocUtil.java[554:13] (blocks) AvoidNestedBlocks: Avoid nested blocks.
[windows-jdk8] [INFO] Ignored 4 errors, 4 violations remaining.
[windows-jdk8] [INFO] ------------------------------------------------------------------------
[windows-jdk8] [INFO] BUILD FAILURE
[windows-jdk8] [INFO] ------------------------------------------------------------------------
[windows-jdk8] [INFO] Total time: 14:11 min
[windows-jdk8] [INFO] Finished at: 2018-09-13T21:34:46-07:00
[windows-jdk8] [INFO] Final Memory: 62M/799M
[windows-jdk8] [INFO] ------------------------------------------------------------------------
[windows-jdk8] [INFO] [jenkins-event-spy] Generated F:\jenkins\jenkins-slave\workspace\lugin_Jenkins_investigation-XMH53YEN2PKRRDIEGSSOM3JEJOBRY257ATPQFDZAASG7YO2URE4Q@tmp\withMavenae75db20\maven-spy-20180913-212033-902661275266327477184.log
[windows-jdk8] [ERROR] Failed to execute goal org.apache.maven.plugins:maven-checkstyle-plugin:2.15:check (checkstyle-check) on project maven-javadoc-plugin: You have 4 Checkstyle violations. -> [Help 1]
[windows-jdk8] [ERROR] 
[windows-jdk8] [ERROR] To see the full stack trace of the errors, re-run Maven with the -e switch.
[windows-jdk8] [ERROR] Re-run Maven using the -X switch to enable full debug logging.
[windows-jdk8] [ERROR] 
[windows-jdk8] [ERROR] For more information about the errors and possible solutions, please read the following articles:
[windows-jdk8] [ERROR] [Help 1] http://cwiki.apache.org/confluence/display/MAVEN/MojoFailureException
[windows-jdk8] Picked up JAVA_TOOL_OPTIONS: -Dmaven.ext.class.path="f:\jenkins\jenkins-slave\workspace\lugin_Jenkins_investigation-XMH53YEN2PKRRDIEGSSOM3JEJOBRY257ATPQFDZAASG7YO2URE4Q@tmp\withMavenae75db20\pipeline-maven-spy.jar" -Dorg.jenkinsci.plugins.pipeline.maven.reportsFolder="f:\jenkins\jenkins-slave\workspace\lugin_Jenkins_investigation-XMH53YEN2PKRRDIEGSSOM3JEJOBRY257ATPQFDZAASG7YO2URE4Q@tmp\withMavenae75db20" 
[Pipeline] [windows-jdk8] }
[Pipeline] [windows-jdk8] // dir
[windows-jdk10] [INFO] run script verify.bsh
[windows-jdk10] [INFO] ..SUCCESS (15.9 s)
[windows-jdk10] [INFO] Building: MJAVADOC-262\pom.xml
[Pipeline] [windows-jdk8] }
[windows-jdk8] [withMaven] invokerPublisher - Archive invoker results for Maven artifact MavenArtifact{org.apache.maven.plugins:maven-javadoc-plugin::3.0.1-SNAPSHOT(version: 3.0.1-SNAPSHOT, snapshot:false) } generated by PluginInvocation{org.apache.maven.plugins:maven-invoker-plugin:2.0.0@integration-test  integration-test}: m\target\invoker-reports\*.xml
[windows-jdk8] performing MavenInvokerRecorder, reportsFilenamePattern:'**/m\target\invoker-reports/BUILD*.xml', invokerBuildDir:'**/m\target\it'
[windows-jdk8] Found reports:[f:\jenkins\jenkins-slave\workspace\lugin_Jenkins_investigation-XMH53YEN2PKRRDIEGSSOM3JEJOBRY257ATPQFDZAASG7YO2URE4Q\m\target\invoker-reports\BUILD-MJAVADOC-110.xml, f:\jenkins\jenkins-slave\workspace\lugin_Jenkins_investigation-XMH53YEN2PKRRDIEGSSOM3JEJOBRY257ATPQFDZAASG7YO2URE4Q\m\target\invoker-reports\BUILD-MJAVADOC-126.xml, f:\jenkins\jenkins-slave\workspace\lugin_Jenkins_investigation-XMH53YEN2PKRRDIEGSSOM3JEJOBRY257ATPQFDZAASG7YO2URE4Q\m\target\invoker-reports\BUILD-MJAVADOC-137.xml, f:\jenkins\jenkins-slave\workspace\lugin_Jenkins_investigation-XMH53YEN2PKRRDIEGSSOM3JEJOBRY257ATPQFDZAASG7YO2URE4Q\m\target\invoker-reports\BUILD-MJAVADOC-172.xml, f:\jenkins\jenkins-slave\workspace\lugin_Jenkins_investigation-XMH53YEN2PKRRDIEGSSOM3JEJOBRY257ATPQFDZAASG7YO2URE4Q\m\target\invoker-reports\BUILD-MJAVADOC-180.xml, f:\jenkins\jenkins-slave\workspace\lugin_Jenkins_investigation-XMH53YEN2PKRRDIEGSSOM3JEJOBRY257ATPQFDZAASG7YO2URE4Q\m\target\invoker-reports\BUILD-MJAVADOC-194.xml, f:\jenkins\jenkins-slave\workspace\lugin_Jenkins_investigation-XMH53YEN2PKRRDIEGSSOM3JEJOBRY257ATPQFDZAASG7YO2URE4Q\m\target\invoker-reports\BUILD-MJAVADOC-250.xml, f:\jenkins\jenkins-slave\workspace\lugin_Jenkins_investigation-XMH53YEN2PKRRDIEGSSOM3JEJOBRY257ATPQFDZAASG7YO2URE4Q\m\target\invoker-reports\BUILD-MJAVADOC-257.xml, f:\jenkins\jenkins-slave\workspace\lugin_Jenkins_investigation-XMH53YEN2PKRRDIEGSSOM3JEJOBRY257ATPQFDZAASG7YO2URE4Q\m\target\invoker-reports\BUILD-MJAVADOC-259.xml, f:\jenkins\jenkins-slave\workspace\lugin_Jenkins_investigation-XMH53YEN2PKRRDIEGSSOM3JEJOBRY257ATPQFDZAASG7YO2URE4Q\m\target\invoker-reports\BUILD-MJAVADOC-262.xml, f:\jenkins\jenkins-slave\workspace\lugin_Jenkins_investigation-XMH53YEN2PKRRDIEGSSOM3JEJOBRY257ATPQFDZAASG7YO2URE4Q\m\target\invoker-reports\BUILD-MJAVADOC-275.xml, f:\jenkins\jenkins-slave\workspace\lugin_Jenkins_investigation-XMH53YEN2PKRRDIEGSSOM3JEJOBRY257ATPQFDZAASG7YO2URE4Q\m\target\invoker-reports\BUILD-MJAVADOC-278.xml, f:\jenkins\jenkins-slave\workspace\lugin_Jenkins_investigation-XMH53YEN2PKRRDIEGSSOM3JEJOBRY257ATPQFDZAASG7YO2URE4Q\m\target\invoker-reports\BUILD-MJAVADOC-320.xml, f:\jenkins\jenkins-slave\workspace\lugin_Jenkins_investigation-XMH53YEN2PKRRDIEGSSOM3JEJOBRY257ATPQFDZAASG7YO2URE4Q\m\target\invoker-reports\BUILD-MJAVADOC-325.xml, f:\jenkins\jenkins-slave\workspace\lugin_Jenkins_investigation-XMH53YEN2PKRRDIEGSSOM3JEJOBRY257ATPQFDZAASG7YO2URE4Q\m\target\invoker-reports\BUILD-MJAVADOC-365.xml, f:\jenkins\jenkins-slave\workspace\lugin_Jenkins_investigation-XMH53YEN2PKRRDIEGSSOM3JEJOBRY257ATPQFDZAASG7YO2URE4Q\m\target\invoker-reports\BUILD-MJAVADOC-369.xml, f:\jenkins\jenkins-slave\workspace\lugin_Jenkins_investigation-XMH53YEN2PKRRDIEGSSOM3JEJOBRY257ATPQFDZAASG7YO2URE4Q\m\target\invoker-reports\BUILD-MJAVADOC-384.xml, f:\jenkins\jenkins-slave\workspace\lugin_Jenkins_investigation-XMH53YEN2PKRRDIEGSSOM3JEJOBRY257ATPQFDZAASG7YO2URE4Q\m\target\invoker-reports\BUILD-MJAVADOC-407.xml, f:\jenkins\jenkins-slave\workspace\lugin_Jenkins_investigation-XMH53YEN2PKRRDIEGSSOM3JEJOBRY257ATPQFDZAASG7YO2URE4Q\m\target\invoker-reports\BUILD-MJAVADOC-414.xml, f:\jenkins\jenkins-slave\workspace\lugin_Jenkins_investigation-XMH53YEN2PKRRDIEGSSOM3JEJOBRY257ATPQFDZAASG7YO2URE4Q\m\target\invoker-reports\BUILD-MJAVADOC-437.xml, f:\jenkins\jenkins-slave\workspace\lugin_Jenkins_investigation-XMH53YEN2PKRRDIEGSSOM3JEJOBRY257ATPQFDZAASG7YO2URE4Q\m\target\invoker-reports\BUILD-MJAVADOC-494_aggregate-repositories.xml, f:\jenkins\jenkins-slave\workspace\lugin_Jenkins_investigation-XMH53YEN2PKRRDIEGSSOM3JEJOBRY257ATPQFDZAASG7YO2URE4Q\m\target\invoker-reports\BUILD-MJAVADOC-497.xml, f:\jenkins\jenkins-slave\workspace\lugin_Jenkins_investigation-XMH53YEN2PKRRDIEGSSOM3JEJOBRY257ATPQFDZAASG7YO2URE4Q\m\target\invoker-reports\BUILD-MJAVADOC-498_aggr_modulepath.xml, f:\jenkins\jenkins-slave\workspace\lugin_Jenkins_investigation-XMH53YEN2PKRRDIEGSSOM3JEJOBRY257ATPQFDZAASG7YO2URE4Q\m\target\invoker-reports\BUILD-MJAVADOC-498_mm_modulepath.xml, f:\jenkins\jenkins-slave\workspace\lugin_Jenkins_investigation-XMH53YEN2PKRRDIEGSSOM3JEJOBRY257ATPQFDZAASG7YO2URE4Q\m\target\invoker-reports\BUILD-MJAVADOC-498_modulepath.xml, f:\jenkins\jenkins-slave\workspace\lugin_Jenkins_investigation-XMH53YEN2PKRRDIEGSSOM3JEJOBRY257ATPQFDZAASG7YO2URE4Q\m\target\invoker-reports\BUILD-MJAVADOC-508.xml, f:\jenkins\jenkins-slave\workspace\lugin_Jenkins_investigation-XMH53YEN2PKRRDIEGSSOM3JEJOBRY257ATPQFDZAASG7YO2URE4Q\m\target\invoker-reports\BUILD-additional-dependencies-non-aggregate.xml, f:\jenkins\jenkins-slave\workspace\lugin_Jenkins_investigation-XMH53YEN2PKRRDIEGSSOM3JEJOBRY257ATPQFDZAASG7YO2URE4Q\m\target\invoker-reports\BUILD-additional-dependencies.xml, f:\jenkins\jenkins-slave\workspace\lugin_Jenkins_investigation-XMH53YEN2PKRRDIEGSSOM3JEJOBRY257ATPQFDZAASG7YO2URE4Q\m\target\invoker-reports\BUILD-dependencySource-1.xml, f:\jenkins\jenkins-slave\workspace\lugin_Jenkins_investigation-XMH53YEN2PKRRDIEGSSOM3JEJOBRY257ATPQFDZAASG7YO2URE4Q\m\target\invoker-reports\BUILD-dependencySource-2.xml, f:\jenkins\jenkins-slave\workspace\lugin_Jenkins_investigation-XMH53YEN2PKRRDIEGSSOM3JEJOBRY257ATPQFDZAASG7YO2URE4Q\m\target\invoker-reports\BUILD-dependencySource-3.xml, f:\jenkins\jenkins-slave\workspace\lugin_Jenkins_investigation-XMH53YEN2PKRRDIEGSSOM3JEJOBRY257ATPQFDZAASG7YO2URE4Q\m\target\invoker-reports\BUILD-dependencySource-4.xml, f:\jenkins\jenkins-slave\workspace\lugin_Jenkins_investigation-XMH53YEN2PKRRDIEGSSOM3JEJOBRY257ATPQFDZAASG7YO2URE4Q\m\target\invoker-reports\BUILD-detectLinks.xml, f:\jenkins\jenkins-slave\workspace\lugin_Jenkins_investigation-XMH53YEN2PKRRDIEGSSOM3JEJOBRY257ATPQFDZAASG7YO2URE4Q\m\target\invoker-reports\BUILD-javadoc-fix.xml, f:\jenkins\jenkins-slave\workspace\lugin_Jenkins_investigation-XMH53YEN2PKRRDIEGSSOM3JEJOBRY257ATPQFDZAASG7YO2URE4Q\m\target\invoker-reports\BUILD-site-failOnError.xml]
[windows-jdk8] Found logs:[f:\jenkins\jenkins-slave\workspace\lugin_Jenkins_investigation-XMH53YEN2PKRRDIEGSSOM3JEJOBRY257ATPQFDZAASG7YO2URE4Q\m\target\it\MJAVADOC-110\build.log, f:\jenkins\jenkins-slave\workspace\lugin_Jenkins_investigation-XMH53YEN2PKRRDIEGSSOM3JEJOBRY257ATPQFDZAASG7YO2URE4Q\m\target\it\MJAVADOC-126\build.log, f:\jenkins\jenkins-slave\workspace\lugin_Jenkins_investigation-XMH53YEN2PKRRDIEGSSOM3JEJOBRY257ATPQFDZAASG7YO2URE4Q\m\target\it\MJAVADOC-137\build.log, f:\jenkins\jenkins-slave\workspace\lugin_Jenkins_investigation-XMH53YEN2PKRRDIEGSSOM3JEJOBRY257ATPQFDZAASG7YO2URE4Q\m\target\it\MJAVADOC-172\build.log, f:\jenkins\jenkins-slave\workspace\lugin_Jenkins_investigation-XMH53YEN2PKRRDIEGSSOM3JEJOBRY257ATPQFDZAASG7YO2URE4Q\m\target\it\MJAVADOC-180\build.log, f:\jenkins\jenkins-slave\workspace\lugin_Jenkins_investigation-XMH53YEN2PKRRDIEGSSOM3JEJOBRY257ATPQFDZAASG7YO2URE4Q\m\target\it\MJAVADOC-194\build.log, f:\jenkins\jenkins-slave\workspace\lugin_Jenkins_investigation-XMH53YEN2PKRRDIEGSSOM3JEJOBRY257ATPQFDZAASG7YO2URE4Q\m\target\it\MJAVADOC-250\build.log, f:\jenkins\jenkins-slave\workspace\lugin_Jenkins_investigation-XMH53YEN2PKRRDIEGSSOM3JEJOBRY257ATPQFDZAASG7YO2URE4Q\m\target\it\MJAVADOC-257\build.log, f:\jenkins\jenkins-slave\workspace\lugin_Jenkins_investigation-XMH53YEN2PKRRDIEGSSOM3JEJOBRY257ATPQFDZAASG7YO2URE4Q\m\target\it\MJAVADOC-259\build.log, f:\jenkins\jenkins-slave\workspace\lugin_Jenkins_investigation-XMH53YEN2PKRRDIEGSSOM3JEJOBRY257ATPQFDZAASG7YO2URE4Q\m\target\it\MJAVADOC-262\build.log, f:\jenkins\jenkins-slave\workspace\lugin_Jenkins_investigation-XMH53YEN2PKRRDIEGSSOM3JEJOBRY257ATPQFDZAASG7YO2URE4Q\m\target\it\MJAVADOC-275\build.log, f:\jenkins\jenkins-slave\workspace\lugin_Jenkins_investigation-XMH53YEN2PKRRDIEGSSOM3JEJOBRY257ATPQFDZAASG7YO2URE4Q\m\target\it\MJAVADOC-278\build.log, f:\jenkins\jenkins-slave\workspace\lugin_Jenkins_investigation-XMH53YEN2PKRRDIEGSSOM3JEJOBRY257ATPQFDZAASG7YO2URE4Q\m\target\it\MJAVADOC-320\build.log, f:\jenkins\jenkins-slave\workspace\lugin_Jenkins_investigation-XMH53YEN2PKRRDIEGSSOM3JEJOBRY257ATPQFDZAASG7YO2URE4Q\m\target\it\MJAVADOC-325\build.log, f:\jenkins\jenkins-slave\workspace\lugin_Jenkins_investigation-XMH53YEN2PKRRDIEGSSOM3JEJOBRY257ATPQFDZAASG7YO2URE4Q\m\target\it\MJAVADOC-365\build.log, f:\jenkins\jenkins-slave\workspace\lugin_Jenkins_investigation-XMH53YEN2PKRRDIEGSSOM3JEJOBRY257ATPQFDZAASG7YO2URE4Q\m\target\it\MJAVADOC-369\build.log, f:\jenkins\jenkins-slave\workspace\lugin_Jenkins_investigation-XMH53YEN2PKRRDIEGSSOM3JEJOBRY257ATPQFDZAASG7YO2URE4Q\m\target\it\MJAVADOC-384\build.log, f:\jenkins\jenkins-slave\workspace\lugin_Jenkins_investigation-XMH53YEN2PKRRDIEGSSOM3JEJOBRY257ATPQFDZAASG7YO2URE4Q\m\target\it\MJAVADOC-407\build.log, f:\jenkins\jenkins-slave\workspace\lugin_Jenkins_investigation-XMH53YEN2PKRRDIEGSSOM3JEJOBRY257ATPQFDZAASG7YO2URE4Q\m\target\it\MJAVADOC-414\build.log, f:\jenkins\jenkins-slave\workspace\lugin_Jenkins_investigation-XMH53YEN2PKRRDIEGSSOM3JEJOBRY257ATPQFDZAASG7YO2URE4Q\m\target\it\MJAVADOC-437\build.log, f:\jenkins\jenkins-slave\workspace\lugin_Jenkins_investigation-XMH53YEN2PKRRDIEGSSOM3JEJOBRY257ATPQFDZAASG7YO2URE4Q\m\target\it\MJAVADOC-494_aggregate-repositories\build.log, f:\jenkins\jenkins-slave\workspace\lugin_Jenkins_investigation-XMH53YEN2PKRRDIEGSSOM3JEJOBRY257ATPQFDZAASG7YO2URE4Q\m\target\it\MJAVADOC-497\build.log, f:\jenkins\jenkins-slave\workspace\lugin_Jenkins_investigation-XMH53YEN2PKRRDIEGSSOM3JEJOBRY257ATPQFDZAASG7YO2URE4Q\m\target\it\MJAVADOC-508\build.log, f:\jenkins\jenkins-slave\workspace\lugin_Jenkins_investigation-XMH53YEN2PKRRDIEGSSOM3JEJOBRY257ATPQFDZAASG7YO2URE4Q\m\target\it\additional-dependencies-non-aggregate\build.log, f:\jenkins\jenkins-slave\workspace\lugin_Jenkins_investigation-XMH53YEN2PKRRDIEGSSOM3JEJOBRY257ATPQFDZAASG7YO2URE4Q\m\target\it\additional-dependencies\build.log, f:\jenkins\jenkins-slave\workspace\lugin_Jenkins_investigation-XMH53YEN2PKRRDIEGSSOM3JEJOBRY257ATPQFDZAASG7YO2URE4Q\m\target\it\dependencySource-1\build.log, f:\jenkins\jenkins-slave\workspace\lugin_Jenkins_investigation-XMH53YEN2PKRRDIEGSSOM3JEJOBRY257ATPQFDZAASG7YO2URE4Q\m\target\it\dependencySource-2\build.log, f:\jenkins\jenkins-slave\workspace\lugin_Jenkins_investigation-XMH53YEN2PKRRDIEGSSOM3JEJOBRY257ATPQFDZAASG7YO2URE4Q\m\target\it\dependencySource-3\build.log, f:\jenkins\jenkins-slave\workspace\lugin_Jenkins_investigation-XMH53YEN2PKRRDIEGSSOM3JEJOBRY257ATPQFDZAASG7YO2URE4Q\m\target\it\dependencySource-4\build.log, f:\jenkins\jenkins-slave\workspace\lugin_Jenkins_investigation-XMH53YEN2PKRRDIEGSSOM3JEJOBRY257ATPQFDZAASG7YO2URE4Q\m\target\it\detectLinks\build.log, f:\jenkins\jenkins-slave\workspace\lugin_Jenkins_investigation-XMH53YEN2PKRRDIEGSSOM3JEJOBRY257ATPQFDZAASG7YO2URE4Q\m\target\it\javadoc-fix\build.log, f:\jenkins\jenkins-slave\workspace\lugin_Jenkins_investigation-XMH53YEN2PKRRDIEGSSOM3JEJOBRY257ATPQFDZAASG7YO2URE4Q\m\target\it\site-failOnError\build.log]
[windows-jdk8] Finished parsing Maven Invoker results (found 35)
[windows-jdk8] [withMaven] junitPublisher - Archive test results for Maven artifact org.apache.maven.plugins:maven-javadoc-plugin:3.0.1-SNAPSHOT generated by maven-surefire-plugin:test (default-test): m\target\surefire-reports\*.xml
[windows-jdk8] Recording test results
[Pipeline] [windows-jdk8] // withMaven
[Pipeline] [windows-jdk8] cleanWs
[windows-jdk8] [WS-CLEANUP] Deleting project workspace...[WS-CLEANUP] done
[Pipeline] [windows-jdk8] cleanWs
[windows-jdk8] [WS-CLEANUP] Deleting project workspace...[WS-CLEANUP] done
[Pipeline] [windows-jdk8] }
[Pipeline] [windows-jdk8] // stage
[Pipeline] [windows-jdk8] }
[Pipeline] [windows-jdk8] // node
[Pipeline] [windows-jdk8] }
[windows-jdk8] Failed in branch windows-jdk8
[windows-jdk10] [INFO] run script verify.bsh
[windows-jdk10] [INFO] ..SUCCESS (8.8 s)
[windows-jdk10] [INFO] Building: MJAVADOC-275\pom.xml
[windows-jdk10] [INFO] ..SUCCESS (18.2 s)
[windows-jdk10] [INFO] Building: MJAVADOC-278\pom.xml
[windows-jdk10] [INFO] run script verify.bsh
[windows-jdk10] [INFO] ..SUCCESS (9.9 s)
[windows-jdk10] [INFO] Building: MJAVADOC-320\pom.xml
[windows-jdk10] [INFO] run script verify.bsh
[windows-jdk10] [INFO] ..SUCCESS (17.1 s)
[windows-jdk10] [INFO] Building: MJAVADOC-325\pom.xml
[windows-jdk10] [INFO] run script verify.bsh
[windows-jdk10] [INFO] ..SUCCESS (8.9 s)
[windows-jdk10] [INFO] Building: MJAVADOC-365\pom.xml
[windows-jdk10] [INFO] run script verify.bsh
[windows-jdk10] [INFO] ..SUCCESS (10.0 s)
[windows-jdk10] [INFO] Building: MJAVADOC-369\pom.xml
[windows-jdk10] [INFO] run script verify.bsh
[windows-jdk10] [INFO] ..SUCCESS (31.2 s)
[windows-jdk10] [INFO] Building: MJAVADOC-384\pom.xml
[windows-jdk10] [INFO] run script verify.bsh
[windows-jdk10] [INFO] ..SUCCESS (9.0 s)
[windows-jdk10] [INFO] Building: MJAVADOC-407\pom.xml
[windows-jdk10] [INFO] run script verify.bsh
[windows-jdk10] [INFO] ..SUCCESS (10.7 s)
[windows-jdk10] [INFO] Building: MJAVADOC-414\pom.xml
[windows-jdk10] [INFO] run script verify.bsh
[windows-jdk10] [INFO] ..SUCCESS (10.8 s)
[windows-jdk10] [INFO] Building: MJAVADOC-437\pom.xml
[windows-jdk10] [INFO] run script verify.bsh
[windows-jdk10] [INFO] ..SUCCESS (10.7 s)
[windows-jdk10] [INFO] Building: MJAVADOC-494_aggregate-repositories\pom.xml
[windows-jdk10] [INFO] ..SUCCESS (11.4 s)
[windows-jdk10] [INFO] Building: MJAVADOC-497\pom.xml
[windows-jdk10] [INFO] run script verify.bsh
[windows-jdk10] [INFO] ..FAILED (9.8 s)
[windows-jdk10] [INFO]   The post-build script returned false.
[windows-jdk10] [INFO] Building: MJAVADOC-498_aggr_modulepath\pom.xml
[windows-jdk10] [INFO] ..SUCCESS (28.1 s)
[windows-jdk10] [INFO] Building: MJAVADOC-498_mm_modulepath\pom.xml
[windows-jdk10] [INFO] ..SUCCESS (14.8 s)
[windows-jdk10] [INFO] Building: MJAVADOC-498_modulepath\pom.xml
[windows-jdk10] [INFO] run script verify.groovy
[windows-jdk10] WARNING: An illegal reflective access operation has occurred
[windows-jdk10] WARNING: Illegal reflective access by org.codehaus.groovy.reflection.CachedClass$3$1 (file:/f:/jenkins/jenkins-slave/workspace/lugin_Jenkins_investigation-XMH53YEN2PKRRDIEGSSOM3JEJOBRY257ATPQFDZAASG7YO2URE4Q/.repository/org/codehaus/groovy/groovy/2.0.1/groovy-2.0.1.jar) to method java.lang.Object.finalize()
[windows-jdk10] WARNING: Please consider reporting this to the maintainers of org.codehaus.groovy.reflection.CachedClass$3$1
[windows-jdk10] WARNING: Use --illegal-access=warn to enable warnings of further illegal reflective access operations
[windows-jdk10] WARNING: All illegal access operations will be denied in a future release
[windows-jdk10] [INFO] ..SUCCESS (19.0 s)
[windows-jdk10] [INFO] Building: MJAVADOC-508\pom.xml
[windows-jdk10] [INFO] ..SUCCESS (8.4 s)
[windows-jdk10] [INFO] Building: site-failOnError\pom.xml
[windows-jdk10] [INFO] ..SUCCESS (17.5 s)
[windows-jdk10] [INFO] 
[windows-jdk10] [INFO] --- mrm-maven-plugin:1.1.0:stop (repository) @ maven-javadoc-plugin ---
[windows-jdk10] [INFO] Stopping Mock Repository Manager on http://localhost:59657
[windows-jdk10] [INFO] Stopped SocketConnector@0.0.0.0:59657
[windows-jdk10] [INFO] Mock Repository Manager http://localhost:59657 is stopped.
[windows-jdk10] [INFO] 
[windows-jdk10] [INFO] --- mrm-maven-plugin:1.1.0:stop (3rdparty) @ maven-javadoc-plugin ---
[windows-jdk10] [INFO] Stopping Mock Repository Manager on http://localhost:59658
[windows-jdk10] [INFO] Stopped SocketConnector@0.0.0.0:59658
[windows-jdk10] [INFO] Mock Repository Manager http://localhost:59658 is stopped.
[windows-jdk10] [INFO] 
[windows-jdk10] [INFO] --- maven-checkstyle-plugin:2.15:check (checkstyle-check) @ maven-javadoc-plugin ---
[windows-jdk10] [INFO] Downloading from central: https://repo.maven.apache.org/maven2/org/apache/maven/shared/maven-shared-resources/2/maven-shared-resources-2.pom
[windows-jdk10] [INFO] Downloaded from central: https://repo.maven.apache.org/maven2/org/apache/maven/shared/maven-shared-resources/2/maven-shared-resources-2.pom (3.0 kB at 106 kB/s)
[windows-jdk10] [INFO] Downloading from central: https://repo.maven.apache.org/maven2/org/codehaus/plexus/plexus-utils/3.0.10/plexus-utils-3.0.10.pom
[windows-jdk10] [INFO] Downloaded from central: https://repo.maven.apache.org/maven2/org/codehaus/plexus/plexus-utils/3.0.10/plexus-utils-3.0.10.pom (3.1 kB at 137 kB/s)
[windows-jdk10] [INFO] Downloading from central: https://repo.maven.apache.org/maven2/org/apache/maven/doxia/doxia-integration-tools/1.6/doxia-integration-tools-1.6.pom
[windows-jdk10] [INFO] Downloaded from central: https://repo.maven.apache.org/maven2/org/apache/maven/doxia/doxia-integration-tools/1.6/doxia-integration-tools-1.6.pom (7.0 kB at 632 kB/s)
[windows-jdk10] [INFO] Downloading from central: https://repo.maven.apache.org/maven2/org/apache/maven/doxia/doxia-tools/3/doxia-tools-3.pom
[windows-jdk10] [INFO] Downloaded from central: https://repo.maven.apache.org/maven2/org/apache/maven/doxia/doxia-tools/3/doxia-tools-3.pom (9.9 kB at 473 kB/s)
[windows-jdk10] [INFO] Downloading from central: https://repo.maven.apache.org/maven2/org/apache/maven/doxia/doxia-logging-api/1.6/doxia-logging-api-1.6.pom
[windows-jdk10] [INFO] Downloaded from central: https://repo.maven.apache.org/maven2/org/apache/maven/doxia/doxia-logging-api/1.6/doxia-logging-api-1.6.pom (1.5 kB at 118 kB/s)
[windows-jdk10] [INFO] Downloading from central: https://repo.maven.apache.org/maven2/org/apache/maven/doxia/doxia/1.6/doxia-1.6.pom
[windows-jdk10] [INFO] Downloaded from central: https://repo.maven.apache.org/maven2/org/apache/maven/doxia/doxia/1.6/doxia-1.6.pom (19 kB at 1.4 MB/s)
[windows-jdk10] [INFO] Downloading from central: https://repo.maven.apache.org/maven2/org/apache/maven/doxia/doxia-decoration-model/1.6/doxia-decoration-model-1.6.pom
[windows-jdk10] [INFO] Downloaded from central: https://repo.maven.apache.org/maven2/org/apache/maven/doxia/doxia-decoration-model/1.6/doxia-decoration-model-1.6.pom (3.0 kB at 250 kB/s)
[windows-jdk10] [INFO] Downloading from central: https://repo.maven.apache.org/maven2/org/apache/maven/doxia/doxia-sitetools/1.6/doxia-sitetools-1.6.pom
[windows-jdk10] [INFO] Downloaded from central: https://repo.maven.apache.org/maven2/org/apache/maven/doxia/doxia-sitetools/1.6/doxia-sitetools-1.6.pom (18 kB at 1.2 MB/s)
[windows-jdk10] [INFO] Downloading from central: https://repo.maven.apache.org/maven2/org/codehaus/plexus/plexus-resources/1.0.1/plexus-resources-1.0.1.pom
[windows-jdk10] [INFO] Downloaded from central: https://repo.maven.apache.org/maven2/org/codehaus/plexus/plexus-resources/1.0.1/plexus-resources-1.0.1.pom (1.3 kB at 63 kB/s)
[windows-jdk10] [INFO] Downloading from central: https://repo.maven.apache.org/maven2/com/puppycrawl/tools/checkstyle/6.1.1/checkstyle-6.1.1.pom
[windows-jdk10] [INFO] Downloaded from central: https://repo.maven.apache.org/maven2/com/puppycrawl/tools/checkstyle/6.1.1/checkstyle-6.1.1.pom (30 kB at 1.2 MB/s)
[windows-jdk10] [INFO] Downloading from central: https://repo.maven.apache.org/maven2/org/sonatype/oss/oss-parent/7/oss-parent-7.pom
[windows-jdk10] [INFO] Downloaded from central: https://repo.maven.apache.org/maven2/org/sonatype/oss/oss-parent/7/oss-parent-7.pom (4.8 kB at 254 kB/s)
[windows-jdk10] [INFO] Downloading from central: https://repo.maven.apache.org/maven2/org/antlr/antlr4-runtime/4.3/antlr4-runtime-4.3.pom
[windows-jdk10] [INFO] Downloaded from central: https://repo.maven.apache.org/maven2/org/antlr/antlr4-runtime/4.3/antlr4-runtime-4.3.pom (4.8 kB at 154 kB/s)
[windows-jdk10] [INFO] Downloading from central: https://repo.maven.apache.org/maven2/org/antlr/antlr4-master/4.3/antlr4-master-4.3.pom
[windows-jdk10] [INFO] Downloaded from central: https://repo.maven.apache.org/maven2/org/antlr/antlr4-master/4.3/antlr4-master-4.3.pom (7.9 kB at 107 kB/s)
[windows-jdk10] [INFO] Downloading from central: https://repo.maven.apache.org/maven2/org/abego/treelayout/org.abego.treelayout.core/1.0.1/org.abego.treelayout.core-1.0.1.pom
[windows-jdk10] [INFO] Downloaded from central: https://repo.maven.apache.org/maven2/org/abego/treelayout/org.abego.treelayout.core/1.0.1/org.abego.treelayout.core-1.0.1.pom (3.1 kB at 100 kB/s)
[windows-jdk10] [INFO] Downloading from central: https://repo.maven.apache.org/maven2/org/antlr/antlr4-annotations/4.3/antlr4-annotations-4.3.pom
[windows-jdk10] [INFO] Downloaded from central: https://repo.maven.apache.org/maven2/org/antlr/antlr4-annotations/4.3/antlr4-annotations-4.3.pom (1.3 kB at 44 kB/s)
[windows-jdk10] [INFO] Downloading from central: https://repo.maven.apache.org/maven2/commons-beanutils/commons-beanutils-core/1.8.3/commons-beanutils-core-1.8.3.pom
[windows-jdk10] [INFO] Downloaded from central: https://repo.maven.apache.org/maven2/commons-beanutils/commons-beanutils-core/1.8.3/commons-beanutils-core-1.8.3.pom (1.6 kB at 86 kB/s)
[windows-jdk10] [INFO] Downloading from central: https://repo.maven.apache.org/maven2/com/google/guava/guava/18.0/guava-18.0.pom
[windows-jdk10] [INFO] Downloaded from central: https://repo.maven.apache.org/maven2/com/google/guava/guava/18.0/guava-18.0.pom (5.7 kB at 183 kB/s)
[windows-jdk10] [INFO] Downloading from central: https://repo.maven.apache.org/maven2/com/google/guava/guava-parent/18.0/guava-parent-18.0.pom
[windows-jdk10] [INFO] Downloaded from central: https://repo.maven.apache.org/maven2/com/google/guava/guava-parent/18.0/guava-parent-18.0.pom (7.7 kB at 366 kB/s)
[windows-jdk10] [INFO] Downloading from central: https://repo.maven.apache.org/maven2/org/codehaus/plexus/plexus-resources/1.0.1/plexus-resources-1.0.1.jar
[windows-jdk10] [INFO] Downloading from central: https://repo.maven.apache.org/maven2/com/puppycrawl/tools/checkstyle/6.1.1/checkstyle-6.1.1.jar
[windows-jdk10] [INFO] Downloading from central: https://repo.maven.apache.org/maven2/org/apache/maven/doxia/doxia-integration-tools/1.6/doxia-integration-tools-1.6.jar
[windows-jdk10] [INFO] Downloading from central: https://repo.maven.apache.org/maven2/org/antlr/antlr4-runtime/4.3/antlr4-runtime-4.3.jar
[windows-jdk10] [INFO] Downloading from central: https://repo.maven.apache.org/maven2/org/apache/maven/shared/maven-shared-resources/2/maven-shared-resources-2.jar
[windows-jdk10] [INFO] Downloaded from central: https://repo.maven.apache.org/maven2/com/puppycrawl/tools/checkstyle/6.1.1/checkstyle-6.1.1.jar (1.0 MB at 17 MB/s)
[windows-jdk10] [INFO] Downloading from central: https://repo.maven.apache.org/maven2/org/abego/treelayout/org.abego.treelayout.core/1.0.1/org.abego.treelayout.core-1.0.1.jar
[windows-jdk10] [INFO] Downloaded from central: https://repo.maven.apache.org/maven2/org/antlr/antlr4-runtime/4.3/antlr4-runtime-4.3.jar (345 kB at 5.3 MB/s)
[windows-jdk10] [INFO] Downloading from central: https://repo.maven.apache.org/maven2/org/antlr/antlr4-annotations/4.3/antlr4-annotations-4.3.jar
[windows-jdk10] [INFO] Downloaded from central: https://repo.maven.apache.org/maven2/org/apache/maven/shared/maven-shared-resources/2/maven-shared-resources-2.jar (13 kB at 121 kB/s)
[windows-jdk10] [INFO] Downloading from central: https://repo.maven.apache.org/maven2/commons-beanutils/commons-beanutils-core/1.8.3/commons-beanutils-core-1.8.3.jar
[windows-jdk10] [INFO] Downloaded from central: https://repo.maven.apache.org/maven2/commons-beanutils/commons-beanutils-core/1.8.3/commons-beanutils-core-1.8.3.jar (207 kB at 1.5 MB/s)
[windows-jdk10] [INFO] Downloading from central: https://repo.maven.apache.org/maven2/com/google/guava/guava/18.0/guava-18.0.jar
[windows-jdk10] [INFO] Downloaded from central: https://repo.maven.apache.org/maven2/org/antlr/antlr4-annotations/4.3/antlr4-annotations-4.3.jar (10 kB at 72 kB/s)
[windows-jdk10] [INFO] Downloading from central: https://repo.maven.apache.org/maven2/commons-lang/commons-lang/2.1/commons-lang-2.1.jar
[windows-jdk10] [INFO] Downloaded from central: https://repo.maven.apache.org/maven2/org/codehaus/plexus/plexus-resources/1.0.1/plexus-resources-1.0.1.jar (22 kB at 108 kB/s)
[windows-jdk10] [INFO] Downloaded from central: https://repo.maven.apache.org/maven2/commons-lang/commons-lang/2.1/commons-lang-2.1.jar (208 kB at 1.0 MB/s)
[windows-jdk10] [INFO] Downloaded from central: https://repo.maven.apache.org/maven2/com/google/guava/guava/18.0/guava-18.0.jar (2.3 MB at 9.6 MB/s)
[windows-jdk10] [INFO] Downloaded from central: https://repo.maven.apache.org/maven2/org/abego/treelayout/org.abego.treelayout.core/1.0.1/org.abego.treelayout.core-1.0.1.jar (26 kB at 109 kB/s)
[windows-jdk10] [INFO] Downloaded from central: https://repo.maven.apache.org/maven2/org/apache/maven/doxia/doxia-integration-tools/1.6/doxia-integration-tools-1.6.jar (45 kB at 166 kB/s)
[windows-jdk10] [INFO] There are 8 errors reported by Checkstyle 6.1.1 with config/maven_checks.xml ruleset.
[windows-jdk10] [ERROR] src\main\java\org\apache\maven\plugins\javadoc\JavadocUtil.java[543:30] (whitespace) WhitespaceAround: '=' is not preceded with whitespace.
[windows-jdk10] [ERROR] src\main\java\org\apache\maven\plugins\javadoc\JavadocUtil.java[545:13] (blocks) AvoidNestedBlocks: Avoid nested blocks.
[windows-jdk10] [ERROR] src\main\java\org\apache\maven\plugins\javadoc\JavadocUtil.java[552:30] (whitespace) WhitespaceAround: '=' is not preceded with whitespace.
[windows-jdk10] [ERROR] src\main\java\org\apache\maven\plugins\javadoc\JavadocUtil.java[554:13] (blocks) AvoidNestedBlocks: Avoid nested blocks.
[windows-jdk10] [INFO] Ignored 4 errors, 4 violations remaining.
[windows-jdk10] [INFO] ------------------------------------------------------------------------
[windows-jdk10] [INFO] BUILD FAILURE
[windows-jdk10] [INFO] ------------------------------------------------------------------------
[windows-jdk10] [INFO] Total time: 13:39 min
[windows-jdk10] [INFO] Finished at: 2018-09-13T21:39:07-07:00
[windows-jdk10] [INFO] Final Memory: 50M/174M
[windows-jdk10] [INFO] ------------------------------------------------------------------------
[windows-jdk10] [INFO] [jenkins-event-spy] Generated F:\jenkins\jenkins-slave\workspace\lugin_Jenkins_investigation-XMH53YEN2PKRRDIEGSSOM3JEJOBRY257ATPQFDZAASG7YO2URE4Q@tmp\withMaven165cd5b1\maven-spy-20180913-212526-9885504907393033341359.log
[windows-jdk10] [ERROR] Failed to execute goal org.apache.maven.plugins:maven-checkstyle-plugin:2.15:check (checkstyle-check) on project maven-javadoc-plugin: You have 4 Checkstyle violations. -> [Help 1]
[windows-jdk10] [ERROR] 
[windows-jdk10] [ERROR] To see the full stack trace of the errors, re-run Maven with the -e switch.
[windows-jdk10] [ERROR] Re-run Maven using the -X switch to enable full debug logging.
[windows-jdk10] [ERROR] 
[windows-jdk10] [ERROR] For more information about the errors and possible solutions, please read the following articles:
[windows-jdk10] [ERROR] [Help 1] http://cwiki.apache.org/confluence/display/MAVEN/MojoFailureException
[Pipeline] [windows-jdk10] }
[Pipeline] [windows-jdk10] // dir
[Pipeline] [windows-jdk10] }
[windows-jdk10] [withMaven] invokerPublisher - Archive invoker results for Maven artifact MavenArtifact{org.apache.maven.plugins:maven-javadoc-plugin::3.0.1-SNAPSHOT(version: 3.0.1-SNAPSHOT, snapshot:false) } generated by PluginInvocation{org.apache.maven.plugins:maven-invoker-plugin:2.0.0@integration-test  integration-test}: m\target\invoker-reports\*.xml
[windows-jdk10] performing MavenInvokerRecorder, reportsFilenamePattern:'**/m\target\invoker-reports/BUILD*.xml', invokerBuildDir:'**/m\target\it'
[windows-jdk10] Found reports:[f:\jenkins\jenkins-slave\workspace\lugin_Jenkins_investigation-XMH53YEN2PKRRDIEGSSOM3JEJOBRY257ATPQFDZAASG7YO2URE4Q\m\target\invoker-reports\BUILD-MJAVADOC-110.xml, f:\jenkins\jenkins-slave\workspace\lugin_Jenkins_investigation-XMH53YEN2PKRRDIEGSSOM3JEJOBRY257ATPQFDZAASG7YO2URE4Q\m\target\invoker-reports\BUILD-MJAVADOC-126.xml, f:\jenkins\jenkins-slave\workspace\lugin_Jenkins_investigation-XMH53YEN2PKRRDIEGSSOM3JEJOBRY257ATPQFDZAASG7YO2URE4Q\m\target\invoker-reports\BUILD-MJAVADOC-137.xml, f:\jenkins\jenkins-slave\workspace\lugin_Jenkins_investigation-XMH53YEN2PKRRDIEGSSOM3JEJOBRY257ATPQFDZAASG7YO2URE4Q\m\target\invoker-reports\BUILD-MJAVADOC-172.xml, f:\jenkins\jenkins-slave\workspace\lugin_Jenkins_investigation-XMH53YEN2PKRRDIEGSSOM3JEJOBRY257ATPQFDZAASG7YO2URE4Q\m\target\invoker-reports\BUILD-MJAVADOC-180.xml, f:\jenkins\jenkins-slave\workspace\lugin_Jenkins_investigation-XMH53YEN2PKRRDIEGSSOM3JEJOBRY257ATPQFDZAASG7YO2URE4Q\m\target\invoker-reports\BUILD-MJAVADOC-194.xml, f:\jenkins\jenkins-slave\workspace\lugin_Jenkins_investigation-XMH53YEN2PKRRDIEGSSOM3JEJOBRY257ATPQFDZAASG7YO2URE4Q\m\target\invoker-reports\BUILD-MJAVADOC-250.xml, f:\jenkins\jenkins-slave\workspace\lugin_Jenkins_investigation-XMH53YEN2PKRRDIEGSSOM3JEJOBRY257ATPQFDZAASG7YO2URE4Q\m\target\invoker-reports\BUILD-MJAVADOC-257.xml, f:\jenkins\jenkins-slave\workspace\lugin_Jenkins_investigation-XMH53YEN2PKRRDIEGSSOM3JEJOBRY257ATPQFDZAASG7YO2URE4Q\m\target\invoker-reports\BUILD-MJAVADOC-259.xml, f:\jenkins\jenkins-slave\workspace\lugin_Jenkins_investigation-XMH53YEN2PKRRDIEGSSOM3JEJOBRY257ATPQFDZAASG7YO2URE4Q\m\target\invoker-reports\BUILD-MJAVADOC-262.xml, f:\jenkins\jenkins-slave\workspace\lugin_Jenkins_investigation-XMH53YEN2PKRRDIEGSSOM3JEJOBRY257ATPQFDZAASG7YO2URE4Q\m\target\invoker-reports\BUILD-MJAVADOC-275.xml, f:\jenkins\jenkins-slave\workspace\lugin_Jenkins_investigation-XMH53YEN2PKRRDIEGSSOM3JEJOBRY257ATPQFDZAASG7YO2URE4Q\m\target\invoker-reports\BUILD-MJAVADOC-278.xml, f:\jenkins\jenkins-slave\workspace\lugin_Jenkins_investigation-XMH53YEN2PKRRDIEGSSOM3JEJOBRY257ATPQFDZAASG7YO2URE4Q\m\target\invoker-reports\BUILD-MJAVADOC-320.xml, f:\jenkins\jenkins-slave\workspace\lugin_Jenkins_investigation-XMH53YEN2PKRRDIEGSSOM3JEJOBRY257ATPQFDZAASG7YO2URE4Q\m\target\invoker-reports\BUILD-MJAVADOC-325.xml, f:\jenkins\jenkins-slave\workspace\lugin_Jenkins_investigation-XMH53YEN2PKRRDIEGSSOM3JEJOBRY257ATPQFDZAASG7YO2URE4Q\m\target\invoker-reports\BUILD-MJAVADOC-365.xml, f:\jenkins\jenkins-slave\workspace\lugin_Jenkins_investigation-XMH53YEN2PKRRDIEGSSOM3JEJOBRY257ATPQFDZAASG7YO2URE4Q\m\target\invoker-reports\BUILD-MJAVADOC-369.xml, f:\jenkins\jenkins-slave\workspace\lugin_Jenkins_investigation-XMH53YEN2PKRRDIEGSSOM3JEJOBRY257ATPQFDZAASG7YO2URE4Q\m\target\invoker-reports\BUILD-MJAVADOC-384.xml, f:\jenkins\jenkins-slave\workspace\lugin_Jenkins_investigation-XMH53YEN2PKRRDIEGSSOM3JEJOBRY257ATPQFDZAASG7YO2URE4Q\m\target\invoker-reports\BUILD-MJAVADOC-407.xml, f:\jenkins\jenkins-slave\workspace\lugin_Jenkins_investigation-XMH53YEN2PKRRDIEGSSOM3JEJOBRY257ATPQFDZAASG7YO2URE4Q\m\target\invoker-reports\BUILD-MJAVADOC-414.xml, f:\jenkins\jenkins-slave\workspace\lugin_Jenkins_investigation-XMH53YEN2PKRRDIEGSSOM3JEJOBRY257ATPQFDZAASG7YO2URE4Q\m\target\invoker-reports\BUILD-MJAVADOC-437.xml, f:\jenkins\jenkins-slave\workspace\lugin_Jenkins_investigation-XMH53YEN2PKRRDIEGSSOM3JEJOBRY257ATPQFDZAASG7YO2URE4Q\m\target\invoker-reports\BUILD-MJAVADOC-494_aggregate-repositories.xml, f:\jenkins\jenkins-slave\workspace\lugin_Jenkins_investigation-XMH53YEN2PKRRDIEGSSOM3JEJOBRY257ATPQFDZAASG7YO2URE4Q\m\target\invoker-reports\BUILD-MJAVADOC-497.xml, f:\jenkins\jenkins-slave\workspace\lugin_Jenkins_investigation-XMH53YEN2PKRRDIEGSSOM3JEJOBRY257ATPQFDZAASG7YO2URE4Q\m\target\invoker-reports\BUILD-MJAVADOC-498_aggr_modulepath.xml, f:\jenkins\jenkins-slave\workspace\lugin_Jenkins_investigation-XMH53YEN2PKRRDIEGSSOM3JEJOBRY257ATPQFDZAASG7YO2URE4Q\m\target\invoker-reports\BUILD-MJAVADOC-498_mm_modulepath.xml, f:\jenkins\jenkins-slave\workspace\lugin_Jenkins_investigation-XMH53YEN2PKRRDIEGSSOM3JEJOBRY257ATPQFDZAASG7YO2URE4Q\m\target\invoker-reports\BUILD-MJAVADOC-498_modulepath.xml, f:\jenkins\jenkins-slave\workspace\lugin_Jenkins_investigation-XMH53YEN2PKRRDIEGSSOM3JEJOBRY257ATPQFDZAASG7YO2URE4Q\m\target\invoker-reports\BUILD-MJAVADOC-508.xml, f:\jenkins\jenkins-slave\workspace\lugin_Jenkins_investigation-XMH53YEN2PKRRDIEGSSOM3JEJOBRY257ATPQFDZAASG7YO2URE4Q\m\target\invoker-reports\BUILD-additional-dependencies-non-aggregate.xml, f:\jenkins\jenkins-slave\workspace\lugin_Jenkins_investigation-XMH53YEN2PKRRDIEGSSOM3JEJOBRY257ATPQFDZAASG7YO2URE4Q\m\target\invoker-reports\BUILD-additional-dependencies.xml, f:\jenkins\jenkins-slave\workspace\lugin_Jenkins_investigation-XMH53YEN2PKRRDIEGSSOM3JEJOBRY257ATPQFDZAASG7YO2URE4Q\m\target\invoker-reports\BUILD-dependencySource-1.xml, f:\jenkins\jenkins-slave\workspace\lugin_Jenkins_investigation-XMH53YEN2PKRRDIEGSSOM3JEJOBRY257ATPQFDZAASG7YO2URE4Q\m\target\invoker-reports\BUILD-dependencySource-2.xml, f:\jenkins\jenkins-slave\workspace\lugin_Jenkins_investigation-XMH53YEN2PKRRDIEGSSOM3JEJOBRY257ATPQFDZAASG7YO2URE4Q\m\target\invoker-reports\BUILD-dependencySource-3.xml, f:\jenkins\jenkins-slave\workspace\lugin_Jenkins_investigation-XMH53YEN2PKRRDIEGSSOM3JEJOBRY257ATPQFDZAASG7YO2URE4Q\m\target\invoker-reports\BUILD-dependencySource-4.xml, f:\jenkins\jenkins-slave\workspace\lugin_Jenkins_investigation-XMH53YEN2PKRRDIEGSSOM3JEJOBRY257ATPQFDZAASG7YO2URE4Q\m\target\invoker-reports\BUILD-detectLinks.xml, f:\jenkins\jenkins-slave\workspace\lugin_Jenkins_investigation-XMH53YEN2PKRRDIEGSSOM3JEJOBRY257ATPQFDZAASG7YO2URE4Q\m\target\invoker-reports\BUILD-javadoc-fix.xml, f:\jenkins\jenkins-slave\workspace\lugin_Jenkins_investigation-XMH53YEN2PKRRDIEGSSOM3JEJOBRY257ATPQFDZAASG7YO2URE4Q\m\target\invoker-reports\BUILD-site-failOnError.xml]
[windows-jdk10] Found logs:[f:\jenkins\jenkins-slave\workspace\lugin_Jenkins_investigation-XMH53YEN2PKRRDIEGSSOM3JEJOBRY257ATPQFDZAASG7YO2URE4Q\m\target\it\MJAVADOC-110\build.log, f:\jenkins\jenkins-slave\workspace\lugin_Jenkins_investigation-XMH53YEN2PKRRDIEGSSOM3JEJOBRY257ATPQFDZAASG7YO2URE4Q\m\target\it\MJAVADOC-126\build.log, f:\jenkins\jenkins-slave\workspace\lugin_Jenkins_investigation-XMH53YEN2PKRRDIEGSSOM3JEJOBRY257ATPQFDZAASG7YO2URE4Q\m\target\it\MJAVADOC-137\build.log, f:\jenkins\jenkins-slave\workspace\lugin_Jenkins_investigation-XMH53YEN2PKRRDIEGSSOM3JEJOBRY257ATPQFDZAASG7YO2URE4Q\m\target\it\MJAVADOC-172\build.log, f:\jenkins\jenkins-slave\workspace\lugin_Jenkins_investigation-XMH53YEN2PKRRDIEGSSOM3JEJOBRY257ATPQFDZAASG7YO2URE4Q\m\target\it\MJAVADOC-180\build.log, f:\jenkins\jenkins-slave\workspace\lugin_Jenkins_investigation-XMH53YEN2PKRRDIEGSSOM3JEJOBRY257ATPQFDZAASG7YO2URE4Q\m\target\it\MJAVADOC-194\build.log, f:\jenkins\jenkins-slave\workspace\lugin_Jenkins_investigation-XMH53YEN2PKRRDIEGSSOM3JEJOBRY257ATPQFDZAASG7YO2URE4Q\m\target\it\MJAVADOC-250\build.log, f:\jenkins\jenkins-slave\workspace\lugin_Jenkins_investigation-XMH53YEN2PKRRDIEGSSOM3JEJOBRY257ATPQFDZAASG7YO2URE4Q\m\target\it\MJAVADOC-257\build.log, f:\jenkins\jenkins-slave\workspace\lugin_Jenkins_investigation-XMH53YEN2PKRRDIEGSSOM3JEJOBRY257ATPQFDZAASG7YO2URE4Q\m\target\it\MJAVADOC-259\build.log, f:\jenkins\jenkins-slave\workspace\lugin_Jenkins_investigation-XMH53YEN2PKRRDIEGSSOM3JEJOBRY257ATPQFDZAASG7YO2URE4Q\m\target\it\MJAVADOC-262\build.log, f:\jenkins\jenkins-slave\workspace\lugin_Jenkins_investigation-XMH53YEN2PKRRDIEGSSOM3JEJOBRY257ATPQFDZAASG7YO2URE4Q\m\target\it\MJAVADOC-275\build.log, f:\jenkins\jenkins-slave\workspace\lugin_Jenkins_investigation-XMH53YEN2PKRRDIEGSSOM3JEJOBRY257ATPQFDZAASG7YO2URE4Q\m\target\it\MJAVADOC-278\build.log, f:\jenkins\jenkins-slave\workspace\lugin_Jenkins_investigation-XMH53YEN2PKRRDIEGSSOM3JEJOBRY257ATPQFDZAASG7YO2URE4Q\m\target\it\MJAVADOC-320\build.log, f:\jenkins\jenkins-slave\workspace\lugin_Jenkins_investigation-XMH53YEN2PKRRDIEGSSOM3JEJOBRY257ATPQFDZAASG7YO2URE4Q\m\target\it\MJAVADOC-325\build.log, f:\jenkins\jenkins-slave\workspace\lugin_Jenkins_investigation-XMH53YEN2PKRRDIEGSSOM3JEJOBRY257ATPQFDZAASG7YO2URE4Q\m\target\it\MJAVADOC-365\build.log, f:\jenkins\jenkins-slave\workspace\lugin_Jenkins_investigation-XMH53YEN2PKRRDIEGSSOM3JEJOBRY257ATPQFDZAASG7YO2URE4Q\m\target\it\MJAVADOC-369\build.log, f:\jenkins\jenkins-slave\workspace\lugin_Jenkins_investigation-XMH53YEN2PKRRDIEGSSOM3JEJOBRY257ATPQFDZAASG7YO2URE4Q\m\target\it\MJAVADOC-384\build.log, f:\jenkins\jenkins-slave\workspace\lugin_Jenkins_investigation-XMH53YEN2PKRRDIEGSSOM3JEJOBRY257ATPQFDZAASG7YO2URE4Q\m\target\it\MJAVADOC-407\build.log, f:\jenkins\jenkins-slave\workspace\lugin_Jenkins_investigation-XMH53YEN2PKRRDIEGSSOM3JEJOBRY257ATPQFDZAASG7YO2URE4Q\m\target\it\MJAVADOC-414\build.log, f:\jenkins\jenkins-slave\workspace\lugin_Jenkins_investigation-XMH53YEN2PKRRDIEGSSOM3JEJOBRY257ATPQFDZAASG7YO2URE4Q\m\target\it\MJAVADOC-437\build.log, f:\jenkins\jenkins-slave\workspace\lugin_Jenkins_investigation-XMH53YEN2PKRRDIEGSSOM3JEJOBRY257ATPQFDZAASG7YO2URE4Q\m\target\it\MJAVADOC-494_aggregate-repositories\build.log, f:\jenkins\jenkins-slave\workspace\lugin_Jenkins_investigation-XMH53YEN2PKRRDIEGSSOM3JEJOBRY257ATPQFDZAASG7YO2URE4Q\m\target\it\MJAVADOC-497\build.log, f:\jenkins\jenkins-slave\workspace\lugin_Jenkins_investigation-XMH53YEN2PKRRDIEGSSOM3JEJOBRY257ATPQFDZAASG7YO2URE4Q\m\target\it\MJAVADOC-498_aggr_modulepath\build.log, f:\jenkins\jenkins-slave\workspace\lugin_Jenkins_investigation-XMH53YEN2PKRRDIEGSSOM3JEJOBRY257ATPQFDZAASG7YO2URE4Q\m\target\it\MJAVADOC-498_mm_modulepath\build.log, f:\jenkins\jenkins-slave\workspace\lugin_Jenkins_investigation-XMH53YEN2PKRRDIEGSSOM3JEJOBRY257ATPQFDZAASG7YO2URE4Q\m\target\it\MJAVADOC-498_modulepath\build.log, f:\jenkins\jenkins-slave\workspace\lugin_Jenkins_investigation-XMH53YEN2PKRRDIEGSSOM3JEJOBRY257ATPQFDZAASG7YO2URE4Q\m\target\it\MJAVADOC-508\build.log, f:\jenkins\jenkins-slave\workspace\lugin_Jenkins_investigation-XMH53YEN2PKRRDIEGSSOM3JEJOBRY257ATPQFDZAASG7YO2URE4Q\m\target\it\additional-dependencies-non-aggregate\build.log, f:\jenkins\jenkins-slave\workspace\lugin_Jenkins_investigation-XMH53YEN2PKRRDIEGSSOM3JEJOBRY257ATPQFDZAASG7YO2URE4Q\m\target\it\additional-dependencies\build.log, f:\jenkins\jenkins-slave\workspace\lugin_Jenkins_investigation-XMH53YEN2PKRRDIEGSSOM3JEJOBRY257ATPQFDZAASG7YO2URE4Q\m\target\it\dependencySource-1\build.log, f:\jenkins\jenkins-slave\workspace\lugin_Jenkins_investigation-XMH53YEN2PKRRDIEGSSOM3JEJOBRY257ATPQFDZAASG7YO2URE4Q\m\target\it\dependencySource-2\build.log, f:\jenkins\jenkins-slave\workspace\lugin_Jenkins_investigation-XMH53YEN2PKRRDIEGSSOM3JEJOBRY257ATPQFDZAASG7YO2URE4Q\m\target\it\dependencySource-3\build.log, f:\jenkins\jenkins-slave\workspace\lugin_Jenkins_investigation-XMH53YEN2PKRRDIEGSSOM3JEJOBRY257ATPQFDZAASG7YO2URE4Q\m\target\it\dependencySource-4\build.log, f:\jenkins\jenkins-slave\workspace\lugin_Jenkins_investigation-XMH53YEN2PKRRDIEGSSOM3JEJOBRY257ATPQFDZAASG7YO2URE4Q\m\target\it\detectLinks\build.log, f:\jenkins\jenkins-slave\workspace\lugin_Jenkins_investigation-XMH53YEN2PKRRDIEGSSOM3JEJOBRY257ATPQFDZAASG7YO2URE4Q\m\target\it\javadoc-fix\build.log, f:\jenkins\jenkins-slave\workspace\lugin_Jenkins_investigation-XMH53YEN2PKRRDIEGSSOM3JEJOBRY257ATPQFDZAASG7YO2URE4Q\m\target\it\site-failOnError\build.log]
[windows-jdk10] Finished parsing Maven Invoker results (found 35)
[windows-jdk10] [withMaven] junitPublisher - Archive test results for Maven artifact org.apache.maven.plugins:maven-javadoc-plugin:3.0.1-SNAPSHOT generated by maven-surefire-plugin:test (default-test): m\target\surefire-reports\*.xml
[windows-jdk10] Recording test results
[Pipeline] [windows-jdk10] // withMaven
[Pipeline] [windows-jdk10] cleanWs
[windows-jdk10] [WS-CLEANUP] Deleting project workspace...[WS-CLEANUP] done
[Pipeline] [windows-jdk10] cleanWs
[windows-jdk10] [WS-CLEANUP] Deleting project workspace...[WS-CLEANUP] done
[Pipeline] [windows-jdk10] }
[Pipeline] [windows-jdk10] // stage
[Pipeline] [windows-jdk10] }
[Pipeline] [windows-jdk10] // node
[Pipeline] [windows-jdk10] }
[windows-jdk10] Failed in branch windows-jdk10
[Pipeline] // parallel
[Pipeline] stage
[Pipeline] { (Notifications)
[Pipeline] echo
Build result: FAILURE
[Pipeline] jiraIssueSelector
[Pipeline] emailext
Mime
  • Unnamed multipart/mixed (inline, None, 0 bytes)
View raw message