maven-notifications mailing list archives

Site index · List index
Message view « Date » · « Thread »
Top « Date » · « Thread »
From Apache Jenkins Server <jenk...@builds.apache.org>
Subject Build failed in Jenkins: Maven TLP » maven-shared-utils » MSHARED-685 #17
Date Fri, 14 Sep 2018 04:30:46 GMT
See https://builds.apache.org/job/maven-box/job/maven-shared-utils/job/MSHARED-685/17/

No changes.

3 tests failed.
FAILED:  org.apache.maven.shared.utils.io.DirectoryScannerTest.checkSymlinkBehaviour

Error Message:
expected:<9> but was:<11>

Stack Trace:
java.lang.AssertionError: expected:<9> but was:<11>
	at org.apache.maven.shared.utils.io.DirectoryScannerTest.checkSymlinkBehaviour(DirectoryScannerTest.java:151)


FAILED:  org.apache.maven.shared.utils.io.DirectoryScannerTest.checkSymlinkBehaviour

Error Message:
expected:<9> but was:<11>

Stack Trace:
java.lang.AssertionError: expected:<9> but was:<11>
	at org.apache.maven.shared.utils.io.DirectoryScannerTest.checkSymlinkBehaviour(DirectoryScannerTest.java:151)


FAILED:  org.apache.maven.shared.utils.io.DirectoryScannerTest.checkSymlinkBehaviour

Error Message:
expected:<9> but was:<11>

Stack Trace:
java.lang.AssertionError: expected:<9> but was:<11>
	at org.apache.maven.shared.utils.io.DirectoryScannerTest.checkSymlinkBehaviour(DirectoryScannerTest.java:151)




Build log:
[...truncated 1.75 MB...]
[windows-jdk10] [INFO] Downloaded from central: https://repo.maven.apache.org/maven2/org/apache/maven/maven-repository-metadata/2.0.6/maven-repository-metadata-2.0.6.pom
(1.9 kB at 264 kB/s)
[windows-jdk10] [INFO] Downloading from central: https://repo.maven.apache.org/maven2/org/apache/maven/maven-artifact/2.0.6/maven-artifact-2.0.6.pom
[windows-jdk10] [INFO] Downloaded from central: https://repo.maven.apache.org/maven2/org/apache/maven/maven-artifact/2.0.6/maven-artifact-2.0.6.pom
(1.6 kB at 225 kB/s)
[windows-jdk10] [INFO] Downloading from central: https://repo.maven.apache.org/maven2/org/apache/maven/maven-plugin-registry/2.0.6/maven-plugin-registry-2.0.6.pom
[windows-jdk10] [INFO] Downloaded from central: https://repo.maven.apache.org/maven2/org/apache/maven/maven-plugin-registry/2.0.6/maven-plugin-registry-2.0.6.pom
(1.9 kB at 324 kB/s)
[windows-jdk10] [INFO] Downloading from central: https://repo.maven.apache.org/maven2/org/apache/maven/maven-core/2.0.6/maven-core-2.0.6.pom
[windows-jdk10] [INFO] Downloaded from central: https://repo.maven.apache.org/maven2/org/apache/maven/maven-core/2.0.6/maven-core-2.0.6.pom
(6.7 kB at 959 kB/s)
[windows-jdk10] [INFO] Downloading from central: https://repo.maven.apache.org/maven2/org/apache/maven/maven-plugin-parameter-documenter/2.0.6/maven-plugin-parameter-documenter-2.0.6.pom
[windows-jdk10] [INFO] Downloaded from central: https://repo.maven.apache.org/maven2/org/apache/maven/maven-plugin-parameter-documenter/2.0.6/maven-plugin-parameter-documenter-2.0.6.pom
(1.9 kB at 273 kB/s)
[windows-jdk10] [INFO] Downloading from central: https://repo.maven.apache.org/maven2/org/apache/maven/reporting/maven-reporting-api/2.0.6/maven-reporting-api-2.0.6.pom
[windows-jdk10] [INFO] Downloaded from central: https://repo.maven.apache.org/maven2/org/apache/maven/reporting/maven-reporting-api/2.0.6/maven-reporting-api-2.0.6.pom
(1.8 kB at 292 kB/s)
[windows-jdk10] [INFO] Downloading from central: https://repo.maven.apache.org/maven2/org/apache/maven/reporting/maven-reporting/2.0.6/maven-reporting-2.0.6.pom
[windows-jdk10] [INFO] Downloaded from central: https://repo.maven.apache.org/maven2/org/apache/maven/reporting/maven-reporting/2.0.6/maven-reporting-2.0.6.pom
(1.4 kB at 240 kB/s)
[windows-jdk10] [INFO] Downloading from central: https://repo.maven.apache.org/maven2/org/apache/maven/doxia/doxia-sink-api/1.0-alpha-7/doxia-sink-api-1.0-alpha-7.pom
[windows-jdk10] [INFO] Downloaded from central: https://repo.maven.apache.org/maven2/org/apache/maven/doxia/doxia-sink-api/1.0-alpha-7/doxia-sink-api-1.0-alpha-7.pom
(424 B at 71 kB/s)
[windows-jdk10] [INFO] Downloading from central: https://repo.maven.apache.org/maven2/org/apache/maven/doxia/doxia/1.0-alpha-7/doxia-1.0-alpha-7.pom
[windows-jdk10] [INFO] Downloaded from central: https://repo.maven.apache.org/maven2/org/apache/maven/doxia/doxia/1.0-alpha-7/doxia-1.0-alpha-7.pom
(3.9 kB at 559 kB/s)
[windows-jdk10] [INFO] Downloading from central: https://repo.maven.apache.org/maven2/org/apache/maven/maven-error-diagnostics/2.0.6/maven-error-diagnostics-2.0.6.pom
[windows-jdk10] [INFO] Downloaded from central: https://repo.maven.apache.org/maven2/org/apache/maven/maven-error-diagnostics/2.0.6/maven-error-diagnostics-2.0.6.pom
(1.7 kB at 284 kB/s)
[windows-jdk10] [INFO] Downloading from central: https://repo.maven.apache.org/maven2/commons-cli/commons-cli/1.0/commons-cli-1.0.pom
[windows-jdk10] [INFO] Downloaded from central: https://repo.maven.apache.org/maven2/commons-cli/commons-cli/1.0/commons-cli-1.0.pom
(2.1 kB at 351 kB/s)
[windows-jdk10] [INFO] Downloading from central: https://repo.maven.apache.org/maven2/org/apache/maven/maven-plugin-api/2.0.6/maven-plugin-api-2.0.6.pom
[windows-jdk10] [INFO] Downloaded from central: https://repo.maven.apache.org/maven2/org/apache/maven/maven-plugin-api/2.0.6/maven-plugin-api-2.0.6.pom
(1.5 kB at 242 kB/s)
[windows-jdk10] [INFO] Downloading from central: https://repo.maven.apache.org/maven2/org/apache/maven/maven-plugin-descriptor/2.0.6/maven-plugin-descriptor-2.0.6.pom
[windows-jdk10] [INFO] Downloaded from central: https://repo.maven.apache.org/maven2/org/apache/maven/maven-plugin-descriptor/2.0.6/maven-plugin-descriptor-2.0.6.pom
(2.0 kB at 336 kB/s)
[windows-jdk10] [INFO] Downloading from central: https://repo.maven.apache.org/maven2/org/apache/maven/maven-monitor/2.0.6/maven-monitor-2.0.6.pom
[windows-jdk10] [INFO] Downloaded from central: https://repo.maven.apache.org/maven2/org/apache/maven/maven-monitor/2.0.6/maven-monitor-2.0.6.pom
(1.3 kB at 209 kB/s)
[windows-jdk10] [INFO] Downloading from central: https://repo.maven.apache.org/maven2/org/codehaus/plexus/plexus-interpolation/1.12/plexus-interpolation-1.12.pom
[windows-jdk10] [INFO] Downloaded from central: https://repo.maven.apache.org/maven2/org/codehaus/plexus/plexus-interpolation/1.12/plexus-interpolation-1.12.pom
(889 B at 148 kB/s)
[windows-jdk10] [INFO] Downloading from central: https://repo.maven.apache.org/maven2/org/sonatype/plexus/plexus-build-api/0.0.4/plexus-build-api-0.0.4.pom
[windows-jdk10] [INFO] Downloaded from central: https://repo.maven.apache.org/maven2/org/sonatype/plexus/plexus-build-api/0.0.4/plexus-build-api-0.0.4.pom
(2.9 kB at 477 kB/s)
[windows-jdk10] [INFO] Downloading from central: https://repo.maven.apache.org/maven2/org/sonatype/spice/spice-parent/10/spice-parent-10.pom
[windows-jdk10] [INFO] Downloaded from central: https://repo.maven.apache.org/maven2/org/sonatype/spice/spice-parent/10/spice-parent-10.pom
(3.0 kB at 431 kB/s)
[windows-jdk10] [INFO] Downloading from central: https://repo.maven.apache.org/maven2/org/sonatype/forge/forge-parent/3/forge-parent-3.pom
[windows-jdk10] [INFO] Downloaded from central: https://repo.maven.apache.org/maven2/org/sonatype/forge/forge-parent/3/forge-parent-3.pom
(5.0 kB at 719 kB/s)
[windows-jdk10] [INFO] Downloading from central: https://repo.maven.apache.org/maven2/org/codehaus/plexus/plexus-utils/1.5.8/plexus-utils-1.5.8.pom
[windows-jdk10] [INFO] Downloaded from central: https://repo.maven.apache.org/maven2/org/codehaus/plexus/plexus-utils/1.5.8/plexus-utils-1.5.8.pom
(8.1 kB at 1.2 MB/s)
[windows-jdk10] [INFO] Downloading from central: https://repo.maven.apache.org/maven2/org/codehaus/plexus/plexus-resources/1.0-alpha-7/plexus-resources-1.0-alpha-7.pom
[windows-jdk10] [INFO] Downloaded from central: https://repo.maven.apache.org/maven2/org/codehaus/plexus/plexus-resources/1.0-alpha-7/plexus-resources-1.0-alpha-7.pom
(1.4 kB at 194 kB/s)
[windows-jdk10] [INFO] Downloading from central: https://repo.maven.apache.org/maven2/org/codehaus/plexus/plexus-components/1.1.17/plexus-components-1.1.17.pom
[windows-jdk10] [INFO] Downloaded from central: https://repo.maven.apache.org/maven2/org/codehaus/plexus/plexus-components/1.1.17/plexus-components-1.1.17.pom
(5.2 kB at 102 kB/s)
[windows-jdk10] [INFO] Downloading from central: https://repo.maven.apache.org/maven2/org/codehaus/plexus/plexus/2.0.5/plexus-2.0.5.pom
[windows-jdk10] [INFO] Downloaded from central: https://repo.maven.apache.org/maven2/org/codehaus/plexus/plexus/2.0.5/plexus-2.0.5.pom
(17 kB at 1.9 MB/s)
[windows-jdk10] [INFO] Downloading from central: https://repo.maven.apache.org/maven2/org/apache/velocity/velocity/1.7/velocity-1.7.pom
[windows-jdk10] [INFO] Downloaded from central: https://repo.maven.apache.org/maven2/org/apache/velocity/velocity/1.7/velocity-1.7.pom
(11 kB at 1.4 MB/s)
[windows-jdk10] [INFO] Downloading from central: https://repo.maven.apache.org/maven2/commons-lang/commons-lang/2.4/commons-lang-2.4.pom
[windows-jdk10] [INFO] Downloaded from central: https://repo.maven.apache.org/maven2/commons-lang/commons-lang/2.4/commons-lang-2.4.pom
(14 kB at 1.3 MB/s)
[windows-jdk10] [INFO] Downloading from central: https://repo.maven.apache.org/maven2/org/apache/maven/shared/maven-artifact-resolver/1.0/maven-artifact-resolver-1.0.jar
[windows-jdk10] [INFO] Downloading from central: https://repo.maven.apache.org/maven2/org/apache/maven/shared/maven-filtering/1.1/maven-filtering-1.1.jar
[windows-jdk10] [INFO] Downloading from central: https://repo.maven.apache.org/maven2/org/sonatype/plexus/plexus-build-api/0.0.4/plexus-build-api-0.0.4.jar
[windows-jdk10] [INFO] Downloading from central: https://repo.maven.apache.org/maven2/junit/junit/3.8.1/junit-3.8.1.jar
[windows-jdk10] [INFO] Downloading from central: https://repo.maven.apache.org/maven2/org/codehaus/plexus/plexus-resources/1.0-alpha-7/plexus-resources-1.0-alpha-7.jar
[windows-jdk10] [INFO] Downloaded from central: https://repo.maven.apache.org/maven2/org/sonatype/plexus/plexus-build-api/0.0.4/plexus-build-api-0.0.4.jar
(6.8 kB at 401 kB/s)
[windows-jdk10] [INFO] Downloading from central: https://repo.maven.apache.org/maven2/org/codehaus/plexus/plexus-interpolation/1.12/plexus-interpolation-1.12.jar
[windows-jdk10] [INFO] Downloaded from central: https://repo.maven.apache.org/maven2/org/apache/maven/shared/maven-artifact-resolver/1.0/maven-artifact-resolver-1.0.jar
(14 kB at 754 kB/s)
[windows-jdk10] [INFO] Downloading from central: https://repo.maven.apache.org/maven2/org/codehaus/plexus/plexus-utils/1.5.15/plexus-utils-1.5.15.jar
[windows-jdk10] [INFO] Downloaded from central: https://repo.maven.apache.org/maven2/org/apache/maven/shared/maven-filtering/1.1/maven-filtering-1.1.jar
(43 kB at 2.2 MB/s)
[windows-jdk10] [INFO] Downloading from central: https://repo.maven.apache.org/maven2/org/apache/velocity/velocity/1.7/velocity-1.7.jar
[windows-jdk10] [INFO] Downloaded from central: https://repo.maven.apache.org/maven2/org/codehaus/plexus/plexus-resources/1.0-alpha-7/plexus-resources-1.0-alpha-7.jar
(23 kB at 1.2 MB/s)
[windows-jdk10] [INFO] Downloading from central: https://repo.maven.apache.org/maven2/commons-lang/commons-lang/2.4/commons-lang-2.4.jar
[windows-jdk10] [INFO] Downloaded from central: https://repo.maven.apache.org/maven2/junit/junit/3.8.1/junit-3.8.1.jar
(121 kB at 4.7 MB/s)
[windows-jdk10] [INFO] Downloaded from central: https://repo.maven.apache.org/maven2/org/codehaus/plexus/plexus-interpolation/1.12/plexus-interpolation-1.12.jar
(61 kB at 2.0 MB/s)
[windows-jdk10] [INFO] Downloaded from central: https://repo.maven.apache.org/maven2/commons-lang/commons-lang/2.4/commons-lang-2.4.jar
(262 kB at 6.7 MB/s)
[windows-jdk10] [INFO] Downloaded from central: https://repo.maven.apache.org/maven2/org/codehaus/plexus/plexus-utils/1.5.15/plexus-utils-1.5.15.jar
(228 kB at 5.6 MB/s)
[windows-jdk10] [INFO] Downloaded from central: https://repo.maven.apache.org/maven2/org/apache/velocity/velocity/1.7/velocity-1.7.jar
(450 kB at 9.2 MB/s)
[windows-jdk10] [INFO] Downloading from central: https://repo.maven.apache.org/maven2/org/apache/apache-jar-resource-bundle/1.4/apache-jar-resource-bundle-1.4.jar
[windows-jdk10] [INFO] Downloaded from central: https://repo.maven.apache.org/maven2/org/apache/apache-jar-resource-bundle/1.4/apache-jar-resource-bundle-1.4.jar
(12 kB at 1.8 MB/s)
[Pipeline] [windows-jdk9] }
[Pipeline] [windows-jdk9] // dir
[windows-jdk8] [INFO] There are 7 errors reported by Checkstyle 6.1.1 with config/maven_checks.xml
ruleset.
[windows-jdk8] [INFO] Ignored 7 errors, 0 violation remaining.
[windows-jdk8] [INFO] ------------------------------------------------------------------------
[windows-jdk8] [INFO] BUILD SUCCESS
[windows-jdk8] [INFO] ------------------------------------------------------------------------
[windows-jdk8] [INFO] Total time: 44.204 s
[windows-jdk8] [INFO] Finished at: 2018-09-14T04:30:33Z
[windows-jdk8] [INFO] Final Memory: 40M/650M
[windows-jdk8] [INFO] ------------------------------------------------------------------------
[windows-jdk8] [WARNING] The requested profile "run-its" could not be activated because it
does not exist.
[windows-jdk8] [INFO] [jenkins-event-spy] Generated F:\jenkins\jenkins-slave\workspace\en-shared-utils_MSHARED-685-Q2MWYU7VOQCFPEJWLT5LHQAKOESOMAFIBACPECQBOUQDB5P6KFAQ@tmp\withMaven3a9af669\maven-spy-20180914-042949-3603981221694939160994.log
[windows-jdk8] Picked up JAVA_TOOL_OPTIONS: -Dmaven.ext.class.path="f:\jenkins\jenkins-slave\workspace\en-shared-utils_MSHARED-685-Q2MWYU7VOQCFPEJWLT5LHQAKOESOMAFIBACPECQBOUQDB5P6KFAQ@tmp\withMaven3a9af669\pipeline-maven-spy.jar"
-Dorg.jenkinsci.plugins.pipeline.maven.reportsFolder="f:\jenkins\jenkins-slave\workspace\en-shared-utils_MSHARED-685-Q2MWYU7VOQCFPEJWLT5LHQAKOESOMAFIBACPECQBOUQDB5P6KFAQ@tmp\withMaven3a9af669"

[windows-jdk10] [INFO] 
[windows-jdk10] [INFO] --- maven-resources-plugin:2.7:resources (default-resources) @ maven-shared-utils
---
[windows-jdk10] [INFO] Downloading from central: https://repo.maven.apache.org/maven2/org/codehaus/plexus/plexus-utils/3.0.15/plexus-utils-3.0.15.pom
[windows-jdk10] [INFO] Downloaded from central: https://repo.maven.apache.org/maven2/org/codehaus/plexus/plexus-utils/3.0.15/plexus-utils-3.0.15.pom
(3.1 kB at 524 kB/s)
[windows-jdk10] [INFO] Downloading from central: https://repo.maven.apache.org/maven2/org/apache/maven/shared/maven-filtering/1.2/maven-filtering-1.2.pom
[windows-jdk10] [INFO] Downloaded from central: https://repo.maven.apache.org/maven2/org/apache/maven/shared/maven-filtering/1.2/maven-filtering-1.2.pom
(6.5 kB at 814 kB/s)
[windows-jdk10] [INFO] Downloading from central: https://repo.maven.apache.org/maven2/org/apache/maven/shared/maven-shared-components/19/maven-shared-components-19.pom
[windows-jdk10] [INFO] Downloaded from central: https://repo.maven.apache.org/maven2/org/apache/maven/shared/maven-shared-components/19/maven-shared-components-19.pom
(6.4 kB at 707 kB/s)
[windows-jdk10] [INFO] Downloading from central: https://repo.maven.apache.org/maven2/org/apache/maven/shared/maven-shared-utils/0.3/maven-shared-utils-0.3.pom
[windows-jdk10] [INFO] Downloaded from central: https://repo.maven.apache.org/maven2/org/apache/maven/shared/maven-shared-utils/0.3/maven-shared-utils-0.3.pom
(4.0 kB at 578 kB/s)
[windows-jdk10] [INFO] Downloading from central: https://repo.maven.apache.org/maven2/org/apache/maven/shared/maven-shared-components/18/maven-shared-components-18.pom
[windows-jdk10] [INFO] Downloaded from central: https://repo.maven.apache.org/maven2/org/apache/maven/shared/maven-shared-components/18/maven-shared-components-18.pom
(4.9 kB at 822 kB/s)
[windows-jdk10] [INFO] Downloading from central: https://repo.maven.apache.org/maven2/org/apache/maven/maven-parent/22/maven-parent-22.pom
[windows-jdk10] [INFO] Downloaded from central: https://repo.maven.apache.org/maven2/org/apache/maven/maven-parent/22/maven-parent-22.pom
(30 kB at 4.2 MB/s)
[windows-jdk10] [INFO] Downloading from central: https://repo.maven.apache.org/maven2/org/apache/apache/11/apache-11.pom
[windows-jdk10] [INFO] Downloaded from central: https://repo.maven.apache.org/maven2/org/apache/apache/11/apache-11.pom
(15 kB at 2.1 MB/s)
[windows-jdk10] [INFO] Downloading from central: https://repo.maven.apache.org/maven2/org/codehaus/plexus/plexus-interpolation/1.19/plexus-interpolation-1.19.pom
[windows-jdk10] [INFO] Downloaded from central: https://repo.maven.apache.org/maven2/org/codehaus/plexus/plexus-interpolation/1.19/plexus-interpolation-1.19.pom
(1.0 kB at 147 kB/s)
[windows-jdk10] [INFO] Downloading from central: https://repo.maven.apache.org/maven2/org/codehaus/plexus/plexus-components/1.3.1/plexus-components-1.3.1.pom
[windows-jdk10] [INFO] Downloaded from central: https://repo.maven.apache.org/maven2/org/codehaus/plexus/plexus-components/1.3.1/plexus-components-1.3.1.pom
(3.1 kB at 438 kB/s)
[windows-jdk10] [INFO] Downloading from central: https://repo.maven.apache.org/maven2/org/codehaus/plexus/plexus-utils/3.0.15/plexus-utils-3.0.15.jar
[windows-jdk10] [INFO] Downloading from central: https://repo.maven.apache.org/maven2/org/codehaus/plexus/plexus-interpolation/1.19/plexus-interpolation-1.19.jar
[windows-jdk10] [INFO] Downloading from central: https://repo.maven.apache.org/maven2/org/apache/maven/shared/maven-filtering/1.2/maven-filtering-1.2.jar
[windows-jdk10] [INFO] Downloading from central: https://repo.maven.apache.org/maven2/org/apache/maven/shared/maven-shared-utils/0.3/maven-shared-utils-0.3.jar
[windows-jdk10] [INFO] Downloaded from central: https://repo.maven.apache.org/maven2/org/apache/maven/shared/maven-filtering/1.2/maven-filtering-1.2.jar
(44 kB at 2.8 MB/s)
[windows-jdk10] [INFO] Downloaded from central: https://repo.maven.apache.org/maven2/org/codehaus/plexus/plexus-interpolation/1.19/plexus-interpolation-1.19.jar
(62 kB at 3.9 MB/s)
[windows-jdk10] [INFO] Downloaded from central: https://repo.maven.apache.org/maven2/org/apache/maven/shared/maven-shared-utils/0.3/maven-shared-utils-0.3.jar
(155 kB at 8.6 MB/s)
[windows-jdk10] [INFO] Downloaded from central: https://repo.maven.apache.org/maven2/org/codehaus/plexus/plexus-utils/3.0.15/plexus-utils-3.0.15.jar
(239 kB at 10 MB/s)
[windows-jdk10] [INFO] Using 'UTF-8' encoding to copy filtered resources.
[windows-jdk10] [INFO] Copying 1 resource
[windows-jdk10] [INFO] Copying 3 resources
[windows-jdk10] [INFO] 
[windows-jdk10] [INFO] --- maven-compiler-plugin:3.5.1:compile (default-compile) @ maven-shared-utils
---
[windows-jdk10] [INFO] Downloading from central: https://repo.maven.apache.org/maven2/org/apache/maven/maven-toolchain/2.2.1/maven-toolchain-2.2.1.pom
[windows-jdk10] [INFO] Downloaded from central: https://repo.maven.apache.org/maven2/org/apache/maven/maven-toolchain/2.2.1/maven-toolchain-2.2.1.pom
(3.3 kB at 478 kB/s)
[windows-jdk10] [INFO] Downloading from central: https://repo.maven.apache.org/maven2/org/apache/maven/shared/maven-shared-incremental/1.1/maven-shared-incremental-1.1.pom
[windows-jdk10] [INFO] Downloaded from central: https://repo.maven.apache.org/maven2/org/apache/maven/shared/maven-shared-incremental/1.1/maven-shared-incremental-1.1.pom
(4.7 kB at 677 kB/s)
[windows-jdk10] [INFO] Downloading from central: https://repo.maven.apache.org/maven2/org/apache/maven/shared/maven-shared-utils/0.1/maven-shared-utils-0.1.pom
[windows-jdk10] [INFO] Downloaded from central: https://repo.maven.apache.org/maven2/org/apache/maven/shared/maven-shared-utils/0.1/maven-shared-utils-0.1.pom
(4.0 kB at 578 kB/s)
[windows-jdk10] [INFO] Downloading from central: https://repo.maven.apache.org/maven2/org/codehaus/plexus/plexus-compiler-api/2.7/plexus-compiler-api-2.7.pom
[windows-jdk10] [INFO] Downloaded from central: https://repo.maven.apache.org/maven2/org/codehaus/plexus/plexus-compiler-api/2.7/plexus-compiler-api-2.7.pom
(891 B at 111 kB/s)
[windows-jdk10] [INFO] Downloading from central: https://repo.maven.apache.org/maven2/org/codehaus/plexus/plexus-compiler/2.7/plexus-compiler-2.7.pom
[windows-jdk10] [INFO] Downloaded from central: https://repo.maven.apache.org/maven2/org/codehaus/plexus/plexus-compiler/2.7/plexus-compiler-2.7.pom
(4.9 kB at 705 kB/s)
[windows-jdk10] [INFO] Downloading from central: https://repo.maven.apache.org/maven2/org/codehaus/plexus/plexus-components/4.0/plexus-components-4.0.pom
[windows-jdk10] [INFO] Downloaded from central: https://repo.maven.apache.org/maven2/org/codehaus/plexus/plexus-components/4.0/plexus-components-4.0.pom
(2.7 kB at 443 kB/s)
[windows-jdk10] [INFO] Downloading from central: https://repo.maven.apache.org/maven2/org/codehaus/plexus/plexus-compiler-manager/2.7/plexus-compiler-manager-2.7.pom
[windows-jdk10] [INFO] Downloaded from central: https://repo.maven.apache.org/maven2/org/codehaus/plexus/plexus-compiler-manager/2.7/plexus-compiler-manager-2.7.pom
(711 B at 102 kB/s)
[windows-jdk10] [INFO] Downloading from central: https://repo.maven.apache.org/maven2/org/codehaus/plexus/plexus-compiler-javac/2.7/plexus-compiler-javac-2.7.pom
[windows-jdk10] [INFO] Downloaded from central: https://repo.maven.apache.org/maven2/org/codehaus/plexus/plexus-compiler-javac/2.7/plexus-compiler-javac-2.7.pom
(792 B at 88 kB/s)
[windows-jdk10] [INFO] Downloading from central: https://repo.maven.apache.org/maven2/org/codehaus/plexus/plexus-compilers/2.7/plexus-compilers-2.7.pom
[windows-jdk10] [INFO] Downloaded from central: https://repo.maven.apache.org/maven2/org/codehaus/plexus/plexus-compilers/2.7/plexus-compilers-2.7.pom
(1.4 kB at 154 kB/s)
[windows-jdk10] [INFO] Downloading from central: https://repo.maven.apache.org/maven2/org/apache/maven/maven-toolchain/2.2.1/maven-toolchain-2.2.1.jar
[windows-jdk10] [INFO] Downloading from central: https://repo.maven.apache.org/maven2/org/apache/maven/shared/maven-shared-incremental/1.1/maven-shared-incremental-1.1.jar
[windows-jdk10] [INFO] Downloading from central: https://repo.maven.apache.org/maven2/org/codehaus/plexus/plexus-compiler-manager/2.7/plexus-compiler-manager-2.7.jar
[windows-jdk10] [INFO] Downloading from central: https://repo.maven.apache.org/maven2/org/codehaus/plexus/plexus-compiler-api/2.7/plexus-compiler-api-2.7.jar
[windows-jdk10] [INFO] Downloading from central: https://repo.maven.apache.org/maven2/org/codehaus/plexus/plexus-compiler-javac/2.7/plexus-compiler-javac-2.7.jar
[windows-jdk10] [INFO] Downloaded from central: https://repo.maven.apache.org/maven2/org/codehaus/plexus/plexus-compiler-manager/2.7/plexus-compiler-manager-2.7.jar
(4.7 kB at 468 kB/s)
[windows-jdk10] [INFO] Downloaded from central: https://repo.maven.apache.org/maven2/org/codehaus/plexus/plexus-compiler-api/2.7/plexus-compiler-api-2.7.jar
(26 kB at 2.3 MB/s)
[windows-jdk10] [INFO] Downloaded from central: https://repo.maven.apache.org/maven2/org/codehaus/plexus/plexus-compiler-javac/2.7/plexus-compiler-javac-2.7.jar
(19 kB at 1.9 MB/s)
[windows-jdk10] [INFO] Downloaded from central: https://repo.maven.apache.org/maven2/org/apache/maven/maven-toolchain/2.2.1/maven-toolchain-2.2.1.jar
(38 kB at 3.4 MB/s)
[windows-jdk10] [INFO] Downloaded from central: https://repo.maven.apache.org/maven2/org/apache/maven/shared/maven-shared-incremental/1.1/maven-shared-incremental-1.1.jar
(14 kB at 615 kB/s)
[windows-jdk10] [INFO] Changes detected - recompiling the module!
[windows-jdk10] [INFO] Compiling 69 source files to f:\jenkins\jenkins-slave\workspace\en-shared-utils_MSHARED-685-Q2MWYU7VOQCFPEJWLT5LHQAKOESOMAFIBACPECQBOUQDB5P6KFAQ\m\target\classes
[Pipeline] [windows-jdk9] }
[windows-jdk9] [withMaven] junitPublisher - Archive test results for Maven artifact org.apache.maven.shared:maven-shared-utils:3.2.2-SNAPSHOT
generated by maven-surefire-plugin:test (default-test): m\target\surefire-reports\*.xml
[windows-jdk9] Recording test results
[Pipeline] [windows-jdk9] // withMaven
[Pipeline] [windows-jdk8] }
[Pipeline] [windows-jdk9] cleanWs
[Pipeline] [windows-jdk8] // dir
[windows-jdk9] [WS-CLEANUP] Deleting project workspace...[WS-CLEANUP] done
[windows-jdk10] [INFO] /f:/jenkins/jenkins-slave/workspace/en-shared-utils_MSHARED-685-Q2MWYU7VOQCFPEJWLT5LHQAKOESOMAFIBACPECQBOUQDB5P6KFAQ/m/src/main/java/org/apache/maven/shared/utils/xml/Xpp3DomBuilder.java:
Some input files use or override a deprecated API.
[windows-jdk10] [INFO] /f:/jenkins/jenkins-slave/workspace/en-shared-utils_MSHARED-685-Q2MWYU7VOQCFPEJWLT5LHQAKOESOMAFIBACPECQBOUQDB5P6KFAQ/m/src/main/java/org/apache/maven/shared/utils/xml/Xpp3DomBuilder.java:
Recompile with -Xlint:deprecation for details.
[windows-jdk10] [INFO] 
[windows-jdk10] [INFO] --- maven-resources-plugin:2.7:testResources (default-testResources)
@ maven-shared-utils ---
[windows-jdk10] [INFO] Using 'UTF-8' encoding to copy filtered resources.
[windows-jdk10] [INFO] Copying 21 resources
[windows-jdk10] [INFO] Copying 3 resources
[windows-jdk10] [INFO] 
[windows-jdk10] [INFO] --- maven-compiler-plugin:3.5.1:testCompile (default-testCompile) @
maven-shared-utils ---
[windows-jdk10] [INFO] Changes detected - recompiling the module!
[windows-jdk10] [INFO] Compiling 31 source files to f:\jenkins\jenkins-slave\workspace\en-shared-utils_MSHARED-685-Q2MWYU7VOQCFPEJWLT5LHQAKOESOMAFIBACPECQBOUQDB5P6KFAQ\m\target\test-classes
[windows-jdk10] [INFO] /f:/jenkins/jenkins-slave/workspace/en-shared-utils_MSHARED-685-Q2MWYU7VOQCFPEJWLT5LHQAKOESOMAFIBACPECQBOUQDB5P6KFAQ/m/src/test/java/org/apache/maven/shared/utils/io/SymlinkTestSetup.java:
Some input files use or override a deprecated API.
[windows-jdk10] [INFO] /f:/jenkins/jenkins-slave/workspace/en-shared-utils_MSHARED-685-Q2MWYU7VOQCFPEJWLT5LHQAKOESOMAFIBACPECQBOUQDB5P6KFAQ/m/src/test/java/org/apache/maven/shared/utils/io/SymlinkTestSetup.java:
Recompile with -Xlint:deprecation for details.
[windows-jdk10] [INFO] 
[windows-jdk10] [INFO] --- maven-surefire-plugin:2.20.1:test (default-test) @ maven-shared-utils
---
[windows-jdk10] [INFO] Downloading from central: https://repo.maven.apache.org/maven2/org/apache/maven/surefire/maven-surefire-common/2.20.1/maven-surefire-common-2.20.1.pom
[windows-jdk10] [INFO] Downloaded from central: https://repo.maven.apache.org/maven2/org/apache/maven/surefire/maven-surefire-common/2.20.1/maven-surefire-common-2.20.1.pom
(9.3 kB at 1.0 MB/s)
[windows-jdk10] [INFO] Downloading from central: https://repo.maven.apache.org/maven2/org/apache/maven/plugin-tools/maven-plugin-annotations/3.3/maven-plugin-annotations-3.3.pom
[windows-jdk10] [INFO] Downloaded from central: https://repo.maven.apache.org/maven2/org/apache/maven/plugin-tools/maven-plugin-annotations/3.3/maven-plugin-annotations-3.3.pom
(1.6 kB at 233 kB/s)
[windows-jdk10] [INFO] Downloading from central: https://repo.maven.apache.org/maven2/org/apache/maven/plugin-tools/maven-plugin-tools/3.3/maven-plugin-tools-3.3.pom
[windows-jdk10] [INFO] Downloaded from central: https://repo.maven.apache.org/maven2/org/apache/maven/plugin-tools/maven-plugin-tools/3.3/maven-plugin-tools-3.3.pom
(13 kB at 1.8 MB/s)
[windows-jdk10] [INFO] Downloading from central: https://repo.maven.apache.org/maven2/org/apache/maven/surefire/surefire-api/2.20.1/surefire-api-2.20.1.pom
[windows-jdk10] [INFO] Downloaded from central: https://repo.maven.apache.org/maven2/org/apache/maven/surefire/surefire-api/2.20.1/surefire-api-2.20.1.pom
(3.7 kB at 261 kB/s)
[windows-jdk10] [INFO] Downloading from central: https://repo.maven.apache.org/maven2/org/apache/maven/surefire/surefire-logger-api/2.20.1/surefire-logger-api-2.20.1.pom
[windows-jdk10] [INFO] Downloaded from central: https://repo.maven.apache.org/maven2/org/apache/maven/surefire/surefire-logger-api/2.20.1/surefire-logger-api-2.20.1.pom
(2.0 kB at 251 kB/s)
[windows-jdk10] [INFO] Downloading from central: https://repo.maven.apache.org/maven2/org/apache/maven/surefire/surefire-booter/2.20.1/surefire-booter-2.20.1.pom
[windows-jdk10] [INFO] Downloaded from central: https://repo.maven.apache.org/maven2/org/apache/maven/surefire/surefire-booter/2.20.1/surefire-booter-2.20.1.pom
(8.5 kB at 1.1 MB/s)
[windows-jdk10] [INFO] Downloading from central: https://repo.maven.apache.org/maven2/junit/junit/4.12/junit-4.12.pom
[windows-jdk10] [INFO] Downloaded from central: https://repo.maven.apache.org/maven2/junit/junit/4.12/junit-4.12.pom
(24 kB at 3.4 MB/s)
[windows-jdk10] [INFO] Downloading from central: https://repo.maven.apache.org/maven2/org/apache/maven/surefire/surefire-logger-api/2.20.1/surefire-logger-api-2.20.1.jar
[windows-jdk10] [INFO] Downloading from central: https://repo.maven.apache.org/maven2/org/apache/maven/surefire/maven-surefire-common/2.20.1/maven-surefire-common-2.20.1.jar
[windows-jdk10] [INFO] Downloading from central: https://repo.maven.apache.org/maven2/org/apache/maven/surefire/surefire-booter/2.20.1/surefire-booter-2.20.1.jar
[windows-jdk10] [INFO] Downloading from central: https://repo.maven.apache.org/maven2/org/apache/maven/plugin-tools/maven-plugin-annotations/3.3/maven-plugin-annotations-3.3.jar
[windows-jdk10] [INFO] Downloading from central: https://repo.maven.apache.org/maven2/org/apache/maven/surefire/surefire-api/2.20.1/surefire-api-2.20.1.jar
[windows-jdk10] [INFO] Downloaded from central: https://repo.maven.apache.org/maven2/org/apache/maven/plugin-tools/maven-plugin-annotations/3.3/maven-plugin-annotations-3.3.jar
(14 kB at 877 kB/s)
[windows-jdk10] [INFO] Downloading from central: https://repo.maven.apache.org/maven2/junit/junit/4.12/junit-4.12.jar
[windows-jdk10] [INFO] Downloaded from central: https://repo.maven.apache.org/maven2/org/apache/maven/surefire/surefire-logger-api/2.20.1/surefire-logger-api-2.20.1.jar
(13 kB at 720 kB/s)
[windows-jdk10] [INFO] Downloaded from central: https://repo.maven.apache.org/maven2/org/apache/maven/surefire/surefire-booter/2.20.1/surefire-booter-2.20.1.jar
(268 kB at 8.4 MB/s)
[windows-jdk10] [INFO] Downloaded from central: https://repo.maven.apache.org/maven2/org/apache/maven/surefire/surefire-api/2.20.1/surefire-api-2.20.1.jar
(183 kB at 5.4 MB/s)
[windows-jdk10] [INFO] Downloaded from central: https://repo.maven.apache.org/maven2/junit/junit/4.12/junit-4.12.jar
(315 kB at 9.3 MB/s)
[windows-jdk10] [INFO] Downloaded from central: https://repo.maven.apache.org/maven2/org/apache/maven/surefire/maven-surefire-common/2.20.1/maven-surefire-common-2.20.1.jar
(509 kB at 13 MB/s)
[windows-jdk10] [INFO] ------------------------------------------------------------------------
[windows-jdk10] [INFO] BUILD FAILURE
[windows-jdk10] [INFO] ------------------------------------------------------------------------
[windows-jdk10] [INFO] Total time: 19.396 s
[windows-jdk10] [INFO] Finished at: 2018-09-14T04:30:37Z
[windows-jdk10] [INFO] Final Memory: 29M/100M
[windows-jdk10] [INFO] ------------------------------------------------------------------------
[windows-jdk10] [WARNING] The requested profile "run-its" could not be activated because it
does not exist.
[windows-jdk10] [INFO] [jenkins-event-spy] Generated F:\jenkins\jenkins-slave\workspace\en-shared-utils_MSHARED-685-Q2MWYU7VOQCFPEJWLT5LHQAKOESOMAFIBACPECQBOUQDB5P6KFAQ@tmp\withMavend8543ddf\maven-spy-20180914-043018-1178936515851012674011.log
[windows-jdk10] [ERROR] Failed to execute goal org.apache.maven.plugins:maven-surefire-plugin:2.20.1:test
(default-test) on project maven-shared-utils: Execution default-test of goal org.apache.maven.plugins:maven-surefire-plugin:2.20.1:test
failed. NullPointerException -> [Help 1]
[windows-jdk10] [ERROR] 
[windows-jdk10] [ERROR] To see the full stack trace of the errors, re-run Maven with the -e
switch.
[windows-jdk10] [ERROR] Re-run Maven using the -X switch to enable full debug logging.
[windows-jdk10] [ERROR] 
[windows-jdk10] [ERROR] For more information about the errors and possible solutions, please
read the following articles:
[windows-jdk10] [ERROR] [Help 1] http://cwiki.apache.org/confluence/display/MAVEN/PluginExecutionException
[Pipeline] [windows-jdk8] }
[windows-jdk8] [withMaven] junitPublisher - Archive test results for Maven artifact org.apache.maven.shared:maven-shared-utils:3.2.2-SNAPSHOT
generated by maven-surefire-plugin:test (default-test): m\target\surefire-reports\*.xml
[windows-jdk8] Recording test results
[Pipeline] [windows-jdk8] // withMaven
[Pipeline] [windows-jdk8] cleanWs
[Pipeline] [windows-jdk9] }
[Pipeline] [windows-jdk10] }
[Pipeline] [windows-jdk9] // stage
[Pipeline] [windows-jdk10] // dir
[Pipeline] [windows-jdk9] }
[Pipeline] [windows-jdk10] }
[windows-jdk8] [WS-CLEANUP] Deleting project workspace...[WS-CLEANUP] done
[windows-jdk10] [withMaven] junitPublisher - Archive test results for Maven artifact org.apache.maven.shared:maven-shared-utils:3.2.2-SNAPSHOT
generated by maven-surefire-plugin:test (default-test): m\target\surefire-reports\*.xml
[windows-jdk10] Recording test results
[windows-jdk10] None of the test reports contained any result
[Pipeline] [windows-jdk9] // node
[Pipeline] [windows-jdk10] // withMaven
[Pipeline] [windows-jdk9] }
[Pipeline] [windows-jdk10] cleanWs
[Pipeline] [windows-jdk8] }
[Pipeline] [windows-jdk8] // stage
[Pipeline] [windows-jdk8] }
[Pipeline] [windows-jdk8] // node
[windows-jdk10] [WS-CLEANUP] Deleting project workspace...[WS-CLEANUP] done
[Pipeline] [windows-jdk8] }
[Pipeline] [windows-jdk10] cleanWs
[windows-jdk10] [WS-CLEANUP] Deleting project workspace...[WS-CLEANUP] done
[Pipeline] [windows-jdk10] }
[Pipeline] [windows-jdk10] // stage
[Pipeline] [windows-jdk10] }
[Pipeline] [windows-jdk10] // node
[Pipeline] [windows-jdk10] }
[windows-jdk10] Failed in branch windows-jdk10
[Pipeline] // parallel
[Pipeline] stage
[Pipeline] { (Notifications)
[Pipeline] echo
Build result: FAILURE
[Pipeline] jiraIssueSelector
[Pipeline] emailext
Mime
  • Unnamed multipart/mixed (inline, None, 0 bytes)
View raw message