maven-notifications mailing list archives

Site index · List index
Message view « Date » · « Thread »
Top « Date » · « Thread »
From Apache Jenkins Server <jenk...@builds.apache.org>
Subject Build failed in Jenkins: Maven TLP » maven-doxia-site » master #13
Date Thu, 09 Aug 2018 11:00:13 GMT
See https://builds.apache.org/job/maven-box/job/maven-doxia-site/job/master/13/

No changes.

No tests ran.

Build log:
Branch indexing
Obtained Jenkinsfile from 3338391f78d85acd80f496fc06d8d73d441c3360
Running in Durability level: MAX_SURVIVABILITY
Loading library jenkins-env@master
Attempting to resolve master from remote references...
 > git --version # timeout=10
 > git ls-remote -h https://gitbox.apache.org/repos/asf/maven-jenkins-env.git # timeout=10
Found match: refs/heads/master revision e29308075d3807040ab7a1edd0d171788929c630
 > git rev-parse --is-inside-work-tree # timeout=10
Fetching changes from the remote Git repository
 > git config remote.origin.url https://gitbox.apache.org/repos/asf/maven-jenkins-env.git
# timeout=10
Fetching without tags
Fetching upstream changes from https://gitbox.apache.org/repos/asf/maven-jenkins-env.git
 > git --version # timeout=10
 > git fetch --no-tags --progress https://gitbox.apache.org/repos/asf/maven-jenkins-env.git
+refs/heads/*:refs/remotes/origin/*
Checking out Revision e29308075d3807040ab7a1edd0d171788929c630 (master)
 > git config core.sparsecheckout # timeout=10
 > git checkout -f e29308075d3807040ab7a1edd0d171788929c630
Commit message: "H31 seemed to have issues."
 > git rev-list --no-walk e29308075d3807040ab7a1edd0d171788929c630 # timeout=10
Loading library jenkins-lib@master
Attempting to resolve master from remote references...
 > git --version # timeout=10
 > git ls-remote -h https://gitbox.apache.org/repos/asf/maven-jenkins-lib.git # timeout=10
Found match: refs/heads/master revision 0f9199b3f10021cdbf9b0df3d1e782048542901e
 > git rev-parse --is-inside-work-tree # timeout=10
Fetching changes from the remote Git repository
 > git config remote.origin.url https://gitbox.apache.org/repos/asf/maven-jenkins-lib.git
# timeout=10
Fetching without tags
Fetching upstream changes from https://gitbox.apache.org/repos/asf/maven-jenkins-lib.git
 > git --version # timeout=10
 > git fetch --no-tags --progress https://gitbox.apache.org/repos/asf/maven-jenkins-lib.git
+refs/heads/*:refs/remotes/origin/*
Checking out Revision 0f9199b3f10021cdbf9b0df3d1e782048542901e (master)
 > git config core.sparsecheckout # timeout=10
 > git checkout -f 0f9199b3f10021cdbf9b0df3d1e782048542901e
Commit message: "ubunut-eu2 is back online."
 > git rev-list --no-walk 0f9199b3f10021cdbf9b0df3d1e782048542901e # timeout=10
[Pipeline] node
Running on websites1 in /home/jenkins/jenkins-slave/workspace/box_maven-doxia-site_master-IVLIM3FD7IHMMFNW5G7AIUYHFYH7R75A6TO3URHNGEW2DEHYMTVQ
[Pipeline] {
[Pipeline] stage
[Pipeline] { (Declarative: Checkout SCM)
[Pipeline] checkout
 > git rev-parse --is-inside-work-tree # timeout=10
Fetching changes from the remote Git repository
 > git config remote.origin.url https://gitbox.apache.org/repos/asf/maven-doxia-site.git
# timeout=10
Fetching without tags
Fetching upstream changes from https://gitbox.apache.org/repos/asf/maven-doxia-site.git
 > git --version # timeout=10
 > git fetch --no-tags --progress https://gitbox.apache.org/repos/asf/maven-doxia-site.git
+refs/heads/*:refs/remotes/origin/*
Checking out Revision 3338391f78d85acd80f496fc06d8d73d441c3360 (master)
 > git config core.sparsecheckout # timeout=10
 > git checkout -f 3338391f78d85acd80f496fc06d8d73d441c3360
Commit message: "updated mpir config after 3.0.0 upgrade in parent pom"
 > git rev-list --no-walk 3338391f78d85acd80f496fc06d8d73d441c3360 # timeout=10
Cleaning workspace
 > git rev-parse --verify HEAD # timeout=10
Resetting working tree
 > git reset --hard # timeout=10
 > git clean -fdx # timeout=10
[Pipeline] }
[Pipeline] // stage
[Pipeline] withEnv
[Pipeline] {
[Pipeline] timeout
Timeout set to expire in 10 min
[Pipeline] {
[Pipeline] timestamps
[Pipeline] {
[Pipeline] ansiColor
[Pipeline] {
[Pipeline] stage
[Pipeline] { (Build)
Stage "Build" skipped due to when conditional
[Pipeline] }
[Pipeline] // stage
[Pipeline] stage
[Pipeline] { (Deploy)
[Pipeline] withMaven
[withMaven] Options: [org.jenkinsci.plugins.pipeline.maven.publishers.GeneratedArtifactsPublisher[disabled=true],
JunitTestsPublisher[disabled=true,healthScaleFactor=,keepLongStdio=false,ignoreAttachments=false],
org.jenkinsci.plugins.pipeline.maven.publishers.FindbugsAnalysisPublisher[disabled='true',
healthy='', unHealthy='', thresholdLimit='low'], org.jenkinsci.plugins.pipeline.maven.publishers.TasksScannerPublisher[disabled='true',
healthy='', unHealthy='', thresholdLimit='low']]
[withMaven] Available options: 
[withMaven] using JDK installation JDK 1.8 (latest)
[withMaven] using Maven installation 'Maven 3 (latest)'
[Pipeline] {
[Pipeline] sh
[box_maven-doxia-site_master-IVLIM3FD7IHMMFNW5G7AIUYHFYH7R75A6TO3URHNGEW2DEHYMTVQ] Running
shell script
+ mvn clean site-deploy
----- withMaven Wrapper script -----
Picked up JAVA_TOOL_OPTIONS: -Dmaven.ext.class.path="/home/jenkins/jenkins-slave/workspace/box_maven-doxia-site_master-IVLIM3FD7IHMMFNW5G7AIUYHFYH7R75A6TO3URHNGEW2DEHYMTVQ@tmp/withMaven5c12b78b/pipeline-maven-spy.jar"
-Dorg.jenkinsci.plugins.pipeline.maven.reportsFolder="/home/jenkins/jenkins-slave/workspace/box_maven-doxia-site_master-IVLIM3FD7IHMMFNW5G7AIUYHFYH7R75A6TO3URHNGEW2DEHYMTVQ@tmp/withMaven5c12b78b"

Apache Maven 3.5.4 (1edded0938998edf8bf061f1ceb3cfdeccf443fe; 2018-06-17T18:33:14Z)
Maven home: /home/jenkins/tools/maven/latest3
Java version: 1.8.0_172, vendor: Oracle Corporation, runtime: /usr/local/asfpackages/java/jdk1.8.0_172/jre
Default locale: en_US, platform encoding: UTF-8
OS name: "linux", version: "4.4.0-116-generic", arch: "amd64", family: "unix"
[INFO] [jenkins-event-spy] Generate /home/jenkins/jenkins-slave/workspace/box_maven-doxia-site_master-IVLIM3FD7IHMMFNW5G7AIUYHFYH7R75A6TO3URHNGEW2DEHYMTVQ@tmp/withMaven5c12b78b/maven-spy-20180809-110010-8656744450177282828508.log.tmp
...
[INFO] Scanning for projects...
[INFO] Downloading from Nexus: http://repository.apache.org/snapshots/org/apache/maven/maven-parent/32-SNAPSHOT/maven-metadata.xml
[INFO] Downloading from Nexus: http://repository.apache.org/snapshots/org/apache/maven/maven-parent/32-SNAPSHOT/maven-parent-32-SNAPSHOT.pom
[ERROR] [ERROR] Some problems were encountered while processing the POMs:
[FATAL] Non-resolvable parent POM for org.apache.maven.doxia:doxia-site:1.0-SNAPSHOT: Could
not find artifact org.apache.maven:maven-parent:pom:32-SNAPSHOT in Nexus (http://repository.apache.org/snapshots)
and 'parent.relativePath' points at wrong local POM @ line 23, column 11
 @ 
[INFO] [jenkins-event-spy] Generated /home/jenkins/jenkins-slave/workspace/box_maven-doxia-site_master-IVLIM3FD7IHMMFNW5G7AIUYHFYH7R75A6TO3URHNGEW2DEHYMTVQ@tmp/withMaven5c12b78b/maven-spy-20180809-110010-8656744450177282828508.log
[ERROR] The build could not read 1 project -> [Help 1]
[ERROR]   
[ERROR]   The project org.apache.maven.doxia:doxia-site:1.0-SNAPSHOT (/home/jenkins/jenkins-slave/workspace/box_maven-doxia-site_master-IVLIM3FD7IHMMFNW5G7AIUYHFYH7R75A6TO3URHNGEW2DEHYMTVQ/pom.xml)
has 1 error
[ERROR]     Non-resolvable parent POM for org.apache.maven.doxia:doxia-site:1.0-SNAPSHOT:
Could not find artifact org.apache.maven:maven-parent:pom:32-SNAPSHOT in Nexus (http://repository.apache.org/snapshots)
and 'parent.relativePath' points at wrong local POM @ line 23, column 11 -> [Help 2]
[ERROR] 
[ERROR] To see the full stack trace of the errors, re-run Maven with the -e switch.
[ERROR] Re-run Maven using the -X switch to enable full debug logging.
[ERROR] 
[ERROR] For more information about the errors and possible solutions, please read the following
articles:
[ERROR] [Help 1] http://cwiki.apache.org/confluence/display/MAVEN/ProjectBuildingException
[ERROR] [Help 2] http://cwiki.apache.org/confluence/display/MAVEN/UnresolvableModelException
[Pipeline] }
[Pipeline] // withMaven
[Pipeline] }
[Pipeline] // stage
[Pipeline] stage
[Pipeline] { (Declarative: Post Actions)
[Pipeline] echo
Build result: FAILURE
[Pipeline] jiraIssueSelector
[Pipeline] emailext
Mime
  • Unnamed multipart/mixed (inline, None, 0 bytes)
View raw message