maven-notifications mailing list archives

Site index · List index
Message view « Date » · « Thread »
Top « Date » · « Thread »
From Apache Jenkins Server <jenk...@builds.apache.org>
Subject Build failed in Jenkins: Maven TLP » maven-archetypes » master #17
Date Thu, 16 Aug 2018 17:17:55 GMT
See https://builds.apache.org/job/maven-box/job/maven-archetypes/job/master/17/

Changes:

* Upgrade latest version of Maven
* [INFRA-16893] set Windows to windows-2016-1 node
* Back to Windows label
* Windows + M3.5.x = M3.5.2
* [INFRA-16893] Trying workaround
* Revert "[INFRA-16893] Trying workaround"
* Try to display PATH value

All tests passed

Build log:
[...truncated 3.36 MB...]
[windows-jdk9] [INFO] Downloading from central: https://repo.maven.apache.org/maven2/org/codehaus/groovy/groovy/1.8.3/groovy-1.8.3.pom
[windows-jdk9] [INFO] Downloaded from central: https://repo.maven.apache.org/maven2/org/codehaus/groovy/groovy/1.8.3/groovy-1.8.3.pom
(32 kB at 994 kB/s)
[windows-jdk9] [INFO] Downloading from central: https://repo.maven.apache.org/maven2/asm/asm/3.2/asm-3.2.pom
[windows-jdk9] [INFO] Downloaded from central: https://repo.maven.apache.org/maven2/asm/asm/3.2/asm-3.2.pom
(264 B at 11 kB/s)
[windows-jdk9] [INFO] Downloading from central: https://repo.maven.apache.org/maven2/asm/asm-parent/3.2/asm-parent-3.2.pom
[windows-jdk9] [INFO] Downloaded from central: https://repo.maven.apache.org/maven2/asm/asm-parent/3.2/asm-parent-3.2.pom
(4.4 kB at 71 kB/s)
[windows-jdk9] [INFO] Downloading from central: https://repo.maven.apache.org/maven2/asm/asm-commons/3.2/asm-commons-3.2.pom
[windows-jdk9] [INFO] Downloaded from central: https://repo.maven.apache.org/maven2/asm/asm-commons/3.2/asm-commons-3.2.pom
(415 B at 8.6 kB/s)
[windows-jdk9] [INFO] Downloading from central: https://repo.maven.apache.org/maven2/asm/asm-tree/3.2/asm-tree-3.2.pom
[windows-jdk9] [INFO] Downloaded from central: https://repo.maven.apache.org/maven2/asm/asm-tree/3.2/asm-tree-3.2.pom
(404 B at 9.9 kB/s)
[windows-jdk9] [INFO] Downloading from central: https://repo.maven.apache.org/maven2/asm/asm-util/3.2/asm-util-3.2.pom
[windows-jdk9] [INFO] Downloaded from central: https://repo.maven.apache.org/maven2/asm/asm-util/3.2/asm-util-3.2.pom
(409 B at 8.5 kB/s)
[windows-jdk9] [INFO] Downloading from central: https://repo.maven.apache.org/maven2/asm/asm-analysis/3.2/asm-analysis-3.2.pom
[windows-jdk9] [INFO] Downloaded from central: https://repo.maven.apache.org/maven2/asm/asm-analysis/3.2/asm-analysis-3.2.pom
(417 B at 9.5 kB/s)
[windows-jdk9] [INFO] Downloading from central: https://repo.maven.apache.org/maven2/org/codehaus/plexus/plexus-interactivity-api/1.0-alpha-6/plexus-interactivity-api-1.0-alpha-6.pom
[windows-jdk9] [INFO] Downloaded from central: https://repo.maven.apache.org/maven2/org/codehaus/plexus/plexus-interactivity-api/1.0-alpha-6/plexus-interactivity-api-1.0-alpha-6.pom
(726 B at 19 kB/s)
[windows-jdk9] [INFO] Downloading from central: https://repo.maven.apache.org/maven2/org/codehaus/plexus/plexus-interactivity/1.0-alpha-6/plexus-interactivity-1.0-alpha-6.pom
[windows-jdk9] [INFO] Downloaded from central: https://repo.maven.apache.org/maven2/org/codehaus/plexus/plexus-interactivity/1.0-alpha-6/plexus-interactivity-1.0-alpha-6.pom
(1.1 kB at 23 kB/s)
[windows-jdk9] [INFO] Downloading from central: https://repo.maven.apache.org/maven2/org/codehaus/plexus/plexus-components/1.1.9/plexus-components-1.1.9.pom
[windows-jdk9] [INFO] Downloaded from central: https://repo.maven.apache.org/maven2/org/codehaus/plexus/plexus-components/1.1.9/plexus-components-1.1.9.pom
(2.4 kB at 51 kB/s)
[windows-jdk9] [INFO] Downloading from central: https://repo.maven.apache.org/maven2/org/apache/maven/shared/maven-script-interpreter/1.0/maven-script-interpreter-1.0.pom
[windows-jdk9] [INFO] Downloaded from central: https://repo.maven.apache.org/maven2/org/apache/maven/shared/maven-script-interpreter/1.0/maven-script-interpreter-1.0.pom
(3.8 kB at 128 kB/s)
[windows-jdk9] [INFO] Downloading from central: https://repo.maven.apache.org/maven2/org/apache/ant/ant/1.8.1/ant-1.8.1.pom
[windows-jdk9] [INFO] Downloaded from central: https://repo.maven.apache.org/maven2/org/apache/ant/ant/1.8.1/ant-1.8.1.pom
(8.8 kB at 352 kB/s)
[windows-jdk9] [INFO] Downloading from central: https://repo.maven.apache.org/maven2/org/apache/ant/ant-parent/1.8.1/ant-parent-1.8.1.pom
[windows-jdk9] [INFO] Downloaded from central: https://repo.maven.apache.org/maven2/org/apache/ant/ant-parent/1.8.1/ant-parent-1.8.1.pom
(4.3 kB at 171 kB/s)
[windows-jdk9] [INFO] Downloading from central: https://repo.maven.apache.org/maven2/org/apache/maven/archetype/archetype-catalog/3.0.1/archetype-catalog-3.0.1.jar
[windows-jdk9] [INFO] Downloading from central: https://repo.maven.apache.org/maven2/org/apache/maven/archetype/archetype-descriptor/3.0.1/archetype-descriptor-3.0.1.jar
[windows-jdk9] [INFO] Downloading from central: https://repo.maven.apache.org/maven2/org/apache/maven/archetype/archetype-common/3.0.1/archetype-common-3.0.1.jar
[windows-jdk9] [INFO] Downloading from central: https://repo.maven.apache.org/maven2/dom4j/dom4j/1.6.1/dom4j-1.6.1.jar
[windows-jdk9] [INFO] Downloading from central: https://repo.maven.apache.org/maven2/net/sourceforge/jchardet/jchardet/1.0/jchardet-1.0.jar
[windows-jdk9] [INFO] Downloaded from central: https://repo.maven.apache.org/maven2/org/apache/maven/archetype/archetype-common/3.0.1/archetype-common-3.0.1.jar
(331 kB at 6.9 MB/s)
[windows-jdk9] [INFO] Downloading from central: https://repo.maven.apache.org/maven2/xml-apis/xml-apis/1.0.b2/xml-apis-1.0.b2.jar
[windows-jdk9] [INFO] Downloaded from central: https://repo.maven.apache.org/maven2/dom4j/dom4j/1.6.1/dom4j-1.6.1.jar
(314 kB at 5.2 MB/s)
[windows-jdk9] [INFO] Downloading from central: https://repo.maven.apache.org/maven2/jdom/jdom/1.0/jdom-1.0.jar
[windows-jdk9] [INFO] Downloaded from central: https://repo.maven.apache.org/maven2/jdom/jdom/1.0/jdom-1.0.jar
(153 kB at 1.5 MB/s)
[windows-jdk9] [INFO] Downloading from central: https://repo.maven.apache.org/maven2/org/apache/maven/wagon/wagon-provider-api/2.8/wagon-provider-api-2.8.jar
[windows-jdk9] [INFO] Downloaded from central: https://repo.maven.apache.org/maven2/xml-apis/xml-apis/1.0.b2/xml-apis-1.0.b2.jar
(109 kB at 841 kB/s)
[windows-jdk9] [INFO] Downloading from central: https://repo.maven.apache.org/maven2/org/codehaus/groovy/groovy/1.8.3/groovy-1.8.3.jar
[windows-jdk9] [INFO] Downloaded from central: https://repo.maven.apache.org/maven2/org/apache/maven/archetype/archetype-catalog/3.0.1/archetype-catalog-3.0.1.jar
(19 kB at 114 kB/s)
[windows-jdk9] [INFO] Downloading from central: https://repo.maven.apache.org/maven2/asm/asm/3.2/asm-3.2.jar
[windows-jdk9] [INFO] Downloaded from central: https://repo.maven.apache.org/maven2/org/apache/maven/wagon/wagon-provider-api/2.8/wagon-provider-api-2.8.jar
(53 kB at 278 kB/s)
[windows-jdk9] [INFO] Downloading from central: https://repo.maven.apache.org/maven2/asm/asm-commons/3.2/asm-commons-3.2.jar
[windows-jdk9] [INFO] Downloaded from central: https://repo.maven.apache.org/maven2/org/apache/maven/archetype/archetype-descriptor/3.0.1/archetype-descriptor-3.0.1.jar
(24 kB at 96 kB/s)
[windows-jdk9] [INFO] Downloading from central: https://repo.maven.apache.org/maven2/asm/asm-util/3.2/asm-util-3.2.jar
[windows-jdk9] [INFO] Downloaded from central: https://repo.maven.apache.org/maven2/org/codehaus/groovy/groovy/1.8.3/groovy-1.8.3.jar
(5.5 MB at 20 MB/s)
[windows-jdk9] [INFO] Downloading from central: https://repo.maven.apache.org/maven2/asm/asm-analysis/3.2/asm-analysis-3.2.jar
[windows-jdk9] [INFO] Downloaded from central: https://repo.maven.apache.org/maven2/net/sourceforge/jchardet/jchardet/1.0/jchardet-1.0.jar
(27 kB at 80 kB/s)
[windows-jdk9] [INFO] Downloading from central: https://repo.maven.apache.org/maven2/asm/asm-tree/3.2/asm-tree-3.2.jar
[windows-jdk9] [INFO] Downloaded from central: https://repo.maven.apache.org/maven2/asm/asm/3.2/asm-3.2.jar
(43 kB at 102 kB/s)
[windows-jdk9] [INFO] Downloading from central: https://repo.maven.apache.org/maven2/org/codehaus/plexus/plexus-interactivity-api/1.0-alpha-6/plexus-interactivity-api-1.0-alpha-6.jar
[windows-jdk9] [INFO] Downloaded from central: https://repo.maven.apache.org/maven2/asm/asm-analysis/3.2/asm-analysis-3.2.jar
(18 kB at 40 kB/s)
[windows-jdk9] [INFO] Downloading from central: https://repo.maven.apache.org/maven2/org/apache/maven/shared/maven-invoker/2.2/maven-invoker-2.2.jar
[windows-jdk9] [INFO] Downloaded from central: https://repo.maven.apache.org/maven2/asm/asm-util/3.2/asm-util-3.2.jar
(37 kB at 75 kB/s)
[windows-jdk9] [INFO] Downloading from central: https://repo.maven.apache.org/maven2/org/apache/maven/shared/maven-artifact-transfer/0.9.0/maven-artifact-transfer-0.9.0.jar
[windows-jdk9] [INFO] Downloaded from central: https://repo.maven.apache.org/maven2/asm/asm-tree/3.2/asm-tree-3.2.jar
(22 kB at 43 kB/s)
[windows-jdk9] [INFO] Downloading from central: https://repo.maven.apache.org/maven2/org/apache/maven/shared/maven-common-artifact-filters/3.0.0/maven-common-artifact-filters-3.0.0.jar
[windows-jdk9] [INFO] Downloaded from central: https://repo.maven.apache.org/maven2/org/apache/maven/shared/maven-common-artifact-filters/3.0.0/maven-common-artifact-filters-3.0.0.jar
(57 kB at 104 kB/s)
[windows-jdk9] [INFO] Downloading from central: https://repo.maven.apache.org/maven2/commons-codec/commons-codec/1.6/commons-codec-1.6.jar
[windows-jdk9] [INFO] Downloaded from central: https://repo.maven.apache.org/maven2/org/codehaus/plexus/plexus-interactivity-api/1.0-alpha-6/plexus-interactivity-api-1.0-alpha-6.jar
(12 kB at 21 kB/s)
[windows-jdk9] [INFO] Downloading from central: https://repo.maven.apache.org/maven2/org/slf4j/slf4j-api/1.7.5/slf4j-api-1.7.5.jar
[windows-jdk9] [INFO] Downloaded from central: https://repo.maven.apache.org/maven2/org/apache/maven/shared/maven-artifact-transfer/0.9.0/maven-artifact-transfer-0.9.0.jar
(123 kB at 211 kB/s)
[windows-jdk9] [INFO] Downloading from central: https://repo.maven.apache.org/maven2/org/apache/maven/shared/maven-script-interpreter/1.0/maven-script-interpreter-1.0.jar
[windows-jdk9] [INFO] Downloaded from central: https://repo.maven.apache.org/maven2/asm/asm-commons/3.2/asm-commons-3.2.jar
(33 kB at 56 kB/s)
[windows-jdk9] [INFO] Downloading from central: https://repo.maven.apache.org/maven2/org/apache/ant/ant/1.8.1/ant-1.8.1.jar
[windows-jdk9] [INFO] Downloaded from central: https://repo.maven.apache.org/maven2/org/apache/maven/shared/maven-invoker/2.2/maven-invoker-2.2.jar
(30 kB at 45 kB/s)
[windows-jdk9] [INFO] Downloaded from central: https://repo.maven.apache.org/maven2/org/apache/ant/ant/1.8.1/ant-1.8.1.jar
(1.5 MB at 2.1 MB/s)
[windows-jdk9] [INFO] Downloaded from central: https://repo.maven.apache.org/maven2/commons-codec/commons-codec/1.6/commons-codec-1.6.jar
(233 kB at 325 kB/s)
[windows-jdk9] [INFO] Downloaded from central: https://repo.maven.apache.org/maven2/org/apache/maven/shared/maven-script-interpreter/1.0/maven-script-interpreter-1.0.jar
(21 kB at 27 kB/s)
[windows-jdk9] [INFO] Downloaded from central: https://repo.maven.apache.org/maven2/org/slf4j/slf4j-api/1.7.5/slf4j-api-1.7.5.jar
(26 kB at 30 kB/s)
[windows-jdk9] [INFO] Building archetype jar: F:\jenkins\jenkins-slave\workspace\box_maven-archetypes_master-CWQIX33IMRENQAEK6YQUG4YRNL2FP25GOPO4YFHLPIHFEWUYVBDQ\m\maven-archetype-archetype\target\maven-archetype-archetype-1.4-SNAPSHOT
[windows-jdk9] [INFO] 
[windows-jdk9] [INFO] --- maven-site-plugin:3.7:attach-descriptor (attach-descriptor) @ maven-archetype-archetype
---
[windows-jdk9] [INFO] Skipping because packaging 'maven-archetype' is not pom.
[windows-jdk9] [INFO] 
[windows-jdk9] [INFO] --- maven-archetype-plugin:3.0.1:integration-test (default-integration-test)
@ maven-archetype-archetype ---
[windows-jdk9] [INFO] Processing Archetype IT project: it-basic
[windows-jdk9] [INFO] ----------------------------------------------------------------------------
[windows-jdk9] [INFO] Using following parameters for creating project from Archetype: maven-archetype-archetype:1.4-SNAPSHOT
[windows-jdk9] [INFO] ----------------------------------------------------------------------------
[windows-jdk9] [INFO] Parameter: groupId, Value: archetype.it
[windows-jdk9] [INFO] Parameter: artifactId, Value: basic-archetype
[windows-jdk9] [INFO] Parameter: version, Value: 0.1-SNAPSHOT
[windows-jdk9] [INFO] Parameter: package, Value: null
[windows-jdk9] [INFO] Parameter: packageInPathFormat, Value: null
[windows-jdk9] [INFO] Parameter: groupId, Value: archetype.it
[windows-jdk9] [INFO] Parameter: artifactId, Value: basic-archetype
[windows-jdk9] [INFO] Parameter: version, Value: 0.1-SNAPSHOT
[windows-jdk9] [INFO] Project created from Archetype in dir: F:\jenkins\jenkins-slave\workspace\box_maven-archetypes_master-CWQIX33IMRENQAEK6YQUG4YRNL2FP25GOPO4YFHLPIHFEWUYVBDQ\m\maven-archetype-archetype\target\test-classes\projects\it-basic\project\basic-archetype
[windows-jdk9] [INFO] Invoking post-archetype-generation goals: verify
[windows-jdk9] [INFO] Picked up JAVA_TOOL_OPTIONS: -Dmaven.ext.class.path="f:\jenkins\jenkins-slave\workspace\box_maven-archetypes_master-CWQIX33IMRENQAEK6YQUG4YRNL2FP25GOPO4YFHLPIHFEWUYVBDQ@tmp\withMaven0ad224ad\pipeline-maven-spy.jar"
-Dorg.jenkinsci.plugins.pipeline.maven.reportsFolder="f:\jenkins\jenkins-slave\workspace\box_maven-archetypes_master-CWQIX33IMRENQAEK6YQUG4YRNL2FP25GOPO4YFHLPIHFEWUYVBDQ@tmp\withMaven0ad224ad"

[windows-jdk9] [INFO] [INFO] [jenkins-event-spy] Generate F:\jenkins\jenkins-slave\workspace\box_maven-archetypes_master-CWQIX33IMRENQAEK6YQUG4YRNL2FP25GOPO4YFHLPIHFEWUYVBDQ@tmp\withMaven0ad224ad\maven-spy-20180816-101749-74613177428026952973757.log.tmp
...
[windows-jdk9] [INFO] [INFO] Error stacktraces are turned on.
[windows-jdk9] [INFO] [INFO] Scanning for projects...
[windows-jdk9] [INFO] [INFO] 
[windows-jdk9] [INFO] [INFO] ------------------------------------------------------------------------
[windows-jdk9] [INFO] [INFO] Building Archetype - basic-archetype 0.1-SNAPSHOT
[windows-jdk9] [INFO] [INFO] ------------------------------------------------------------------------
[windows-jdk9] [INFO] [INFO] 
[windows-jdk9] [INFO] [INFO] --- maven-resources-plugin:3.0.2:resources (default-resources)
@ basic-archetype ---
[windows-jdk9] [INFO] [INFO] Using 'UTF-8' encoding to copy filtered resources.
[windows-jdk9] [INFO] [INFO] Copying 4 resources
[windows-jdk9] [INFO] [INFO] 
[windows-jdk9] [INFO] [INFO] --- maven-resources-plugin:3.0.2:testResources (default-testResources)
@ basic-archetype ---
[windows-jdk9] [INFO] [INFO] Using 'UTF-8' encoding to copy filtered resources.
[windows-jdk9] [INFO] [INFO] Copying 2 resources
[windows-jdk9] [INFO] [INFO] 
[windows-jdk9] [INFO] [INFO] --- maven-archetype-plugin:3.0.1:jar (default-jar) @ basic-archetype
---
[windows-jdk9] [INFO] [INFO] Building archetype jar: F:\jenkins\jenkins-slave\workspace\box_maven-archetypes_master-CWQIX33IMRENQAEK6YQUG4YRNL2FP25GOPO4YFHLPIHFEWUYVBDQ\m\maven-archetype-archetype\target\test-classes\projects\it-basic\project\basic-archetype\target\basic-archetype-0.1-SNAPSHOT
[windows-jdk9] [INFO] [INFO] 
[windows-jdk9] [INFO] [INFO] --- maven-archetype-plugin:3.0.1:integration-test (default-integration-test)
@ basic-archetype ---
[windows-jdk9] [INFO] [INFO] Processing Archetype IT project: it-basic
[windows-jdk9] [INFO] [INFO] ----------------------------------------------------------------------------
[windows-jdk9] [INFO] [INFO] Using following parameters for creating project from Archetype:
basic-archetype:0.1-SNAPSHOT
[windows-jdk9] [INFO] [INFO] ----------------------------------------------------------------------------
[windows-jdk9] [INFO] [INFO] Parameter: groupId, Value: archetype.it
[windows-jdk9] [INFO] [INFO] Parameter: artifactId, Value: basic-project
[windows-jdk9] [INFO] [INFO] Parameter: version, Value: 0.1-SNAPSHOT
[windows-jdk9] [INFO] [INFO] Parameter: package, Value: it.pkg
[windows-jdk9] [INFO] [INFO] Parameter: packageInPathFormat, Value: it/pkg
[windows-jdk9] [INFO] [INFO] Parameter: package, Value: it.pkg
[windows-jdk9] [INFO] [INFO] Parameter: groupId, Value: archetype.it
[windows-jdk9] [INFO] [INFO] Parameter: artifactId, Value: basic-project
[windows-jdk9] [INFO] [INFO] Parameter: version, Value: 0.1-SNAPSHOT
[windows-jdk9] [INFO] [INFO] Project created from Archetype in dir: F:\jenkins\jenkins-slave\workspace\box_maven-archetypes_master-CWQIX33IMRENQAEK6YQUG4YRNL2FP25GOPO4YFHLPIHFEWUYVBDQ\m\maven-archetype-archetype\target\test-classes\projects\it-basic\project\basic-archetype\target\test-classes\projects\it-basic\project\basic-project
[windows-jdk9] [INFO] [INFO] Invoking post-archetype-generation goals: verify
[windows-jdk9] [INFO] [INFO] Post-archetype-generation invoker exit code: -2147483648
[windows-jdk9] [INFO] [INFO] ------------------------------------------------------------------------
[windows-jdk9] [INFO] [INFO] BUILD FAILURE
[windows-jdk9] [INFO] [INFO] ------------------------------------------------------------------------
[windows-jdk9] [INFO] [INFO] Total time: 3.102 s
[windows-jdk9] [INFO] [INFO] Finished at: 2018-08-16T10:17:53-07:00
[windows-jdk9] [INFO] [INFO] Final Memory: 16M/53M
[windows-jdk9] [INFO] [INFO] ------------------------------------------------------------------------
[windows-jdk9] [INFO] [INFO] [jenkins-event-spy] Generated F:\jenkins\jenkins-slave\workspace\box_maven-archetypes_master-CWQIX33IMRENQAEK6YQUG4YRNL2FP25GOPO4YFHLPIHFEWUYVBDQ@tmp\withMaven0ad224ad\maven-spy-20180816-101749-74613177428026952973757.log
[windows-jdk9] [INFO] [ERROR] Failed to execute goal org.apache.maven.plugins:maven-archetype-plugin:3.0.1:integration-test
(default-integration-test) on project basic-archetype: 
[windows-jdk9] [INFO] [ERROR] Archetype IT 'it-basic' failed: Execution failure: exit code
= -2147483648
[windows-jdk9] [INFO] [ERROR] -> [Help 1]
[windows-jdk9] [INFO] org.apache.maven.lifecycle.LifecycleExecutionException: Failed to execute
goal org.apache.maven.plugins:maven-archetype-plugin:3.0.1:integration-test (default-integration-test)
on project basic-archetype: 
[windows-jdk9] [INFO] Archetype IT 'it-basic' failed: Execution failure: exit code = -2147483648
[windows-jdk9] [INFO]     at org.apache.maven.lifecycle.internal.MojoExecutor.execute (MojoExecutor.java:213)
[windows-jdk9] [INFO]     at org.apache.maven.lifecycle.internal.MojoExecutor.execute (MojoExecutor.java:154)
[windows-jdk9] [INFO]     at org.apache.maven.lifecycle.internal.MojoExecutor.execute (MojoExecutor.java:146)
[windows-jdk9] [INFO]     at org.apache.maven.lifecycle.internal.LifecycleModuleBuilder.buildProject
(LifecycleModuleBuilder.java:117)
[windows-jdk9] [INFO]     at org.apache.maven.lifecycle.internal.LifecycleModuleBuilder.buildProject
(LifecycleModuleBuilder.java:81)
[windows-jdk9] [INFO]     at org.apache.maven.lifecycle.internal.builder.singlethreaded.SingleThreadedBuilder.build
(SingleThreadedBuilder.java:51)
[windows-jdk9] [INFO]     at org.apache.maven.lifecycle.internal.LifecycleStarter.execute
(LifecycleStarter.java:128)
[windows-jdk9] [INFO]     at org.apache.maven.DefaultMaven.doExecute (DefaultMaven.java:309)
[windows-jdk9] [INFO]     at org.apache.maven.DefaultMaven.doExecute (DefaultMaven.java:194)
[windows-jdk9] [INFO]     at org.apache.maven.DefaultMaven.execute (DefaultMaven.java:107)
[windows-jdk9] [INFO]     at org.apache.maven.cli.MavenCli.execute (MavenCli.java:955)
[windows-jdk9] [INFO]     at org.apache.maven.cli.MavenCli.doMain (MavenCli.java:290)
[windows-jdk9] [INFO]     at org.apache.maven.cli.MavenCli.main (MavenCli.java:194)
[windows-jdk9] [INFO]     at jdk.internal.reflect.NativeMethodAccessorImpl.invoke0 (Native
Method)
[windows-jdk9] [INFO]     at jdk.internal.reflect.NativeMethodAccessorImpl.invoke (NativeMethodAccessorImpl.java:62)
[windows-jdk9] [INFO]     at jdk.internal.reflect.DelegatingMethodAccessorImpl.invoke (DelegatingMethodAccessorImpl.java:43)
[windows-jdk9] [INFO]     at java.lang.reflect.Method.invoke (Method.java:564)
[windows-jdk9] [INFO]     at org.codehaus.plexus.classworlds.launcher.Launcher.launchEnhanced
(Launcher.java:289)
[windows-jdk9] [INFO]     at org.codehaus.plexus.classworlds.launcher.Launcher.launch (Launcher.java:229)
[windows-jdk9] [INFO]     at org.codehaus.plexus.classworlds.launcher.Launcher.mainWithExitCode
(Launcher.java:415)
[windows-jdk9] [INFO]     at org.codehaus.plexus.classworlds.launcher.Launcher.main (Launcher.java:356)
[windows-jdk9] [INFO] Caused by: org.apache.maven.plugin.MojoExecutionException: 
[windows-jdk9] [INFO] Archetype IT 'it-basic' failed: Execution failure: exit code = -2147483648
[windows-jdk9] [INFO]     at org.apache.maven.archetype.mojos.IntegrationTestMojo.execute
(IntegrationTestMojo.java:325)
[windows-jdk9] [INFO]     at org.apache.maven.plugin.DefaultBuildPluginManager.executeMojo
(DefaultBuildPluginManager.java:134)
[windows-jdk9] [INFO]     at org.apache.maven.lifecycle.internal.MojoExecutor.execute (MojoExecutor.java:208)
[windows-jdk9] [INFO]     at org.apache.maven.lifecycle.internal.MojoExecutor.execute (MojoExecutor.java:154)
[windows-jdk9] [INFO]     at org.apache.maven.lifecycle.internal.MojoExecutor.execute (MojoExecutor.java:146)
[windows-jdk9] [INFO]     at org.apache.maven.lifecycle.internal.LifecycleModuleBuilder.buildProject
(LifecycleModuleBuilder.java:117)
[windows-jdk9] [INFO]     at org.apache.maven.lifecycle.internal.LifecycleModuleBuilder.buildProject
(LifecycleModuleBuilder.java:81)
[windows-jdk9] [INFO]     at org.apache.maven.lifecycle.internal.builder.singlethreaded.SingleThreadedBuilder.build
(SingleThreadedBuilder.java:51)
[windows-jdk9] [INFO]     at org.apache.maven.lifecycle.internal.LifecycleStarter.execute
(LifecycleStarter.java:128)
[windows-jdk9] [INFO]     at org.apache.maven.DefaultMaven.doExecute (DefaultMaven.java:309)
[windows-jdk9] [INFO]     at org.apache.maven.DefaultMaven.doExecute (DefaultMaven.java:194)
[windows-jdk9] [INFO]     at org.apache.maven.DefaultMaven.execute (DefaultMaven.java:107)
[windows-jdk9] [INFO]     at org.apache.maven.cli.MavenCli.execute (MavenCli.java:955)
[windows-jdk9] [INFO]     at org.apache.maven.cli.MavenCli.doMain (MavenCli.java:290)
[windows-jdk9] [INFO]     at org.apache.maven.cli.MavenCli.main (MavenCli.java:194)
[windows-jdk9] [INFO]     at jdk.internal.reflect.NativeMethodAccessorImpl.invoke0 (Native
Method)
[windows-jdk9] [INFO]     at jdk.internal.reflect.NativeMethodAccessorImpl.invoke (NativeMethodAccessorImpl.java:62)
[windows-jdk9] [INFO]     at jdk.internal.reflect.DelegatingMethodAccessorImpl.invoke (DelegatingMethodAccessorImpl.java:43)
[windows-jdk9] [INFO]     at java.lang.reflect.Method.invoke (Method.java:564)
[windows-jdk9] [INFO]     at org.codehaus.plexus.classworlds.launcher.Launcher.launchEnhanced
(Launcher.java:289)
[windows-jdk9] [INFO]     at org.codehaus.plexus.classworlds.launcher.Launcher.launch (Launcher.java:229)
[windows-jdk9] [INFO]     at org.codehaus.plexus.classworlds.launcher.Launcher.mainWithExitCode
(Launcher.java:415)
[windows-jdk9] [INFO]     at org.codehaus.plexus.classworlds.launcher.Launcher.main (Launcher.java:356)
[windows-jdk9] [INFO] [ERROR] 
[windows-jdk9] [INFO] [ERROR] Re-run Maven using the -X switch to enable full debug logging.
[windows-jdk9] [INFO] [ERROR] 
[windows-jdk9] [INFO] [ERROR] For more information about the errors and possible solutions,
please read the following articles:
[windows-jdk9] [INFO] [ERROR] [Help 1] http://cwiki.apache.org/confluence/display/MAVEN/MojoExecutionException
[windows-jdk9] [INFO] Post-archetype-generation invoker exit code: 1
[windows-jdk9] [INFO] ------------------------------------------------------------------------
[windows-jdk9] [INFO] Reactor Summary:
[windows-jdk9] [INFO] 
[windows-jdk9] [INFO] Apache Maven Archetypes ............................ SUCCESS [ 49.509
s]
[windows-jdk9] [INFO] Maven Archetype Archetype .......................... FAILURE [ 13.355
s]
[windows-jdk9] [INFO] Maven Simple J2EE Archetype ........................ SKIPPED
[windows-jdk9] [INFO] Maven Plugin Archetype ............................. SKIPPED
[windows-jdk9] [INFO] Maven Plugin Site Archetype ........................ SKIPPED
[windows-jdk9] [INFO] Maven Portlet Archetype ............................ SKIPPED
[windows-jdk9] [INFO] Maven Quickstart Archetype ......................... SKIPPED
[windows-jdk9] [INFO] Maven Simple Project Archetype ..................... SKIPPED
[windows-jdk9] [INFO] Maven Site Archetype ............................... SKIPPED
[windows-jdk9] [INFO] Maven Archetype for Simple Site .................... SKIPPED
[windows-jdk9] [INFO] Maven Site Skin Archetype .......................... SKIPPED
[windows-jdk9] [INFO] Maven Webapp Archetype ............................. SKIPPED
[windows-jdk9] [INFO] ------------------------------------------------------------------------
[windows-jdk9] [INFO] BUILD FAILURE
[windows-jdk9] [INFO] ------------------------------------------------------------------------
[windows-jdk9] [INFO] Total time: 01:05 min
[windows-jdk9] [INFO] Finished at: 2018-08-16T10:17:53-07:00
[windows-jdk9] [INFO] Final Memory: 33M/111M
[windows-jdk9] [INFO] ------------------------------------------------------------------------
[windows-jdk9] [WARNING] The requested profile "run-its" could not be activated because it
does not exist.
[windows-jdk9] [INFO] [jenkins-event-spy] Generated F:\jenkins\jenkins-slave\workspace\box_maven-archetypes_master-CWQIX33IMRENQAEK6YQUG4YRNL2FP25GOPO4YFHLPIHFEWUYVBDQ@tmp\withMaven0ad224ad\maven-spy-20180816-101647-8405514926184384648354.log
[windows-jdk9] [ERROR] Failed to execute goal org.apache.maven.plugins:maven-archetype-plugin:3.0.1:integration-test
(default-integration-test) on project maven-archetype-archetype: 
[windows-jdk9] [ERROR] Archetype IT 'it-basic' failed: Execution failure: exit code = 1
[windows-jdk9] [ERROR] -> [Help 1]
[windows-jdk9] [ERROR] 
[windows-jdk9] [ERROR] To see the full stack trace of the errors, re-run Maven with the -e
switch.
[windows-jdk9] [ERROR] Re-run Maven using the -X switch to enable full debug logging.
[windows-jdk9] [ERROR] 
[windows-jdk9] [ERROR] For more information about the errors and possible solutions, please
read the following articles:
[windows-jdk9] [ERROR] [Help 1] http://cwiki.apache.org/confluence/display/MAVEN/MojoExecutionException
[windows-jdk9] [ERROR] 
[windows-jdk9] [ERROR] After correcting the problems, you can resume the build with the command
[windows-jdk9] [ERROR]   mvn <goals> -rf :maven-archetype-archetype
[Pipeline] [windows-jdk9] }
[Pipeline] [windows-jdk9] // dir
[Pipeline] [windows-jdk9] }
[Pipeline] [windows-jdk9] // withMaven
[Pipeline] [windows-jdk9] cleanWs
[windows-jdk9] [WS-CLEANUP] Deleting project workspace...[WS-CLEANUP] done
[Pipeline] [windows-jdk9] cleanWs
[windows-jdk9] [WS-CLEANUP] Deleting project workspace...[WS-CLEANUP] done
[Pipeline] [windows-jdk9] }
[Pipeline] [windows-jdk9] // stage
[Pipeline] [windows-jdk9] }
[Pipeline] [windows-jdk9] // node
[Pipeline] [windows-jdk9] }
[windows-jdk9] Failed in branch windows-jdk9
[Pipeline] // parallel
[Pipeline] stage
[Pipeline] { (Notifications)
[Pipeline] echo
Build result: FAILURE
[Pipeline] jiraIssueSelector
[Pipeline] emailext
Mime
  • Unnamed multipart/mixed (inline, None, 0 bytes)
View raw message