maven-notifications mailing list archives

Site index · List index
Message view « Date » · « Thread »
Top « Date » · « Thread »
From Apache Jenkins Server <jenk...@builds.apache.org>
Subject Build unstable in Jenkins: Maven TLP » maven-remote-resources-plugin » MRRESOURCES-103 #22
Date Fri, 03 Aug 2018 07:01:36 GMT
See https://builds.apache.org/job/maven-box/job/maven-remote-resources-plugin/job/MRRESOURCES-103/22/

No changes.

4 tests failed.
FAILED:  org.apache.maven.plugin.resources.remote.it.IT_RunOnlyAtExecutionRoot.test

Error Message:
Exit code was non-zero: 1; command line and log = 
F:\jenkins\tools\maven\apache-maven-3.5.0\bin\mvn -e --batch-mode -Dhttps.protocols=TLSv1.2 -Dmaven.repo.local=f:\jenkins\jenkins-slave\workspace\rces-plugin_MRRESOURCES-103-OWZ3HFZ43MS4CUVJZUVLTQDPH6VF24RFDOZDFCITEPHO3WVUHWJQ\windows-jdk7-m3.5.x_build\target/it-repo org.apache.maven.plugins:maven-clean-plugin:clean generate-resources
[INFO] [jenkins-event-spy] Jenkins Maven Event Spy is disabled
[INFO] Error stacktraces are turned on.
[INFO] Scanning for projects...
[INFO] Downloading: http://repository.apache.org/snapshots/org/apache/maven/plugin/rresource/it/it-parent/1.6-SNAPSHOT/maven-metadata.xml
[INFO] Downloading: http://repository.apache.org/snapshots/org/apache/maven/plugin/rresource/it/it-parent/1.6-SNAPSHOT/it-parent-1.6-SNAPSHOT.pom
[ERROR] [ERROR] Some problems were encountered while processing the POMs:
[FATAL] Non-resolvable parent POM for org.apache.maven.plugin.rresource.it.mrr41:parent:[unknown-version]: Could not find artifact org.apache.maven.plugin.rresource.it:it-parent:pom:1.6-SNAPSHOT in apache-snapshots (http://repository.apache.org/snapshots/) and 'parent.relativePath' points at wrong local POM @ org.apache.maven.plugin.rresource.it.mrr41:parent:[unknown-version], F:\jenkins\jenkins-slave\workspace\rces-plugin_MRRESOURCES-103-OWZ3HFZ43MS4CUVJZUVLTQDPH6VF24RFDOZDFCITEPHO3WVUHWJQ\windows-jdk7-m3.5.x_build\target\test-classes\run-only-at-execution-root\pom.xml, line 24, column 11
[FATAL] Non-resolvable parent POM for org.apache.maven.plugin.rresource.it.mrr41:parent:[unknown-version]: Failure to find org.apache.maven.plugin.rresource.it:it-parent:pom:1.6-SNAPSHOT in http://repository.apache.org/snapshots/ was cached in the local repository, resolution will not be reattempted until the update interval of apache-snapshots has elapsed or updates are forced and 'parent.relativePath' points at wrong local POM @ org.apache.maven.plugin.rresource.it.mrr41:parent:[unknown-version], F:\jenkins\jenkins-slave\workspace\rces-plugin_MRRESOURCES-103-OWZ3HFZ43MS4CUVJZUVLTQDPH6VF24RFDOZDFCITEPHO3WVUHWJQ\windows-jdk7-m3.5.x_build\target\test-classes\run-only-at-execution-root\pom.xml, line 24, column 11
 @ 
[ERROR] The build could not read 2 projects -> [Help 1]
org.apache.maven.project.ProjectBuildingException: Some problems were encountered while processing the POMs:
[FATAL] Non-resolvable parent POM for org.apache.maven.plugin.rresource.it.mrr41:parent:[unknown-version]: Could not find artifact org.apache.maven.plugin.rresource.it:it-parent:pom:1.6-SNAPSHOT in apache-snapshots (http://repository.apache.org/snapshots/) and 'parent.relativePath' points at wrong local POM @ org.apache.maven.plugin.rresource.it.mrr41:parent:[unknown-version], F:\jenkins\jenkins-slave\workspace\rces-plugin_MRRESOURCES-103-OWZ3HFZ43MS4CUVJZUVLTQDPH6VF24RFDOZDFCITEPHO3WVUHWJQ\windows-jdk7-m3.5.x_build\target\test-classes\run-only-at-execution-root\pom.xml, line 24, column 11
[FATAL] Non-resolvable parent POM for org.apache.maven.plugin.rresource.it.mrr41:parent:[unknown-version]: Failure to find org.apache.maven.plugin.rresource.it:it-parent:pom:1.6-SNAPSHOT in http://repository.apache.org/snapshots/ was cached in the local repository, resolution will not be reattempted until the update interval of apache-snapshots has elapsed or updates are forced and 'parent.relativePath' points at wrong local POM @ org.apache.maven.plugin.rresource.it.mrr41:parent:[unknown-version], F:\jenkins\jenkins-slave\workspace\rces-plugin_MRRESOURCES-103-OWZ3HFZ43MS4CUVJZUVLTQDPH6VF24RFDOZDFCITEPHO3WVUHWJQ\windows-jdk7-m3.5.x_build\target\test-classes\run-only-at-execution-root\pom.xml, line 24, column 11

 at org.apache.maven.project.DefaultProjectBuilder.build(DefaultProjectBuilder.java:382)
 at org.apache.maven.graph.DefaultGraphBuilder.collectProjects(DefaultGraphBuilder.java:400)
 at org.apache.maven.graph.DefaultGraphBuilder.getProjectsForMavenReactor(DefaultGraphBuilder.java:391)
 at org.apache.maven.graph.DefaultGraphBuilder.build(DefaultGraphBuilder.java:78)
 at org.apache.maven.DefaultMaven.buildGraph(DefaultMaven.java:511)
 at org.apache.maven.DefaultMaven.doExecute(DefaultMaven.java:221)
 at org.apache.maven.DefaultMaven.doExecute(DefaultMaven.java:194)
 at org.apache.maven.DefaultMaven.execute(DefaultMaven.java:107)
 at org.apache.maven.cli.MavenCli.execute(MavenCli.java:993)
 at org.apache.maven.cli.MavenCli.doMain(MavenCli.java:345)
 at org.apache.maven.cli.MavenCli.main(MavenCli.java:191)
 at sun.reflect.NativeMethodAccessorImpl.invoke0(Native Method)
 at sun.reflect.NativeMethodAccessorImpl.invoke(NativeMethodAccessorImpl.java:57)
 at sun.reflect.DelegatingMethodAccessorImpl.invoke(DelegatingMethodAccessorImpl.java:43)
 at java.lang.reflect.Method.invoke(Method.java:606)
 at org.codehaus.plexus.classworlds.launcher.Launcher.launchEnhanced(Launcher.java:289)
 at org.codehaus.plexus.classworlds.launcher.Launcher.launch(Launcher.java:229)
 at org.codehaus.plexus.classworlds.launcher.Launcher.mainWithExitCode(Launcher.java:415)
 at org.codehaus.plexus.classworlds.launcher.Launcher.main(Launcher.java:356)
[ERROR]   
[ERROR]   The project org.apache.maven.plugin.rresource.it.mrr41:child-1:[unknown-version] (F:\jenkins\jenkins-slave\workspace\rces-plugin_MRRESOURCES-103-OWZ3HFZ43MS4CUVJZUVLTQDPH6VF24RFDOZDFCITEPHO3WVUHWJQ\windows-jdk7-m3.5.x_build\target\test-classes\run-only-at-execution-root\child1\pom.xml) has 1 error
[ERROR]     Non-resolvable parent POM for org.apache.maven.plugin.rresource.it.mrr41:parent:[unknown-version]: Could not find artifact org.apache.maven.plugin.rresource.it:it-parent:pom:1.6-SNAPSHOT in apache-snapshots (http://repository.apache.org/snapshots/) and 'parent.relativePath' points at wrong local POM @ org.apache.maven.plugin.rresource.it.mrr41:parent:[unknown-version], F:\jenkins\jenkins-slave\workspace\rces-plugin_MRRESOURCES-103-OWZ3HFZ43MS4CUVJZUVLTQDPH6VF24RFDOZDFCITEPHO3WVUHWJQ\windows-jdk7-m3.5.x_build\target\test-classes\run-only-at-execution-root\pom.xml, line 24, column 11 -> [Help 2]
org.apache.maven.model.resolution.UnresolvableModelException: Could not find artifact org.apache.maven.plugin.rresource.it:it-parent:pom:1.6-SNAPSHOT in apache-snapshots (http://repository.apache.org/snapshots/)
 at org.apache.maven.project.ProjectModelResolver.resolveModel(ProjectModelResolver.java:197)
 at org.apache.maven.project.ProjectModelResolver.resolveModel(ProjectModelResolver.java:243)
 at org.apache.maven.model.building.DefaultModelBuilder.readParentExternally(DefaultModelBuilder.java:1051)
 at org.apache.maven.model.building.DefaultModelBuilder.readParent(DefaultModelBuilder.java:851)
 at org.apache.maven.model.building.DefaultModelBuilder.build(DefaultModelBuilder.java:331)
 at org.apache.maven.project.DefaultProjectBuilder.build(DefaultProjectBuilder.java:429)
 at org.apache.maven.project.DefaultProjectBuilder.build(DefaultProjectBuilder.java:398)
 at org.apache.maven.project.DefaultProjectBuilder.build(DefaultProjectBuilder.java:515)
 at org.apache.maven.project.DefaultProjectBuilder.build(DefaultProjectBuilder.java:398)
 at org.apache.maven.project.DefaultProjectBuilder.build(DefaultProjectBuilder.java:361)
 at org.apache.maven.graph.DefaultGraphBuilder.collectProjects(DefaultGraphBuilder.java:400)
 at org.apache.maven.graph.DefaultGraphBuilder.getProjectsForMavenReactor(DefaultGraphBuilder.java:391)
 at org.apache.maven.graph.DefaultGraphBuilder.build(DefaultGraphBuilder.java:78)
 at org.apache.maven.DefaultMaven.buildGraph(DefaultMaven.java:511)
 at org.apache.maven.DefaultMaven.doExecute(DefaultMaven.java:221)
 at org.apache.maven.DefaultMaven.doExecute(DefaultMaven.java:194)
 at org.apache.maven.DefaultMaven.execute(DefaultMaven.java:107)
 at org.apache.maven.cli.MavenCli.execute(MavenCli.java:993)
 at org.apache.maven.cli.MavenCli.doMain(MavenCli.java:345)
 at org.apache.maven.cli.MavenCli.main(MavenCli.java:191)
 at sun.reflect.NativeMethodAccessorImpl.invoke0(Native Method)
 at sun.reflect.NativeMethodAccessorImpl.invoke(NativeMethodAccessorImpl.java:57)
 at sun.reflect.DelegatingMethodAccessorImpl.invoke(DelegatingMethodAccessorImpl.java:43)
 at java.lang.reflect.Method.invoke(Method.java:606)
 at org.codehaus.plexus.classworlds.launcher.Launcher.launchEnhanced(Launcher.java:289)
 at org.codehaus.plexus.classworlds.launcher.Launcher.launch(Launcher.java:229)
 at org.codehaus.plexus.classworlds.launcher.Launcher.mainWithExitCode(Launcher.java:415)
 at org.codehaus.plexus.classworlds.launcher.Launcher.main(Launcher.java:356)
Caused by: org.eclipse.aether.resolution.ArtifactResolutionException: Could not find artifact org.apache.maven.plugin.rresource.it:it-parent:pom:1.6-SNAPSHOT in apache-snapshots (http://repository.apache.org/snapshots/)
 at org.eclipse.aether.internal.impl.DefaultArtifactResolver.resolve(DefaultArtifactResolver.java:453)
 at org.eclipse.aether.internal.impl.DefaultArtifactResolver.resolveArtifacts(DefaultArtifactResolver.java:255)
 at org.eclipse.aether.internal.impl.DefaultArtifactResolver.resolveArtifact(DefaultArtifactResolver.java:232)
 at org.eclipse.aether.internal.impl.DefaultRepositorySystem.resolveArtifact(DefaultRepositorySystem.java:303)
 at org.apache.maven.project.ProjectModelResolver.resolveModel(ProjectModelResolver.java:193)
 ... 27 more
Caused by: org.eclipse.aether.transfer.ArtifactNotFoundException: Could not find artifact org.apache.maven.plugin.rresource.it:it-parent:pom:1.6-SNAPSHOT in apache-snapshots (http://repository.apache.org/snapshots/)
 at org.eclipse.aether.connector.basic.ArtifactTransportListener.transferFailed(ArtifactTransportListener.java:48)
 at org.eclipse.aether.connector.basic.BasicRepositoryConnector$TaskRunner.run(BasicRepositoryConnector.java:364)
 at org.eclipse.aether.util.concurrency.RunnableErrorForwarder$1.run(RunnableErrorForwarder.java:76)
 at org.eclipse.aether.connector.basic.BasicRepositoryConnector$DirectExecutor.execute(BasicRepositoryConnector.java:590)
 at org.eclipse.aether.connector.basic.BasicRepositoryConnector.get(BasicRepositoryConnector.java:258)
 at org.eclipse.aether.internal.impl.DefaultArtifactResolver.performDownloads(DefaultArtifactResolver.java:529)
 at org.eclipse.aether.internal.impl.DefaultArtifactResolver.resolve(DefaultArtifactResolver.java:430)
 ... 31 more
[ERROR]   
[ERROR]   The project org.apache.maven.plugin.rresource.it.mrr41:child-2:[unknown-version] (F:\jenkins\jenkins-slave\workspace\rces-plugin_MRRESOURCES-103-OWZ3HFZ43MS4CUVJZUVLTQDPH6VF24RFDOZDFCITEPHO3WVUHWJQ\windows-jdk7-m3.5.x_build\target\test-classes\run-only-at-execution-root\child2\pom.xml) has 1 error
[ERROR]     Non-resolvable parent POM for org.apache.maven.plugin.rresource.it.mrr41:parent:[unknown-version]: Failure to find org.apache.maven.plugin.rresource.it:it-parent:pom:1.6-SNAPSHOT in http://repository.apache.org/snapshots/ was cached in the local repository, resolution will not be reattempted until the update interval of apache-snapshots has elapsed or updates are forced and 'parent.relativePath' points at wrong local POM @ org.apache.maven.plugin.rresource.it.mrr41:parent:[unknown-version], F:\jenkins\jenkins-slave\workspace\rces-plugin_MRRESOURCES-103-OWZ3HFZ43MS4CUVJZUVLTQDPH6VF24RFDOZDFCITEPHO3WVUHWJQ\windows-jdk7-m3.5.x_build\target\test-classes\run-only-at-execution-root\pom.xml, line 24, column 11 -> [Help 2]
org.apache.maven.model.resolution.UnresolvableModelException: Failure to find org.apache.maven.plugin.rresource.it:it-parent:pom:1.6-SNAPSHOT in http://repository.apache.org/snapshots/ was cached in the local repository, resolution will not be reattempted until the update interval of apache-snapshots has elapsed or updates are forced
 at org.apache.maven.project.ProjectModelResolver.resolveModel(ProjectModelResolver.java:197)
 at org.apache.maven.project.ProjectModelResolver.resolveModel(ProjectModelResolver.java:243)
 at org.apache.maven.model.building.DefaultModelBuilder.readParentExternally(DefaultModelBuilder.java:1051)
 at org.apache.maven.model.building.DefaultModelBuilder.readParent(DefaultModelBuilder.java:851)
 at org.apache.maven.model.building.DefaultModelBuilder.build(DefaultModelBuilder.java:331)
 at org.apache.maven.project.DefaultProjectBuilder.build(DefaultProjectBuilder.java:429)
 at org.apache.maven.project.DefaultProjectBuilder.build(DefaultProjectBuilder.java:398)
 at org.apache.maven.project.DefaultProjectBuilder.build(DefaultProjectBuilder.java:515)
 at org.apache.maven.project.DefaultProjectBuilder.build(DefaultProjectBuilder.java:398)
 at org.apache.maven.project.DefaultProjectBuilder.build(DefaultProjectBuilder.java:361)
 at org.apache.maven.graph.DefaultGraphBuilder.collectProjects(DefaultGraphBuilder.java:400)
 at org.apache.maven.graph.DefaultGraphBuilder.getProjectsForMavenReactor(DefaultGraphBuilder.java:391)
 at org.apache.maven.graph.DefaultGraphBuilder.build(DefaultGraphBuilder.java:78)
 at org.apache.maven.DefaultMaven.buildGraph(DefaultMaven.java:511)
 at org.apache.maven.DefaultMaven.doExecute(DefaultMaven.java:221)
 at org.apache.maven.DefaultMaven.doExecute(DefaultMaven.java:194)
 at org.apache.maven.DefaultMaven.execute(DefaultMaven.java:107)
 at org.apache.maven.cli.MavenCli.execute(MavenCli.java:993)
 at org.apache.maven.cli.MavenCli.doMain(MavenCli.java:345)
 at org.apache.maven.cli.MavenCli.main(MavenCli.java:191)
 at sun.reflect.NativeMethodAccessorImpl.invoke0(Native Method)
 at sun.reflect.NativeMethodAccessorImpl.invoke(NativeMethodAccessorImpl.java:57)
 at sun.reflect.DelegatingMethodAccessorImpl.invoke(DelegatingMethodAccessorImpl.java:43)
 at java.lang.reflect.Method.invoke(Method.java:606)
 at org.codehaus.plexus.classworlds.launcher.Launcher.launchEnhanced(Launcher.java:289)
 at org.codehaus.plexus.classworlds.launcher.Launcher.launch(Launcher.java:229)
 at org.codehaus.plexus.classworlds.launcher.Launcher.mainWithExitCode(Launcher.java:415)
 at org.codehaus.plexus.classworlds.launcher.Launcher.main(Launcher.java:356)
Caused by: org.eclipse.aether.resolution.ArtifactResolutionException: Failure to find org.apache.maven.plugin.rresource.it:it-parent:pom:1.6-SNAPSHOT in http://repository.apache.org/snapshots/ was cached in the local repository, resolution will not be reattempted until the update interval of apache-snapshots has elapsed or updates are forced
 at org.eclipse.aether.internal.impl.DefaultArtifactResolver.resolve(DefaultArtifactResolver.java:453)
 at org.eclipse.aether.internal.impl.DefaultArtifactResolver.resolveArtifacts(DefaultArtifactResolver.java:255)
 at org.eclipse.aether.internal.impl.DefaultArtifactResolver.resolveArtifact(DefaultArtifactResolver.java:232)
 at org.eclipse.aether.internal.impl.DefaultRepositorySystem.resolveArtifact(DefaultRepositorySystem.java:303)
 at org.apache.maven.project.ProjectModelResolver.resolveModel(ProjectModelResolver.java:193)
 ... 27 more
Caused by: org.eclipse.aether.transfer.ArtifactNotFoundException: Failure to find org.apache.maven.plugin.rresource.it:it-parent:pom:1.6-SNAPSHOT in http://repository.apache.org/snapshots/ was cached in the local repository, resolution will not be reattempted until the update interval of apache-snapshots has elapsed or updates are forced
 at org.eclipse.aether.internal.impl.DefaultUpdateCheckManager.newException(DefaultUpdateCheckManager.java:240)
 at org.eclipse.aether.internal.impl.DefaultUpdateCheckManager.checkArtifact(DefaultUpdateCheckManager.java:192)
 at org.eclipse.aether.internal.impl.DefaultArtifactResolver.gatherDownloads(DefaultArtifactResolver.java:594)
 at org.eclipse.aether.internal.impl.DefaultArtifactResolver.performDownloads(DefaultArtifactResolver.java:512)
 at org.eclipse.aether.internal.impl.DefaultArtifactResolver.resolve(DefaultArtifactResolver.java:430)
 ... 31 more
[ERROR] 
[ERROR] Re-run Maven using the -X switch to enable full debug logging.
[ERROR] 
[ERROR] For more information about the errors and possible solutions, please read the following articles:
[ERROR] [Help 1] http://cwiki.apache.org/confluence/display/MAVEN/ProjectBuildingException
[ERROR] [Help 2] http://cwiki.apache.org/confluence/display/MAVEN/UnresolvableModelException
Picked up JAVA_TOOL_OPTIONS: -Dmaven.ext.class.path="f:\jenkins\jenkins-slave\workspace\rces-plugin_MRRESOURCES-103-OWZ3HFZ43MS4CUVJZUVLTQDPH6VF24RFDOZDFCITEPHO3WVUHWJQ@tmp\withMaven8e656475\pipeline-maven-spy.jar" -Dorg.jenkinsci.plugins.pipeline.maven.reportsFolder="f:\jenkins\jenkins-slave\workspace\rces-plugin_MRRESOURCES-103-OWZ3HFZ43MS4CUVJZUVLTQDPH6VF24RFDOZDFCITEPHO3WVUHWJQ@tmp\withMaven8e656475" 


Stack Trace:
org.apache.maven.it.VerificationException: 
Exit code was non-zero: 1; command line and log = 
F:\jenkins\tools\maven\apache-maven-3.5.0\bin\mvn -e --batch-mode -Dhttps.protocols=TLSv1.2 -Dmaven.repo.local=f:\jenkins\jenkins-slave\workspace\rces-plugin_MRRESOURCES-103-OWZ3HFZ43MS4CUVJZUVLTQDPH6VF24RFDOZDFCITEPHO3WVUHWJQ\windows-jdk7-m3.5.x_build\target/it-repo org.apache.maven.plugins:maven-clean-plugin:clean generate-resources
[INFO] [jenkins-event-spy] Jenkins Maven Event Spy is disabled
[INFO] Error stacktraces are turned on.
[INFO] Scanning for projects...
[INFO] Downloading: http://repository.apache.org/snapshots/org/apache/maven/plugin/rresource/it/it-parent/1.6-SNAPSHOT/maven-metadata.xml
[INFO] Downloading: http://repository.apache.org/snapshots/org/apache/maven/plugin/rresource/it/it-parent/1.6-SNAPSHOT/it-parent-1.6-SNAPSHOT.pom
[ERROR] [ERROR] Some problems were encountered while processing the POMs:
[FATAL] Non-resolvable parent POM for org.apache.maven.plugin.rresource.it.mrr41:parent:[unknown-version]: Could not find artifact org.apache.maven.plugin.rresource.it:it-parent:pom:1.6-SNAPSHOT in apache-snapshots (http://repository.apache.org/snapshots/) and 'parent.relativePath' points at wrong local POM @ org.apache.maven.plugin.rresource.it.mrr41:parent:[unknown-version], F:\jenkins\jenkins-slave\workspace\rces-plugin_MRRESOURCES-103-OWZ3HFZ43MS4CUVJZUVLTQDPH6VF24RFDOZDFCITEPHO3WVUHWJQ\windows-jdk7-m3.5.x_build\target\test-classes\run-only-at-execution-root\pom.xml, line 24, column 11
[FATAL] Non-resolvable parent POM for org.apache.maven.plugin.rresource.it.mrr41:parent:[unknown-version]: Failure to find org.apache.maven.plugin.rresource.it:it-parent:pom:1.6-SNAPSHOT in http://repository.apache.org/snapshots/ was cached in the local repository, resolution will not be reattempted until the update interval of apache-snapshots has elapsed or updates are forced and 'parent.relativePath' points at wrong local POM @ org.apache.maven.plugin.rresource.it.mrr41:parent:[unknown-version], F:\jenkins\jenkins-slave\workspace\rces-plugin_MRRESOURCES-103-OWZ3HFZ43MS4CUVJZUVLTQDPH6VF24RFDOZDFCITEPHO3WVUHWJQ\windows-jdk7-m3.5.x_build\target\test-classes\run-only-at-execution-root\pom.xml, line 24, column 11
 @ 
[ERROR] The build could not read 2 projects -> [Help 1]
org.apache.maven.project.ProjectBuildingException: Some problems were encountered while processing the POMs:
[FATAL] Non-resolvable parent POM for org.apache.maven.plugin.rresource.it.mrr41:parent:[unknown-version]: Could not find artifact org.apache.maven.plugin.rresource.it:it-parent:pom:1.6-SNAPSHOT in apache-snapshots (http://repository.apache.org/snapshots/) and 'parent.relativePath' points at wrong local POM @ org.apache.maven.plugin.rresource.it.mrr41:parent:[unknown-version], F:\jenkins\jenkins-slave\workspace\rces-plugin_MRRESOURCES-103-OWZ3HFZ43MS4CUVJZUVLTQDPH6VF24RFDOZDFCITEPHO3WVUHWJQ\windows-jdk7-m3.5.x_build\target\test-classes\run-only-at-execution-root\pom.xml, line 24, column 11
[FATAL] Non-resolvable parent POM for org.apache.maven.plugin.rresource.it.mrr41:parent:[unknown-version]: Failure to find org.apache.maven.plugin.rresource.it:it-parent:pom:1.6-SNAPSHOT in http://repository.apache.org/snapshots/ was cached in the local repository, resolution will not be reattempted until the update interval of apache-snapshots has elapsed or updates are forced and 'parent.relativePath' points at wrong local POM @ org.apache.maven.plugin.rresource.it.mrr41:parent:[unknown-version], F:\jenkins\jenkins-slave\workspace\rces-plugin_MRRESOURCES-103-OWZ3HFZ43MS4CUVJZUVLTQDPH6VF24RFDOZDFCITEPHO3WVUHWJQ\windows-jdk7-m3.5.x_build\target\test-classes\run-only-at-execution-root\pom.xml, line 24, column 11

	at org.apache.maven.project.DefaultProjectBuilder.build(DefaultProjectBuilder.java:382)
	at org.apache.maven.graph.DefaultGraphBuilder.collectProjects(DefaultGraphBuilder.java:400)
	at org.apache.maven.graph.DefaultGraphBuilder.getProjectsForMavenReactor(DefaultGraphBuilder.java:391)
	at org.apache.maven.graph.DefaultGraphBuilder.build(DefaultGraphBuilder.java:78)
	at org.apache.maven.DefaultMaven.buildGraph(DefaultMaven.java:511)
	at org.apache.maven.DefaultMaven.doExecute(DefaultMaven.java:221)
	at org.apache.maven.DefaultMaven.doExecute(DefaultMaven.java:194)
	at org.apache.maven.DefaultMaven.execute(DefaultMaven.java:107)
	at org.apache.maven.cli.MavenCli.execute(MavenCli.java:993)
	at org.apache.maven.cli.MavenCli.doMain(MavenCli.java:345)
	at org.apache.maven.cli.MavenCli.main(MavenCli.java:191)
	at sun.reflect.NativeMethodAccessorImpl.invoke0(Native Method)
	at sun.reflect.NativeMethodAccessorImpl.invoke(NativeMethodAccessorImpl.java:57)
	at sun.reflect.DelegatingMethodAccessorImpl.invoke(DelegatingMethodAccessorImpl.java:43)
	at java.lang.reflect.Method.invoke(Method.java:606)
	at org.codehaus.plexus.classworlds.launcher.Launcher.launchEnhanced(Launcher.java:289)
	at org.codehaus.plexus.classworlds.launcher.Launcher.launch(Launcher.java:229)
	at org.codehaus.plexus.classworlds.launcher.Launcher.mainWithExitCode(Launcher.java:415)
	at org.codehaus.plexus.classworlds.launcher.Launcher.main(Launcher.java:356)
[ERROR]   
[ERROR]   The project org.apache.maven.plugin.rresource.it.mrr41:child-1:[unknown-version] (F:\jenkins\jenkins-slave\workspace\rces-plugin_MRRESOURCES-103-OWZ3HFZ43MS4CUVJZUVLTQDPH6VF24RFDOZDFCITEPHO3WVUHWJQ\windows-jdk7-m3.5.x_build\target\test-classes\run-only-at-execution-root\child1\pom.xml) has 1 error
[ERROR]     Non-resolvable parent POM for org.apache.maven.plugin.rresource.it.mrr41:parent:[unknown-version]: Could not find artifact org.apache.maven.plugin.rresource.it:it-parent:pom:1.6-SNAPSHOT in apache-snapshots (http://repository.apache.org/snapshots/) and 'parent.relativePath' points at wrong local POM @ org.apache.maven.plugin.rresource.it.mrr41:parent:[unknown-version], F:\jenkins\jenkins-slave\workspace\rces-plugin_MRRESOURCES-103-OWZ3HFZ43MS4CUVJZUVLTQDPH6VF24RFDOZDFCITEPHO3WVUHWJQ\windows-jdk7-m3.5.x_build\target\test-classes\run-only-at-execution-root\pom.xml, line 24, column 11 -> [Help 2]
org.apache.maven.model.resolution.UnresolvableModelException: Could not find artifact org.apache.maven.plugin.rresource.it:it-parent:pom:1.6-SNAPSHOT in apache-snapshots (http://repository.apache.org/snapshots/)
	at org.apache.maven.project.ProjectModelResolver.resolveModel(ProjectModelResolver.java:197)
	at org.apache.maven.project.ProjectModelResolver.resolveModel(ProjectModelResolver.java:243)
	at org.apache.maven.model.building.DefaultModelBuilder.readParentExternally(DefaultModelBuilder.java:1051)
	at org.apache.maven.model.building.DefaultModelBuilder.readParent(DefaultModelBuilder.java:851)
	at org.apache.maven.model.building.DefaultModelBuilder.build(DefaultModelBuilder.java:331)
	at org.apache.maven.project.DefaultProjectBuilder.build(DefaultProjectBuilder.java:429)
	at org.apache.maven.project.DefaultProjectBuilder.build(DefaultProjectBuilder.java:398)
	at org.apache.maven.project.DefaultProjectBuilder.build(DefaultProjectBuilder.java:515)
	at org.apache.maven.project.DefaultProjectBuilder.build(DefaultProjectBuilder.java:398)
	at org.apache.maven.project.DefaultProjectBuilder.build(DefaultProjectBuilder.java:361)
	at org.apache.maven.graph.DefaultGraphBuilder.collectProjects(DefaultGraphBuilder.java:400)
	at org.apache.maven.graph.DefaultGraphBuilder.getProjectsForMavenReactor(DefaultGraphBuilder.java:391)
	at org.apache.maven.graph.DefaultGraphBuilder.build(DefaultGraphBuilder.java:78)
	at org.apache.maven.DefaultMaven.buildGraph(DefaultMaven.java:511)
	at org.apache.maven.DefaultMaven.doExecute(DefaultMaven.java:221)
	at org.apache.maven.DefaultMaven.doExecute(DefaultMaven.java:194)
	at org.apache.maven.DefaultMaven.execute(DefaultMaven.java:107)
	at org.apache.maven.cli.MavenCli.execute(MavenCli.java:993)
	at org.apache.maven.cli.MavenCli.doMain(MavenCli.java:345)
	at org.apache.maven.cli.MavenCli.main(MavenCli.java:191)
	at sun.reflect.NativeMethodAccessorImpl.invoke0(Native Method)
	at sun.reflect.NativeMethodAccessorImpl.invoke(NativeMethodAccessorImpl.java:57)
	at sun.reflect.DelegatingMethodAccessorImpl.invoke(DelegatingMethodAccessorImpl.java:43)
	at java.lang.reflect.Method.invoke(Method.java:606)
	at org.codehaus.plexus.classworlds.launcher.Launcher.launchEnhanced(Launcher.java:289)
	at org.codehaus.plexus.classworlds.launcher.Launcher.launch(Launcher.java:229)
	at org.codehaus.plexus.classworlds.launcher.Launcher.mainWithExitCode(Launcher.java:415)
	at org.codehaus.plexus.classworlds.launcher.Launcher.main(Launcher.java:356)
Caused by: org.eclipse.aether.resolution.ArtifactResolutionException: Could not find artifact org.apache.maven.plugin.rresource.it:it-parent:pom:1.6-SNAPSHOT in apache-snapshots (http://repository.apache.org/snapshots/)
	at org.eclipse.aether.internal.impl.DefaultArtifactResolver.resolve(DefaultArtifactResolver.java:453)
	at org.eclipse.aether.internal.impl.DefaultArtifactResolver.resolveArtifacts(DefaultArtifactResolver.java:255)
	at org.eclipse.aether.internal.impl.DefaultArtifactResolver.resolveArtifact(DefaultArtifactResolver.java:232)
	at org.eclipse.aether.internal.impl.DefaultRepositorySystem.resolveArtifact(DefaultRepositorySystem.java:303)
	at org.apache.maven.project.ProjectModelResolver.resolveModel(ProjectModelResolver.java:193)
	... 27 more
Caused by: org.eclipse.aether.transfer.ArtifactNotFoundException: Could not find artifact org.apache.maven.plugin.rresource.it:it-parent:pom:1.6-SNAPSHOT in apache-snapshots (http://repository.apache.org/snapshots/)
	at org.eclipse.aether.connector.basic.ArtifactTransportListener.transferFailed(ArtifactTransportListener.java:48)
	at org.eclipse.aether.connector.basic.BasicRepositoryConnector$TaskRunner.run(BasicRepositoryConnector.java:364)
	at org.eclipse.aether.util.concurrency.RunnableErrorForwarder$1.run(RunnableErrorForwarder.java:76)
	at org.eclipse.aether.connector.basic.BasicRepositoryConnector$DirectExecutor.execute(BasicRepositoryConnector.java:590)
	at org.eclipse.aether.connector.basic.BasicRepositoryConnector.get(BasicRepositoryConnector.java:258)
	at org.eclipse.aether.internal.impl.DefaultArtifactResolver.performDownloads(DefaultArtifactResolver.java:529)
	at org.eclipse.aether.internal.impl.DefaultArtifactResolver.resolve(DefaultArtifactResolver.java:430)
	... 31 more
[ERROR]   
[ERROR]   The project org.apache.maven.plugin.rresource.it.mrr41:child-2:[unknown-version] (F:\jenkins\jenkins-slave\workspace\rces-plugin_MRRESOURCES-103-OWZ3HFZ43MS4CUVJZUVLTQDPH6VF24RFDOZDFCITEPHO3WVUHWJQ\windows-jdk7-m3.5.x_build\target\test-classes\run-only-at-execution-root\child2\pom.xml) has 1 error
[ERROR]     Non-resolvable parent POM for org.apache.maven.plugin.rresource.it.mrr41:parent:[unknown-version]: Failure to find org.apache.maven.plugin.rresource.it:it-parent:pom:1.6-SNAPSHOT in http://repository.apache.org/snapshots/ was cached in the local repository, resolution will not be reattempted until the update interval of apache-snapshots has elapsed or updates are forced and 'parent.relativePath' points at wrong local POM @ org.apache.maven.plugin.rresource.it.mrr41:parent:[unknown-version], F:\jenkins\jenkins-slave\workspace\rces-plugin_MRRESOURCES-103-OWZ3HFZ43MS4CUVJZUVLTQDPH6VF24RFDOZDFCITEPHO3WVUHWJQ\windows-jdk7-m3.5.x_build\target\test-classes\run-only-at-execution-root\pom.xml, line 24, column 11 -> [Help 2]
org.apache.maven.model.resolution.UnresolvableModelException: Failure to find org.apache.maven.plugin.rresource.it:it-parent:pom:1.6-SNAPSHOT in http://repository.apache.org/snapshots/ was cached in the local repository, resolution will not be reattempted until the update interval of apache-snapshots has elapsed or updates are forced
	at org.apache.maven.project.ProjectModelResolver.resolveModel(ProjectModelResolver.java:197)
	at org.apache.maven.project.ProjectModelResolver.resolveModel(ProjectModelResolver.java:243)
	at org.apache.maven.model.building.DefaultModelBuilder.readParentExternally(DefaultModelBuilder.java:1051)
	at org.apache.maven.model.building.DefaultModelBuilder.readParent(DefaultModelBuilder.java:851)
	at org.apache.maven.model.building.DefaultModelBuilder.build(DefaultModelBuilder.java:331)
	at org.apache.maven.project.DefaultProjectBuilder.build(DefaultProjectBuilder.java:429)
	at org.apache.maven.project.DefaultProjectBuilder.build(DefaultProjectBuilder.java:398)
	at org.apache.maven.project.DefaultProjectBuilder.build(DefaultProjectBuilder.java:515)
	at org.apache.maven.project.DefaultProjectBuilder.build(DefaultProjectBuilder.java:398)
	at org.apache.maven.project.DefaultProjectBuilder.build(DefaultProjectBuilder.java:361)
	at org.apache.maven.graph.DefaultGraphBuilder.collectProjects(DefaultGraphBuilder.java:400)
	at org.apache.maven.graph.DefaultGraphBuilder.getProjectsForMavenReactor(DefaultGraphBuilder.java:391)
	at org.apache.maven.graph.DefaultGraphBuilder.build(DefaultGraphBuilder.java:78)
	at org.apache.maven.DefaultMaven.buildGraph(DefaultMaven.java:511)
	at org.apache.maven.DefaultMaven.doExecute(DefaultMaven.java:221)
	at org.apache.maven.DefaultMaven.doExecute(DefaultMaven.java:194)
	at org.apache.maven.DefaultMaven.execute(DefaultMaven.java:107)
	at org.apache.maven.cli.MavenCli.execute(MavenCli.java:993)
	at org.apache.maven.cli.MavenCli.doMain(MavenCli.java:345)
	at org.apache.maven.cli.MavenCli.main(MavenCli.java:191)
	at sun.reflect.NativeMethodAccessorImpl.invoke0(Native Method)
	at sun.reflect.NativeMethodAccessorImpl.invoke(NativeMethodAccessorImpl.java:57)
	at sun.reflect.DelegatingMethodAccessorImpl.invoke(DelegatingMethodAccessorImpl.java:43)
	at java.lang.reflect.Method.invoke(Method.java:606)
	at org.codehaus.plexus.classworlds.launcher.Launcher.launchEnhanced(Launcher.java:289)
	at org.codehaus.plexus.classworlds.launcher.Launcher.launch(Launcher.java:229)
	at org.codehaus.plexus.classworlds.launcher.Launcher.mainWithExitCode(Launcher.java:415)
	at org.codehaus.plexus.classworlds.launcher.Launcher.main(Launcher.java:356)
Caused by: org.eclipse.aether.resolution.ArtifactResolutionException: Failure to find org.apache.maven.plugin.rresource.it:it-parent:pom:1.6-SNAPSHOT in http://repository.apache.org/snapshots/ was cached in the local repository, resolution will not be reattempted until the update interval of apache-snapshots has elapsed or updates are forced
	at org.eclipse.aether.internal.impl.DefaultArtifactResolver.resolve(DefaultArtifactResolver.java:453)
	at org.eclipse.aether.internal.impl.DefaultArtifactResolver.resolveArtifacts(DefaultArtifactResolver.java:255)
	at org.eclipse.aether.internal.impl.DefaultArtifactResolver.resolveArtifact(DefaultArtifactResolver.java:232)
	at org.eclipse.aether.internal.impl.DefaultRepositorySystem.resolveArtifact(DefaultRepositorySystem.java:303)
	at org.apache.maven.project.ProjectModelResolver.resolveModel(ProjectModelResolver.java:193)
	... 27 more
Caused by: org.eclipse.aether.transfer.ArtifactNotFoundException: Failure to find org.apache.maven.plugin.rresource.it:it-parent:pom:1.6-SNAPSHOT in http://repository.apache.org/snapshots/ was cached in the local repository, resolution will not be reattempted until the update interval of apache-snapshots has elapsed or updates are forced
	at org.eclipse.aether.internal.impl.DefaultUpdateCheckManager.newException(DefaultUpdateCheckManager.java:240)
	at org.eclipse.aether.internal.impl.DefaultUpdateCheckManager.checkArtifact(DefaultUpdateCheckManager.java:192)
	at org.eclipse.aether.internal.impl.DefaultArtifactResolver.gatherDownloads(DefaultArtifactResolver.java:594)
	at org.eclipse.aether.internal.impl.DefaultArtifactResolver.performDownloads(DefaultArtifactResolver.java:512)
	at org.eclipse.aether.internal.impl.DefaultArtifactResolver.resolve(DefaultArtifactResolver.java:430)
	... 31 more
[ERROR] 
[ERROR] Re-run Maven using the -X switch to enable full debug logging.
[ERROR] 
[ERROR] For more information about the errors and possible solutions, please read the following articles:
[ERROR] [Help 1] http://cwiki.apache.org/confluence/display/MAVEN/ProjectBuildingException
[ERROR] [Help 2] http://cwiki.apache.org/confluence/display/MAVEN/UnresolvableModelException
Picked up JAVA_TOOL_OPTIONS: -Dmaven.ext.class.path="f:\jenkins\jenkins-slave\workspace\rces-plugin_MRRESOURCES-103-OWZ3HFZ43MS4CUVJZUVLTQDPH6VF24RFDOZDFCITEPHO3WVUHWJQ@tmp\withMaven8e656475\pipeline-maven-spy.jar" -Dorg.jenkinsci.plugins.pipeline.maven.reportsFolder="f:\jenkins\jenkins-slave\workspace\rces-plugin_MRRESOURCES-103-OWZ3HFZ43MS4CUVJZUVLTQDPH6VF24RFDOZDFCITEPHO3WVUHWJQ@tmp\withMaven8e656475" 

	at org.apache.maven.plugin.resources.remote.it.IT_RunOnlyAtExecutionRoot.test(IT_RunOnlyAtExecutionRoot.java:62)


FAILED:  org.apache.maven.plugin.resources.remote.it.IT_RunOnlyAtExecutionRoot.test

Error Message:
Exit code was non-zero: 1; command line and log = 
F:\jenkins\tools\maven\apache-maven-3.5.0\bin\mvn -e --batch-mode -Dhttps.protocols=TLSv1.2 -Dmaven.repo.local=f:\jenkins\jenkins-slave\workspace\rces-plugin_MRRESOURCES-103-OWZ3HFZ43MS4CUVJZUVLTQDPH6VF24RFDOZDFCITEPHO3WVUHWJQ@2\windows-jdk8-m3.5.x_build\target/it-repo org.apache.maven.plugins:maven-clean-plugin:clean generate-resources
[INFO] [jenkins-event-spy] Jenkins Maven Event Spy is disabled
[INFO] Error stacktraces are turned on.
[INFO] Scanning for projects...
[INFO] Downloading: http://repository.apache.org/snapshots/org/apache/maven/plugin/rresource/it/it-parent/1.6-SNAPSHOT/maven-metadata.xml
[INFO] Downloading: http://repository.apache.org/snapshots/org/apache/maven/plugin/rresource/it/it-parent/1.6-SNAPSHOT/it-parent-1.6-SNAPSHOT.pom
[ERROR] [ERROR] Some problems were encountered while processing the POMs:
[FATAL] Non-resolvable parent POM for org.apache.maven.plugin.rresource.it.mrr41:parent:[unknown-version]: Could not find artifact org.apache.maven.plugin.rresource.it:it-parent:pom:1.6-SNAPSHOT in apache-snapshots (http://repository.apache.org/snapshots/) and 'parent.relativePath' points at wrong local POM @ org.apache.maven.plugin.rresource.it.mrr41:parent:[unknown-version], F:\jenkins\jenkins-slave\workspace\rces-plugin_MRRESOURCES-103-OWZ3HFZ43MS4CUVJZUVLTQDPH6VF24RFDOZDFCITEPHO3WVUHWJQ@2\windows-jdk8-m3.5.x_build\target\test-classes\run-only-at-execution-root\pom.xml, line 24, column 11
[FATAL] Non-resolvable parent POM for org.apache.maven.plugin.rresource.it.mrr41:parent:[unknown-version]: Failure to find org.apache.maven.plugin.rresource.it:it-parent:pom:1.6-SNAPSHOT in http://repository.apache.org/snapshots/ was cached in the local repository, resolution will not be reattempted until the update interval of apache-snapshots has elapsed or updates are forced and 'parent.relativePath' points at wrong local POM @ org.apache.maven.plugin.rresource.it.mrr41:parent:[unknown-version], F:\jenkins\jenkins-slave\workspace\rces-plugin_MRRESOURCES-103-OWZ3HFZ43MS4CUVJZUVLTQDPH6VF24RFDOZDFCITEPHO3WVUHWJQ@2\windows-jdk8-m3.5.x_build\target\test-classes\run-only-at-execution-root\pom.xml, line 24, column 11
 @ 
[ERROR] The build could not read 2 projects -> [Help 1]
org.apache.maven.project.ProjectBuildingException: Some problems were encountered while processing the POMs:
[FATAL] Non-resolvable parent POM for org.apache.maven.plugin.rresource.it.mrr41:parent:[unknown-version]: Could not find artifact org.apache.maven.plugin.rresource.it:it-parent:pom:1.6-SNAPSHOT in apache-snapshots (http://repository.apache.org/snapshots/) and 'parent.relativePath' points at wrong local POM @ org.apache.maven.plugin.rresource.it.mrr41:parent:[unknown-version], F:\jenkins\jenkins-slave\workspace\rces-plugin_MRRESOURCES-103-OWZ3HFZ43MS4CUVJZUVLTQDPH6VF24RFDOZDFCITEPHO3WVUHWJQ@2\windows-jdk8-m3.5.x_build\target\test-classes\run-only-at-execution-root\pom.xml, line 24, column 11
[FATAL] Non-resolvable parent POM for org.apache.maven.plugin.rresource.it.mrr41:parent:[unknown-version]: Failure to find org.apache.maven.plugin.rresource.it:it-parent:pom:1.6-SNAPSHOT in http://repository.apache.org/snapshots/ was cached in the local repository, resolution will not be reattempted until the update interval of apache-snapshots has elapsed or updates are forced and 'parent.relativePath' points at wrong local POM @ org.apache.maven.plugin.rresource.it.mrr41:parent:[unknown-version], F:\jenkins\jenkins-slave\workspace\rces-plugin_MRRESOURCES-103-OWZ3HFZ43MS4CUVJZUVLTQDPH6VF24RFDOZDFCITEPHO3WVUHWJQ@2\windows-jdk8-m3.5.x_build\target\test-classes\run-only-at-execution-root\pom.xml, line 24, column 11

 at org.apache.maven.project.DefaultProjectBuilder.build(DefaultProjectBuilder.java:382)
 at org.apache.maven.graph.DefaultGraphBuilder.collectProjects(DefaultGraphBuilder.java:400)
 at org.apache.maven.graph.DefaultGraphBuilder.getProjectsForMavenReactor(DefaultGraphBuilder.java:391)
 at org.apache.maven.graph.DefaultGraphBuilder.build(DefaultGraphBuilder.java:78)
 at org.apache.maven.DefaultMaven.buildGraph(DefaultMaven.java:511)
 at org.apache.maven.DefaultMaven.doExecute(DefaultMaven.java:221)
 at org.apache.maven.DefaultMaven.doExecute(DefaultMaven.java:194)
 at org.apache.maven.DefaultMaven.execute(DefaultMaven.java:107)
 at org.apache.maven.cli.MavenCli.execute(MavenCli.java:993)
 at org.apache.maven.cli.MavenCli.doMain(MavenCli.java:345)
 at org.apache.maven.cli.MavenCli.main(MavenCli.java:191)
 at sun.reflect.NativeMethodAccessorImpl.invoke0(Native Method)
 at sun.reflect.NativeMethodAccessorImpl.invoke(NativeMethodAccessorImpl.java:62)
 at sun.reflect.DelegatingMethodAccessorImpl.invoke(DelegatingMethodAccessorImpl.java:43)
 at java.lang.reflect.Method.invoke(Method.java:498)
 at org.codehaus.plexus.classworlds.launcher.Launcher.launchEnhanced(Launcher.java:289)
 at org.codehaus.plexus.classworlds.launcher.Launcher.launch(Launcher.java:229)
 at org.codehaus.plexus.classworlds.launcher.Launcher.mainWithExitCode(Launcher.java:415)
 at org.codehaus.plexus.classworlds.launcher.Launcher.main(Launcher.java:356)
[ERROR]   
[ERROR]   The project org.apache.maven.plugin.rresource.it.mrr41:child-1:[unknown-version] (F:\jenkins\jenkins-slave\workspace\rces-plugin_MRRESOURCES-103-OWZ3HFZ43MS4CUVJZUVLTQDPH6VF24RFDOZDFCITEPHO3WVUHWJQ@2\windows-jdk8-m3.5.x_build\target\test-classes\run-only-at-execution-root\child1\pom.xml) has 1 error
[ERROR]     Non-resolvable parent POM for org.apache.maven.plugin.rresource.it.mrr41:parent:[unknown-version]: Could not find artifact org.apache.maven.plugin.rresource.it:it-parent:pom:1.6-SNAPSHOT in apache-snapshots (http://repository.apache.org/snapshots/) and 'parent.relativePath' points at wrong local POM @ org.apache.maven.plugin.rresource.it.mrr41:parent:[unknown-version], F:\jenkins\jenkins-slave\workspace\rces-plugin_MRRESOURCES-103-OWZ3HFZ43MS4CUVJZUVLTQDPH6VF24RFDOZDFCITEPHO3WVUHWJQ@2\windows-jdk8-m3.5.x_build\target\test-classes\run-only-at-execution-root\pom.xml, line 24, column 11 -> [Help 2]
org.apache.maven.model.resolution.UnresolvableModelException: Could not find artifact org.apache.maven.plugin.rresource.it:it-parent:pom:1.6-SNAPSHOT in apache-snapshots (http://repository.apache.org/snapshots/)
 at org.apache.maven.project.ProjectModelResolver.resolveModel(ProjectModelResolver.java:197)
 at org.apache.maven.project.ProjectModelResolver.resolveModel(ProjectModelResolver.java:243)
 at org.apache.maven.model.building.DefaultModelBuilder.readParentExternally(DefaultModelBuilder.java:1051)
 at org.apache.maven.model.building.DefaultModelBuilder.readParent(DefaultModelBuilder.java:851)
 at org.apache.maven.model.building.DefaultModelBuilder.build(DefaultModelBuilder.java:331)
 at org.apache.maven.project.DefaultProjectBuilder.build(DefaultProjectBuilder.java:429)
 at org.apache.maven.project.DefaultProjectBuilder.build(DefaultProjectBuilder.java:398)
 at org.apache.maven.project.DefaultProjectBuilder.build(DefaultProjectBuilder.java:515)
 at org.apache.maven.project.DefaultProjectBuilder.build(DefaultProjectBuilder.java:398)
 at org.apache.maven.project.DefaultProjectBuilder.build(DefaultProjectBuilder.java:361)
 at org.apache.maven.graph.DefaultGraphBuilder.collectProjects(DefaultGraphBuilder.java:400)
 at org.apache.maven.graph.DefaultGraphBuilder.getProjectsForMavenReactor(DefaultGraphBuilder.java:391)
 at org.apache.maven.graph.DefaultGraphBuilder.build(DefaultGraphBuilder.java:78)
 at org.apache.maven.DefaultMaven.buildGraph(DefaultMaven.java:511)
 at org.apache.maven.DefaultMaven.doExecute(DefaultMaven.java:221)
 at org.apache.maven.DefaultMaven.doExecute(DefaultMaven.java:194)
 at org.apache.maven.DefaultMaven.execute(DefaultMaven.java:107)
 at org.apache.maven.cli.MavenCli.execute(MavenCli.java:993)
 at org.apache.maven.cli.MavenCli.doMain(MavenCli.java:345)
 at org.apache.maven.cli.MavenCli.main(MavenCli.java:191)
 at sun.reflect.NativeMethodAccessorImpl.invoke0(Native Method)
 at sun.reflect.NativeMethodAccessorImpl.invoke(NativeMethodAccessorImpl.java:62)
 at sun.reflect.DelegatingMethodAccessorImpl.invoke(DelegatingMethodAccessorImpl.java:43)
 at java.lang.reflect.Method.invoke(Method.java:498)
 at org.codehaus.plexus.classworlds.launcher.Launcher.launchEnhanced(Launcher.java:289)
 at org.codehaus.plexus.classworlds.launcher.Launcher.launch(Launcher.java:229)
 at org.codehaus.plexus.classworlds.launcher.Launcher.mainWithExitCode(Launcher.java:415)
 at org.codehaus.plexus.classworlds.launcher.Launcher.main(Launcher.java:356)
Caused by: org.eclipse.aether.resolution.ArtifactResolutionException: Could not find artifact org.apache.maven.plugin.rresource.it:it-parent:pom:1.6-SNAPSHOT in apache-snapshots (http://repository.apache.org/snapshots/)
 at org.eclipse.aether.internal.impl.DefaultArtifactResolver.resolve(DefaultArtifactResolver.java:453)
 at org.eclipse.aether.internal.impl.DefaultArtifactResolver.resolveArtifacts(DefaultArtifactResolver.java:255)
 at org.eclipse.aether.internal.impl.DefaultArtifactResolver.resolveArtifact(DefaultArtifactResolver.java:232)
 at org.eclipse.aether.internal.impl.DefaultRepositorySystem.resolveArtifact(DefaultRepositorySystem.java:303)
 at org.apache.maven.project.ProjectModelResolver.resolveModel(ProjectModelResolver.java:193)
 ... 27 more
Caused by: org.eclipse.aether.transfer.ArtifactNotFoundException: Could not find artifact org.apache.maven.plugin.rresource.it:it-parent:pom:1.6-SNAPSHOT in apache-snapshots (http://repository.apache.org/snapshots/)
 at org.eclipse.aether.connector.basic.ArtifactTransportListener.transferFailed(ArtifactTransportListener.java:48)
 at org.eclipse.aether.connector.basic.BasicRepositoryConnector$TaskRunner.run(BasicRepositoryConnector.java:364)
 at org.eclipse.aether.util.concurrency.RunnableErrorForwarder$1.run(RunnableErrorForwarder.java:76)
 at org.eclipse.aether.connector.basic.BasicRepositoryConnector$DirectExecutor.execute(BasicRepositoryConnector.java:590)
 at org.eclipse.aether.connector.basic.BasicRepositoryConnector.get(BasicRepositoryConnector.java:258)
 at org.eclipse.aether.internal.impl.DefaultArtifactResolver.performDownloads(DefaultArtifactResolver.java:529)
 at org.eclipse.aether.internal.impl.DefaultArtifactResolver.resolve(DefaultArtifactResolver.java:430)
 ... 31 more
[ERROR]   
[ERROR]   The project org.apache.maven.plugin.rresource.it.mrr41:child-2:[unknown-version] (F:\jenkins\jenkins-slave\workspace\rces-plugin_MRRESOURCES-103-OWZ3HFZ43MS4CUVJZUVLTQDPH6VF24RFDOZDFCITEPHO3WVUHWJQ@2\windows-jdk8-m3.5.x_build\target\test-classes\run-only-at-execution-root\child2\pom.xml) has 1 error
[ERROR]     Non-resolvable parent POM for org.apache.maven.plugin.rresource.it.mrr41:parent:[unknown-version]: Failure to find org.apache.maven.plugin.rresource.it:it-parent:pom:1.6-SNAPSHOT in http://repository.apache.org/snapshots/ was cached in the local repository, resolution will not be reattempted until the update interval of apache-snapshots has elapsed or updates are forced and 'parent.relativePath' points at wrong local POM @ org.apache.maven.plugin.rresource.it.mrr41:parent:[unknown-version], F:\jenkins\jenkins-slave\workspace\rces-plugin_MRRESOURCES-103-OWZ3HFZ43MS4CUVJZUVLTQDPH6VF24RFDOZDFCITEPHO3WVUHWJQ@2\windows-jdk8-m3.5.x_build\target\test-classes\run-only-at-execution-root\pom.xml, line 24, column 11 -> [Help 2]
org.apache.maven.model.resolution.UnresolvableModelException: Failure to find org.apache.maven.plugin.rresource.it:it-parent:pom:1.6-SNAPSHOT in http://repository.apache.org/snapshots/ was cached in the local repository, resolution will not be reattempted until the update interval of apache-snapshots has elapsed or updates are forced
 at org.apache.maven.project.ProjectModelResolver.resolveModel(ProjectModelResolver.java:197)
 at org.apache.maven.project.ProjectModelResolver.resolveModel(ProjectModelResolver.java:243)
 at org.apache.maven.model.building.DefaultModelBuilder.readParentExternally(DefaultModelBuilder.java:1051)
 at org.apache.maven.model.building.DefaultModelBuilder.readParent(DefaultModelBuilder.java:851)
 at org.apache.maven.model.building.DefaultModelBuilder.build(DefaultModelBuilder.java:331)
 at org.apache.maven.project.DefaultProjectBuilder.build(DefaultProjectBuilder.java:429)
 at org.apache.maven.project.DefaultProjectBuilder.build(DefaultProjectBuilder.java:398)
 at org.apache.maven.project.DefaultProjectBuilder.build(DefaultProjectBuilder.java:515)
 at org.apache.maven.project.DefaultProjectBuilder.build(DefaultProjectBuilder.java:398)
 at org.apache.maven.project.DefaultProjectBuilder.build(DefaultProjectBuilder.java:361)
 at org.apache.maven.graph.DefaultGraphBuilder.collectProjects(DefaultGraphBuilder.java:400)
 at org.apache.maven.graph.DefaultGraphBuilder.getProjectsForMavenReactor(DefaultGraphBuilder.java:391)
 at org.apache.maven.graph.DefaultGraphBuilder.build(DefaultGraphBuilder.java:78)
 at org.apache.maven.DefaultMaven.buildGraph(DefaultMaven.java:511)
 at org.apache.maven.DefaultMaven.doExecute(DefaultMaven.java:221)
 at org.apache.maven.DefaultMaven.doExecute(DefaultMaven.java:194)
 at org.apache.maven.DefaultMaven.execute(DefaultMaven.java:107)
 at org.apache.maven.cli.MavenCli.execute(MavenCli.java:993)
 at org.apache.maven.cli.MavenCli.doMain(MavenCli.java:345)
 at org.apache.maven.cli.MavenCli.main(MavenCli.java:191)
 at sun.reflect.NativeMethodAccessorImpl.invoke0(Native Method)
 at sun.reflect.NativeMethodAccessorImpl.invoke(NativeMethodAccessorImpl.java:62)
 at sun.reflect.DelegatingMethodAccessorImpl.invoke(DelegatingMethodAccessorImpl.java:43)
 at java.lang.reflect.Method.invoke(Method.java:498)
 at org.codehaus.plexus.classworlds.launcher.Launcher.launchEnhanced(Launcher.java:289)
 at org.codehaus.plexus.classworlds.launcher.Launcher.launch(Launcher.java:229)
 at org.codehaus.plexus.classworlds.launcher.Launcher.mainWithExitCode(Launcher.java:415)
 at org.codehaus.plexus.classworlds.launcher.Launcher.main(Launcher.java:356)
Caused by: org.eclipse.aether.resolution.ArtifactResolutionException: Failure to find org.apache.maven.plugin.rresource.it:it-parent:pom:1.6-SNAPSHOT in http://repository.apache.org/snapshots/ was cached in the local repository, resolution will not be reattempted until the update interval of apache-snapshots has elapsed or updates are forced
 at org.eclipse.aether.internal.impl.DefaultArtifactResolver.resolve(DefaultArtifactResolver.java:453)
 at org.eclipse.aether.internal.impl.DefaultArtifactResolver.resolveArtifacts(DefaultArtifactResolver.java:255)
 at org.eclipse.aether.internal.impl.DefaultArtifactResolver.resolveArtifact(DefaultArtifactResolver.java:232)
 at org.eclipse.aether.internal.impl.DefaultRepositorySystem.resolveArtifact(DefaultRepositorySystem.java:303)
 at org.apache.maven.project.ProjectModelResolver.resolveModel(ProjectModelResolver.java:193)
 ... 27 more
Caused by: org.eclipse.aether.transfer.ArtifactNotFoundException: Failure to find org.apache.maven.plugin.rresource.it:it-parent:pom:1.6-SNAPSHOT in http://repository.apache.org/snapshots/ was cached in the local repository, resolution will not be reattempted until the update interval of apache-snapshots has elapsed or updates are forced
 at org.eclipse.aether.internal.impl.DefaultUpdateCheckManager.newException(DefaultUpdateCheckManager.java:240)
 at org.eclipse.aether.internal.impl.DefaultUpdateCheckManager.checkArtifact(DefaultUpdateCheckManager.java:192)
 at org.eclipse.aether.internal.impl.DefaultArtifactResolver.gatherDownloads(DefaultArtifactResolver.java:594)
 at org.eclipse.aether.internal.impl.DefaultArtifactResolver.performDownloads(DefaultArtifactResolver.java:512)
 at org.eclipse.aether.internal.impl.DefaultArtifactResolver.resolve(DefaultArtifactResolver.java:430)
 ... 31 more
[ERROR] 
[ERROR] Re-run Maven using the -X switch to enable full debug logging.
[ERROR] 
[ERROR] For more information about the errors and possible solutions, please read the following articles:
[ERROR] [Help 1] http://cwiki.apache.org/confluence/display/MAVEN/ProjectBuildingException
[ERROR] [Help 2] http://cwiki.apache.org/confluence/display/MAVEN/UnresolvableModelException
Picked up JAVA_TOOL_OPTIONS: -Dmaven.ext.class.path="f:\jenkins\jenkins-slave\workspace\rces-plugin_MRRESOURCES-103-OWZ3HFZ43MS4CUVJZUVLTQDPH6VF24RFDOZDFCITEPHO3WVUHWJQ@2@tmp\withMavenfe8e1d7c\pipeline-maven-spy.jar" -Dorg.jenkinsci.plugins.pipeline.maven.reportsFolder="f:\jenkins\jenkins-slave\workspace\rces-plugin_MRRESOURCES-103-OWZ3HFZ43MS4CUVJZUVLTQDPH6VF24RFDOZDFCITEPHO3WVUHWJQ@2@tmp\withMavenfe8e1d7c" 


Stack Trace:
org.apache.maven.it.VerificationException: 
Exit code was non-zero: 1; command line and log = 
F:\jenkins\tools\maven\apache-maven-3.5.0\bin\mvn -e --batch-mode -Dhttps.protocols=TLSv1.2 -Dmaven.repo.local=f:\jenkins\jenkins-slave\workspace\rces-plugin_MRRESOURCES-103-OWZ3HFZ43MS4CUVJZUVLTQDPH6VF24RFDOZDFCITEPHO3WVUHWJQ@2\windows-jdk8-m3.5.x_build\target/it-repo org.apache.maven.plugins:maven-clean-plugin:clean generate-resources
[INFO] [jenkins-event-spy] Jenkins Maven Event Spy is disabled
[INFO] Error stacktraces are turned on.
[INFO] Scanning for projects...
[INFO] Downloading: http://repository.apache.org/snapshots/org/apache/maven/plugin/rresource/it/it-parent/1.6-SNAPSHOT/maven-metadata.xml
[INFO] Downloading: http://repository.apache.org/snapshots/org/apache/maven/plugin/rresource/it/it-parent/1.6-SNAPSHOT/it-parent-1.6-SNAPSHOT.pom
[ERROR] [ERROR] Some problems were encountered while processing the POMs:
[FATAL] Non-resolvable parent POM for org.apache.maven.plugin.rresource.it.mrr41:parent:[unknown-version]: Could not find artifact org.apache.maven.plugin.rresource.it:it-parent:pom:1.6-SNAPSHOT in apache-snapshots (http://repository.apache.org/snapshots/) and 'parent.relativePath' points at wrong local POM @ org.apache.maven.plugin.rresource.it.mrr41:parent:[unknown-version], F:\jenkins\jenkins-slave\workspace\rces-plugin_MRRESOURCES-103-OWZ3HFZ43MS4CUVJZUVLTQDPH6VF24RFDOZDFCITEPHO3WVUHWJQ@2\windows-jdk8-m3.5.x_build\target\test-classes\run-only-at-execution-root\pom.xml, line 24, column 11
[FATAL] Non-resolvable parent POM for org.apache.maven.plugin.rresource.it.mrr41:parent:[unknown-version]: Failure to find org.apache.maven.plugin.rresource.it:it-parent:pom:1.6-SNAPSHOT in http://repository.apache.org/snapshots/ was cached in the local repository, resolution will not be reattempted until the update interval of apache-snapshots has elapsed or updates are forced and 'parent.relativePath' points at wrong local POM @ org.apache.maven.plugin.rresource.it.mrr41:parent:[unknown-version], F:\jenkins\jenkins-slave\workspace\rces-plugin_MRRESOURCES-103-OWZ3HFZ43MS4CUVJZUVLTQDPH6VF24RFDOZDFCITEPHO3WVUHWJQ@2\windows-jdk8-m3.5.x_build\target\test-classes\run-only-at-execution-root\pom.xml, line 24, column 11
 @ 
[ERROR] The build could not read 2 projects -> [Help 1]
org.apache.maven.project.ProjectBuildingException: Some problems were encountered while processing the POMs:
[FATAL] Non-resolvable parent POM for org.apache.maven.plugin.rresource.it.mrr41:parent:[unknown-version]: Could not find artifact org.apache.maven.plugin.rresource.it:it-parent:pom:1.6-SNAPSHOT in apache-snapshots (http://repository.apache.org/snapshots/) and 'parent.relativePath' points at wrong local POM @ org.apache.maven.plugin.rresource.it.mrr41:parent:[unknown-version], F:\jenkins\jenkins-slave\workspace\rces-plugin_MRRESOURCES-103-OWZ3HFZ43MS4CUVJZUVLTQDPH6VF24RFDOZDFCITEPHO3WVUHWJQ@2\windows-jdk8-m3.5.x_build\target\test-classes\run-only-at-execution-root\pom.xml, line 24, column 11
[FATAL] Non-resolvable parent POM for org.apache.maven.plugin.rresource.it.mrr41:parent:[unknown-version]: Failure to find org.apache.maven.plugin.rresource.it:it-parent:pom:1.6-SNAPSHOT in http://repository.apache.org/snapshots/ was cached in the local repository, resolution will not be reattempted until the update interval of apache-snapshots has elapsed or updates are forced and 'parent.relativePath' points at wrong local POM @ org.apache.maven.plugin.rresource.it.mrr41:parent:[unknown-version], F:\jenkins\jenkins-slave\workspace\rces-plugin_MRRESOURCES-103-OWZ3HFZ43MS4CUVJZUVLTQDPH6VF24RFDOZDFCITEPHO3WVUHWJQ@2\windows-jdk8-m3.5.x_build\target\test-classes\run-only-at-execution-root\pom.xml, line 24, column 11

	at org.apache.maven.project.DefaultProjectBuilder.build(DefaultProjectBuilder.java:382)
	at org.apache.maven.graph.DefaultGraphBuilder.collectProjects(DefaultGraphBuilder.java:400)
	at org.apache.maven.graph.DefaultGraphBuilder.getProjectsForMavenReactor(DefaultGraphBuilder.java:391)
	at org.apache.maven.graph.DefaultGraphBuilder.build(DefaultGraphBuilder.java:78)
	at org.apache.maven.DefaultMaven.buildGraph(DefaultMaven.java:511)
	at org.apache.maven.DefaultMaven.doExecute(DefaultMaven.java:221)
	at org.apache.maven.DefaultMaven.doExecute(DefaultMaven.java:194)
	at org.apache.maven.DefaultMaven.execute(DefaultMaven.java:107)
	at org.apache.maven.cli.MavenCli.execute(MavenCli.java:993)
	at org.apache.maven.cli.MavenCli.doMain(MavenCli.java:345)
	at org.apache.maven.cli.MavenCli.main(MavenCli.java:191)
	at sun.reflect.NativeMethodAccessorImpl.invoke0(Native Method)
	at sun.reflect.NativeMethodAccessorImpl.invoke(NativeMethodAccessorImpl.java:62)
	at sun.reflect.DelegatingMethodAccessorImpl.invoke(DelegatingMethodAccessorImpl.java:43)
	at java.lang.reflect.Method.invoke(Method.java:498)
	at org.codehaus.plexus.classworlds.launcher.Launcher.launchEnhanced(Launcher.java:289)
	at org.codehaus.plexus.classworlds.launcher.Launcher.launch(Launcher.java:229)
	at org.codehaus.plexus.classworlds.launcher.Launcher.mainWithExitCode(Launcher.java:415)
	at org.codehaus.plexus.classworlds.launcher.Launcher.main(Launcher.java:356)
[ERROR]   
[ERROR]   The project org.apache.maven.plugin.rresource.it.mrr41:child-1:[unknown-version] (F:\jenkins\jenkins-slave\workspace\rces-plugin_MRRESOURCES-103-OWZ3HFZ43MS4CUVJZUVLTQDPH6VF24RFDOZDFCITEPHO3WVUHWJQ@2\windows-jdk8-m3.5.x_build\target\test-classes\run-only-at-execution-root\child1\pom.xml) has 1 error
[ERROR]     Non-resolvable parent POM for org.apache.maven.plugin.rresource.it.mrr41:parent:[unknown-version]: Could not find artifact org.apache.maven.plugin.rresource.it:it-parent:pom:1.6-SNAPSHOT in apache-snapshots (http://repository.apache.org/snapshots/) and 'parent.relativePath' points at wrong local POM @ org.apache.maven.plugin.rresource.it.mrr41:parent:[unknown-version], F:\jenkins\jenkins-slave\workspace\rces-plugin_MRRESOURCES-103-OWZ3HFZ43MS4CUVJZUVLTQDPH6VF24RFDOZDFCITEPHO3WVUHWJQ@2\windows-jdk8-m3.5.x_build\target\test-classes\run-only-at-execution-root\pom.xml, line 24, column 11 -> [Help 2]
org.apache.maven.model.resolution.UnresolvableModelException: Could not find artifact org.apache.maven.plugin.rresource.it:it-parent:pom:1.6-SNAPSHOT in apache-snapshots (http://repository.apache.org/snapshots/)
	at org.apache.maven.project.ProjectModelResolver.resolveModel(ProjectModelResolver.java:197)
	at org.apache.maven.project.ProjectModelResolver.resolveModel(ProjectModelResolver.java:243)
	at org.apache.maven.model.building.DefaultModelBuilder.readParentExternally(DefaultModelBuilder.java:1051)
	at org.apache.maven.model.building.DefaultModelBuilder.readParent(DefaultModelBuilder.java:851)
	at org.apache.maven.model.building.DefaultModelBuilder.build(DefaultModelBuilder.java:331)
	at org.apache.maven.project.DefaultProjectBuilder.build(DefaultProjectBuilder.java:429)
	at org.apache.maven.project.DefaultProjectBuilder.build(DefaultProjectBuilder.java:398)
	at org.apache.maven.project.DefaultProjectBuilder.build(DefaultProjectBuilder.java:515)
	at org.apache.maven.project.DefaultProjectBuilder.build(DefaultProjectBuilder.java:398)
	at org.apache.maven.project.DefaultProjectBuilder.build(DefaultProjectBuilder.java:361)
	at org.apache.maven.graph.DefaultGraphBuilder.collectProjects(DefaultGraphBuilder.java:400)
	at org.apache.maven.graph.DefaultGraphBuilder.getProjectsForMavenReactor(DefaultGraphBuilder.java:391)
	at org.apache.maven.graph.DefaultGraphBuilder.build(DefaultGraphBuilder.java:78)
	at org.apache.maven.DefaultMaven.buildGraph(DefaultMaven.java:511)
	at org.apache.maven.DefaultMaven.doExecute(DefaultMaven.java:221)
	at org.apache.maven.DefaultMaven.doExecute(DefaultMaven.java:194)
	at org.apache.maven.DefaultMaven.execute(DefaultMaven.java:107)
	at org.apache.maven.cli.MavenCli.execute(MavenCli.java:993)
	at org.apache.maven.cli.MavenCli.doMain(MavenCli.java:345)
	at org.apache.maven.cli.MavenCli.main(MavenCli.java:191)
	at sun.reflect.NativeMethodAccessorImpl.invoke0(Native Method)
	at sun.reflect.NativeMethodAccessorImpl.invoke(NativeMethodAccessorImpl.java:62)
	at sun.reflect.DelegatingMethodAccessorImpl.invoke(DelegatingMethodAccessorImpl.java:43)
	at java.lang.reflect.Method.invoke(Method.java:498)
	at org.codehaus.plexus.classworlds.launcher.Launcher.launchEnhanced(Launcher.java:289)
	at org.codehaus.plexus.classworlds.launcher.Launcher.launch(Launcher.java:229)
	at org.codehaus.plexus.classworlds.launcher.Launcher.mainWithExitCode(Launcher.java:415)
	at org.codehaus.plexus.classworlds.launcher.Launcher.main(Launcher.java:356)
Caused by: org.eclipse.aether.resolution.ArtifactResolutionException: Could not find artifact org.apache.maven.plugin.rresource.it:it-parent:pom:1.6-SNAPSHOT in apache-snapshots (http://repository.apache.org/snapshots/)
	at org.eclipse.aether.internal.impl.DefaultArtifactResolver.resolve(DefaultArtifactResolver.java:453)
	at org.eclipse.aether.internal.impl.DefaultArtifactResolver.resolveArtifacts(DefaultArtifactResolver.java:255)
	at org.eclipse.aether.internal.impl.DefaultArtifactResolver.resolveArtifact(DefaultArtifactResolver.java:232)
	at org.eclipse.aether.internal.impl.DefaultRepositorySystem.resolveArtifact(DefaultRepositorySystem.java:303)
	at org.apache.maven.project.ProjectModelResolver.resolveModel(ProjectModelResolver.java:193)
	... 27 more
Caused by: org.eclipse.aether.transfer.ArtifactNotFoundException: Could not find artifact org.apache.maven.plugin.rresource.it:it-parent:pom:1.6-SNAPSHOT in apache-snapshots (http://repository.apache.org/snapshots/)
	at org.eclipse.aether.connector.basic.ArtifactTransportListener.transferFailed(ArtifactTransportListener.java:48)
	at org.eclipse.aether.connector.basic.BasicRepositoryConnector$TaskRunner.run(BasicRepositoryConnector.java:364)
	at org.eclipse.aether.util.concurrency.RunnableErrorForwarder$1.run(RunnableErrorForwarder.java:76)
	at org.eclipse.aether.connector.basic.BasicRepositoryConnector$DirectExecutor.execute(BasicRepositoryConnector.java:590)
	at org.eclipse.aether.connector.basic.BasicRepositoryConnector.get(BasicRepositoryConnector.java:258)
	at org.eclipse.aether.internal.impl.DefaultArtifactResolver.performDownloads(DefaultArtifactResolver.java:529)
	at org.eclipse.aether.internal.impl.DefaultArtifactResolver.resolve(DefaultArtifactResolver.java:430)
	... 31 more
[ERROR]   
[ERROR]   The project org.apache.maven.plugin.rresource.it.mrr41:child-2:[unknown-version] (F:\jenkins\jenkins-slave\workspace\rces-plugin_MRRESOURCES-103-OWZ3HFZ43MS4CUVJZUVLTQDPH6VF24RFDOZDFCITEPHO3WVUHWJQ@2\windows-jdk8-m3.5.x_build\target\test-classes\run-only-at-execution-root\child2\pom.xml) has 1 error
[ERROR]     Non-resolvable parent POM for org.apache.maven.plugin.rresource.it.mrr41:parent:[unknown-version]: Failure to find org.apache.maven.plugin.rresource.it:it-parent:pom:1.6-SNAPSHOT in http://repository.apache.org/snapshots/ was cached in the local repository, resolution will not be reattempted until the update interval of apache-snapshots has elapsed or updates are forced and 'parent.relativePath' points at wrong local POM @ org.apache.maven.plugin.rresource.it.mrr41:parent:[unknown-version], F:\jenkins\jenkins-slave\workspace\rces-plugin_MRRESOURCES-103-OWZ3HFZ43MS4CUVJZUVLTQDPH6VF24RFDOZDFCITEPHO3WVUHWJQ@2\windows-jdk8-m3.5.x_build\target\test-classes\run-only-at-execution-root\pom.xml, line 24, column 11 -> [Help 2]
org.apache.maven.model.resolution.UnresolvableModelException: Failure to find org.apache.maven.plugin.rresource.it:it-parent:pom:1.6-SNAPSHOT in http://repository.apache.org/snapshots/ was cached in the local repository, resolution will not be reattempted until the update interval of apache-snapshots has elapsed or updates are forced
	at org.apache.maven.project.ProjectModelResolver.resolveModel(ProjectModelResolver.java:197)
	at org.apache.maven.project.ProjectModelResolver.resolveModel(ProjectModelResolver.java:243)
	at org.apache.maven.model.building.DefaultModelBuilder.readParentExternally(DefaultModelBuilder.java:1051)
	at org.apache.maven.model.building.DefaultModelBuilder.readParent(DefaultModelBuilder.java:851)
	at org.apache.maven.model.building.DefaultModelBuilder.build(DefaultModelBuilder.java:331)
	at org.apache.maven.project.DefaultProjectBuilder.build(DefaultProjectBuilder.java:429)
	at org.apache.maven.project.DefaultProjectBuilder.build(DefaultProjectBuilder.java:398)
	at org.apache.maven.project.DefaultProjectBuilder.build(DefaultProjectBuilder.java:515)
	at org.apache.maven.project.DefaultProjectBuilder.build(DefaultProjectBuilder.java:398)
	at org.apache.maven.project.DefaultProjectBuilder.build(DefaultProjectBuilder.java:361)
	at org.apache.maven.graph.DefaultGraphBuilder.collectProjects(DefaultGraphBuilder.java:400)
	at org.apache.maven.graph.DefaultGraphBuilder.getProjectsForMavenReactor(DefaultGraphBuilder.java:391)
	at org.apache.maven.graph.DefaultGraphBuilder.build(DefaultGraphBuilder.java:78)
	at org.apache.maven.DefaultMaven.buildGraph(DefaultMaven.java:511)
	at org.apache.maven.DefaultMaven.doExecute(DefaultMaven.java:221)
	at org.apache.maven.DefaultMaven.doExecute(DefaultMaven.java:194)
	at org.apache.maven.DefaultMaven.execute(DefaultMaven.java:107)
	at org.apache.maven.cli.MavenCli.execute(MavenCli.java:993)
	at org.apache.maven.cli.MavenCli.doMain(MavenCli.java:345)
	at org.apache.maven.cli.MavenCli.main(MavenCli.java:191)
	at sun.reflect.NativeMethodAccessorImpl.invoke0(Native Method)
	at sun.reflect.NativeMethodAccessorImpl.invoke(NativeMethodAccessorImpl.java:62)
	at sun.reflect.DelegatingMethodAccessorImpl.invoke(DelegatingMethodAccessorImpl.java:43)
	at java.lang.reflect.Method.invoke(Method.java:498)
	at org.codehaus.plexus.classworlds.launcher.Launcher.launchEnhanced(Launcher.java:289)
	at org.codehaus.plexus.classworlds.launcher.Launcher.launch(Launcher.java:229)
	at org.codehaus.plexus.classworlds.launcher.Launcher.mainWithExitCode(Launcher.java:415)
	at org.codehaus.plexus.classworlds.launcher.Launcher.main(Launcher.java:356)
Caused by: org.eclipse.aether.resolution.ArtifactResolutionException: Failure to find org.apache.maven.plugin.rresource.it:it-parent:pom:1.6-SNAPSHOT in http://repository.apache.org/snapshots/ was cached in the local repository, resolution will not be reattempted until the update interval of apache-snapshots has elapsed or updates are forced
	at org.eclipse.aether.internal.impl.DefaultArtifactResolver.resolve(DefaultArtifactResolver.java:453)
	at org.eclipse.aether.internal.impl.DefaultArtifactResolver.resolveArtifacts(DefaultArtifactResolver.java:255)
	at org.eclipse.aether.internal.impl.DefaultArtifactResolver.resolveArtifact(DefaultArtifactResolver.java:232)
	at org.eclipse.aether.internal.impl.DefaultRepositorySystem.resolveArtifact(DefaultRepositorySystem.java:303)
	at org.apache.maven.project.ProjectModelResolver.resolveModel(ProjectModelResolver.java:193)
	... 27 more
Caused by: org.eclipse.aether.transfer.ArtifactNotFoundException: Failure to find org.apache.maven.plugin.rresource.it:it-parent:pom:1.6-SNAPSHOT in http://repository.apache.org/snapshots/ was cached in the local repository, resolution will not be reattempted until the update interval of apache-snapshots has elapsed or updates are forced
	at org.eclipse.aether.internal.impl.DefaultUpdateCheckManager.newException(DefaultUpdateCheckManager.java:240)
	at org.eclipse.aether.internal.impl.DefaultUpdateCheckManager.checkArtifact(DefaultUpdateCheckManager.java:192)
	at org.eclipse.aether.internal.impl.DefaultArtifactResolver.gatherDownloads(DefaultArtifactResolver.java:594)
	at org.eclipse.aether.internal.impl.DefaultArtifactResolver.performDownloads(DefaultArtifactResolver.java:512)
	at org.eclipse.aether.internal.impl.DefaultArtifactResolver.resolve(DefaultArtifactResolver.java:430)
	... 31 more
[ERROR] 
[ERROR] Re-run Maven using the -X switch to enable full debug logging.
[ERROR] 
[ERROR] For more information about the errors and possible solutions, please read the following articles:
[ERROR] [Help 1] http://cwiki.apache.org/confluence/display/MAVEN/ProjectBuildingException
[ERROR] [Help 2] http://cwiki.apache.org/confluence/display/MAVEN/UnresolvableModelException
Picked up JAVA_TOOL_OPTIONS: -Dmaven.ext.class.path="f:\jenkins\jenkins-slave\workspace\rces-plugin_MRRESOURCES-103-OWZ3HFZ43MS4CUVJZUVLTQDPH6VF24RFDOZDFCITEPHO3WVUHWJQ@2@tmp\withMavenfe8e1d7c\pipeline-maven-spy.jar" -Dorg.jenkinsci.plugins.pipeline.maven.reportsFolder="f:\jenkins\jenkins-slave\workspace\rces-plugin_MRRESOURCES-103-OWZ3HFZ43MS4CUVJZUVLTQDPH6VF24RFDOZDFCITEPHO3WVUHWJQ@2@tmp\withMavenfe8e1d7c" 

	at org.apache.maven.plugin.resources.remote.it.IT_RunOnlyAtExecutionRoot.test(IT_RunOnlyAtExecutionRoot.java:62)


FAILED:  org.apache.maven.plugin.resources.remote.it.IT_RunOnlyAtExecutionRoot.test

Error Message:
Exit code was non-zero: 1; command line and log = 
F:\jenkins\tools\maven\apache-maven-3.5.0\bin\mvn -e --batch-mode -Dhttps.protocols=TLSv1.2 -Dmaven.repo.local=f:\jenkins\jenkins-slave\workspace\rces-plugin_MRRESOURCES-103-OWZ3HFZ43MS4CUVJZUVLTQDPH6VF24RFDOZDFCITEPHO3WVUHWJQ\windows-jdk9-m3.5.x_build\target/it-repo org.apache.maven.plugins:maven-clean-plugin:clean generate-resources
Picked up JAVA_TOOL_OPTIONS: -Dmaven.ext.class.path="f:\jenkins\jenkins-slave\workspace\rces-plugin_MRRESOURCES-103-OWZ3HFZ43MS4CUVJZUVLTQDPH6VF24RFDOZDFCITEPHO3WVUHWJQ@tmp\withMaven6bfd82ea\pipeline-maven-spy.jar" -Dorg.jenkinsci.plugins.pipeline.maven.reportsFolder="f:\jenkins\jenkins-slave\workspace\rces-plugin_MRRESOURCES-103-OWZ3HFZ43MS4CUVJZUVLTQDPH6VF24RFDOZDFCITEPHO3WVUHWJQ@tmp\withMaven6bfd82ea" 
[INFO] [jenkins-event-spy] Jenkins Maven Event Spy is disabled
[INFO] Error stacktraces are turned on.
[INFO] Scanning for projects...
[INFO] Downloading: http://repository.apache.org/snapshots/org/apache/maven/plugin/rresource/it/it-parent/1.6-SNAPSHOT/maven-metadata.xml
[INFO] Downloading: http://repository.apache.org/snapshots/org/apache/maven/plugin/rresource/it/it-parent/1.6-SNAPSHOT/it-parent-1.6-SNAPSHOT.pom
[ERROR] [ERROR] Some problems were encountered while processing the POMs:
[FATAL] Non-resolvable parent POM for org.apache.maven.plugin.rresource.it.mrr41:parent:[unknown-version]: Could not find artifact org.apache.maven.plugin.rresource.it:it-parent:pom:1.6-SNAPSHOT in apache-snapshots (http://repository.apache.org/snapshots/) and 'parent.relativePath' points at wrong local POM @ org.apache.maven.plugin.rresource.it.mrr41:parent:[unknown-version], F:\jenkins\jenkins-slave\workspace\rces-plugin_MRRESOURCES-103-OWZ3HFZ43MS4CUVJZUVLTQDPH6VF24RFDOZDFCITEPHO3WVUHWJQ\windows-jdk9-m3.5.x_build\target\test-classes\run-only-at-execution-root\pom.xml, line 24, column 11
[FATAL] Non-resolvable parent POM for org.apache.maven.plugin.rresource.it.mrr41:parent:[unknown-version]: Failure to find org.apache.maven.plugin.rresource.it:it-parent:pom:1.6-SNAPSHOT in http://repository.apache.org/snapshots/ was cached in the local repository, resolution will not be reattempted until the update interval of apache-snapshots has elapsed or updates are forced and 'parent.relativePath' points at wrong local POM @ org.apache.maven.plugin.rresource.it.mrr41:parent:[unknown-version], F:\jenkins\jenkins-slave\workspace\rces-plugin_MRRESOURCES-103-OWZ3HFZ43MS4CUVJZUVLTQDPH6VF24RFDOZDFCITEPHO3WVUHWJQ\windows-jdk9-m3.5.x_build\target\test-classes\run-only-at-execution-root\pom.xml, line 24, column 11
 @ 
[ERROR] The build could not read 2 projects -> [Help 1]
org.apache.maven.project.ProjectBuildingException: Some problems were encountered while processing the POMs:
[FATAL] Non-resolvable parent POM for org.apache.maven.plugin.rresource.it.mrr41:parent:[unknown-version]: Could not find artifact org.apache.maven.plugin.rresource.it:it-parent:pom:1.6-SNAPSHOT in apache-snapshots (http://repository.apache.org/snapshots/) and 'parent.relativePath' points at wrong local POM @ org.apache.maven.plugin.rresource.it.mrr41:parent:[unknown-version], F:\jenkins\jenkins-slave\workspace\rces-plugin_MRRESOURCES-103-OWZ3HFZ43MS4CUVJZUVLTQDPH6VF24RFDOZDFCITEPHO3WVUHWJQ\windows-jdk9-m3.5.x_build\target\test-classes\run-only-at-execution-root\pom.xml, line 24, column 11
[FATAL] Non-resolvable parent POM for org.apache.maven.plugin.rresource.it.mrr41:parent:[unknown-version]: Failure to find org.apache.maven.plugin.rresource.it:it-parent:pom:1.6-SNAPSHOT in http://repository.apache.org/snapshots/ was cached in the local repository, resolution will not be reattempted until the update interval of apache-snapshots has elapsed or updates are forced and 'parent.relativePath' points at wrong local POM @ org.apache.maven.plugin.rresource.it.mrr41:parent:[unknown-version], F:\jenkins\jenkins-slave\workspace\rces-plugin_MRRESOURCES-103-OWZ3HFZ43MS4CUVJZUVLTQDPH6VF24RFDOZDFCITEPHO3WVUHWJQ\windows-jdk9-m3.5.x_build\target\test-classes\run-only-at-execution-root\pom.xml, line 24, column 11

 at org.apache.maven.project.DefaultProjectBuilder.build(DefaultProjectBuilder.java:382)
 at org.apache.maven.graph.DefaultGraphBuilder.collectProjects(DefaultGraphBuilder.java:400)
 at org.apache.maven.graph.DefaultGraphBuilder.getProjectsForMavenReactor(DefaultGraphBuilder.java:391)
 at org.apache.maven.graph.DefaultGraphBuilder.build(DefaultGraphBuilder.java:78)
 at org.apache.maven.DefaultMaven.buildGraph(DefaultMaven.java:511)
 at org.apache.maven.DefaultMaven.doExecute(DefaultMaven.java:221)
 at org.apache.maven.DefaultMaven.doExecute(DefaultMaven.java:194)
 at org.apache.maven.DefaultMaven.execute(DefaultMaven.java:107)
 at org.apache.maven.cli.MavenCli.execute(MavenCli.java:993)
 at org.apache.maven.cli.MavenCli.doMain(MavenCli.java:345)
 at org.apache.maven.cli.MavenCli.main(MavenCli.java:191)
 at java.base/jdk.internal.reflect.NativeMethodAccessorImpl.invoke0(Native Method)
 at java.base/jdk.internal.reflect.NativeMethodAccessorImpl.invoke(NativeMethodAccessorImpl.java:62)
 at java.base/jdk.internal.reflect.DelegatingMethodAccessorImpl.invoke(DelegatingMethodAccessorImpl.java:43)
 at java.base/java.lang.reflect.Method.invoke(Method.java:564)
 at org.codehaus.plexus.classworlds.launcher.Launcher.launchEnhanced(Launcher.java:289)
 at org.codehaus.plexus.classworlds.launcher.Launcher.launch(Launcher.java:229)
 at org.codehaus.plexus.classworlds.launcher.Launcher.mainWithExitCode(Launcher.java:415)
 at org.codehaus.plexus.classworlds.launcher.Launcher.main(Launcher.java:356)
[ERROR]   
[ERROR]   The project org.apache.maven.plugin.rresource.it.mrr41:child-1:[unknown-version] (F:\jenkins\jenkins-slave\workspace\rces-plugin_MRRESOURCES-103-OWZ3HFZ43MS4CUVJZUVLTQDPH6VF24RFDOZDFCITEPHO3WVUHWJQ\windows-jdk9-m3.5.x_build\target\test-classes\run-only-at-execution-root\child1\pom.xml) has 1 error
[ERROR]     Non-resolvable parent POM for org.apache.maven.plugin.rresource.it.mrr41:parent:[unknown-version]: Could not find artifact org.apache.maven.plugin.rresource.it:it-parent:pom:1.6-SNAPSHOT in apache-snapshots (http://repository.apache.org/snapshots/) and 'parent.relativePath' points at wrong local POM @ org.apache.maven.plugin.rresource.it.mrr41:parent:[unknown-version], F:\jenkins\jenkins-slave\workspace\rces-plugin_MRRESOURCES-103-OWZ3HFZ43MS4CUVJZUVLTQDPH6VF24RFDOZDFCITEPHO3WVUHWJQ\windows-jdk9-m3.5.x_build\target\test-classes\run-only-at-execution-root\pom.xml, line 24, column 11 -> [Help 2]
org.apache.maven.model.resolution.UnresolvableModelException: Could not find artifact org.apache.maven.plugin.rresource.it:it-parent:pom:1.6-SNAPSHOT in apache-snapshots (http://repository.apache.org/snapshots/)
 at org.apache.maven.project.ProjectModelResolver.resolveModel(ProjectModelResolver.java:197)
 at org.apache.maven.project.ProjectModelResolver.resolveModel(ProjectModelResolver.java:243)
 at org.apache.maven.model.building.DefaultModelBuilder.readParentExternally(DefaultModelBuilder.java:1051)
 at org.apache.maven.model.building.DefaultModelBuilder.readParent(DefaultModelBuilder.java:851)
 at org.apache.maven.model.building.DefaultModelBuilder.build(DefaultModelBuilder.java:331)
 at org.apache.maven.project.DefaultProjectBuilder.build(DefaultProjectBuilder.java:429)
 at org.apache.maven.project.DefaultProjectBuilder.build(DefaultProjectBuilder.java:398)
 at org.apache.maven.project.DefaultProjectBuilder.build(DefaultProjectBuilder.java:515)
 at org.apache.maven.project.DefaultProjectBuilder.build(DefaultProjectBuilder.java:398)
 at org.apache.maven.project.DefaultProjectBuilder.build(DefaultProjectBuilder.java:361)
 at org.apache.maven.graph.DefaultGraphBuilder.collectProjects(DefaultGraphBuilder.java:400)
 at org.apache.maven.graph.DefaultGraphBuilder.getProjectsForMavenReactor(DefaultGraphBuilder.java:391)
 at org.apache.maven.graph.DefaultGraphBuilder.build(DefaultGraphBuilder.java:78)
 at org.apache.maven.DefaultMaven.buildGraph(DefaultMaven.java:511)
 at org.apache.maven.DefaultMaven.doExecute(DefaultMaven.java:221)
 at org.apache.maven.DefaultMaven.doExecute(DefaultMaven.java:194)
 at org.apache.maven.DefaultMaven.execute(DefaultMaven.java:107)
 at org.apache.maven.cli.MavenCli.execute(MavenCli.java:993)
 at org.apache.maven.cli.MavenCli.doMain(MavenCli.java:345)
 at org.apache.maven.cli.MavenCli.main(MavenCli.java:191)
 at java.base/jdk.internal.reflect.NativeMethodAccessorImpl.invoke0(Native Method)
 at java.base/jdk.internal.reflect.NativeMethodAccessorImpl.invoke(NativeMethodAccessorImpl.java:62)
 at java.base/jdk.internal.reflect.DelegatingMethodAccessorImpl.invoke(DelegatingMethodAccessorImpl.java:43)
 at java.base/java.lang.reflect.Method.invoke(Method.java:564)
 at org.codehaus.plexus.classworlds.launcher.Launcher.launchEnhanced(Launcher.java:289)
 at org.codehaus.plexus.classworlds.launcher.Launcher.launch(Launcher.java:229)
 at org.codehaus.plexus.classworlds.launcher.Launcher.mainWithExitCode(Launcher.java:415)
 at org.codehaus.plexus.classworlds.launcher.Launcher.main(Launcher.java:356)
Caused by: org.eclipse.aether.resolution.ArtifactResolutionException: Could not find artifact org.apache.maven.plugin.rresource.it:it-parent:pom:1.6-SNAPSHOT in apache-snapshots (http://repository.apache.org/snapshots/)
 at org.eclipse.aether.internal.impl.DefaultArtifactResolver.resolve(DefaultArtifactResolver.java:453)
 at org.eclipse.aether.internal.impl.DefaultArtifactResolver.resolveArtifacts(DefaultArtifactResolver.java:255)
 at org.eclipse.aether.internal.impl.DefaultArtifactResolver.resolveArtifact(DefaultArtifactResolver.java:232)
 at org.eclipse.aether.internal.impl.DefaultRepositorySystem.resolveArtifact(DefaultRepositorySystem.java:303)
 at org.apache.maven.project.ProjectModelResolver.resolveModel(ProjectModelResolver.java:193)
 ... 27 more
Caused by: org.eclipse.aether.transfer.ArtifactNotFoundException: Could not find artifact org.apache.maven.plugin.rresource.it:it-parent:pom:1.6-SNAPSHOT in apache-snapshots (http://repository.apache.org/snapshots/)
 at org.eclipse.aether.connector.basic.ArtifactTransportListener.transferFailed(ArtifactTransportListener.java:48)
 at org.eclipse.aether.connector.basic.BasicRepositoryConnector$TaskRunner.run(BasicRepositoryConnector.java:364)
 at org.eclipse.aether.util.concurrency.RunnableErrorForwarder$1.run(RunnableErrorForwarder.java:76)
 at org.eclipse.aether.connector.basic.BasicRepositoryConnector$DirectExecutor.execute(BasicRepositoryConnector.java:590)
 at org.eclipse.aether.connector.basic.BasicRepositoryConnector.get(BasicRepositoryConnector.java:258)
 at org.eclipse.aether.internal.impl.DefaultArtifactResolver.performDownloads(DefaultArtifactResolver.java:529)
 at org.eclipse.aether.internal.impl.DefaultArtifactResolver.resolve(DefaultArtifactResolver.java:430)
 ... 31 more
[ERROR]   
[ERROR]   The project org.apache.maven.plugin.rresource.it.mrr41:child-2:[unknown-version] (F:\jenkins\jenkins-slave\workspace\rces-plugin_MRRESOURCES-103-OWZ3HFZ43MS4CUVJZUVLTQDPH6VF24RFDOZDFCITEPHO3WVUHWJQ\windows-jdk9-m3.5.x_build\target\test-classes\run-only-at-execution-root\child2\pom.xml) has 1 error
[ERROR]     Non-resolvable parent POM for org.apache.maven.plugin.rresource.it.mrr41:parent:[unknown-version]: Failure to find org.apache.maven.plugin.rresource.it:it-parent:pom:1.6-SNAPSHOT in http://repository.apache.org/snapshots/ was cached in the local repository, resolution will not be reattempted until the update interval of apache-snapshots has elapsed or updates are forced and 'parent.relativePath' points at wrong local POM @ org.apache.maven.plugin.rresource.it.mrr41:parent:[unknown-version], F:\jenkins\jenkins-slave\workspace\rces-plugin_MRRESOURCES-103-OWZ3HFZ43MS4CUVJZUVLTQDPH6VF24RFDOZDFCITEPHO3WVUHWJQ\windows-jdk9-m3.5.x_build\target\test-classes\run-only-at-execution-root\pom.xml, line 24, column 11 -> [Help 2]
org.apache.maven.model.resolution.UnresolvableModelException: Failure to find org.apache.maven.plugin.rresource.it:it-parent:pom:1.6-SNAPSHOT in http://repository.apache.org/snapshots/ was cached in the local repository, resolution will not be reattempted until the update interval of apache-snapshots has elapsed or updates are forced
 at org.apache.maven.project.ProjectModelResolver.resolveModel(ProjectModelResolver.java:197)
 at org.apache.maven.project.ProjectModelResolver.resolveModel(ProjectModelResolver.java:243)
 at org.apache.maven.model.building.DefaultModelBuilder.readParentExternally(DefaultModelBuilder.java:1051)
 at org.apache.maven.model.building.DefaultModelBuilder.readParent(DefaultModelBuilder.java:851)
 at org.apache.maven.model.building.DefaultModelBuilder.build(DefaultModelBuilder.java:331)
 at org.apache.maven.project.DefaultProjectBuilder.build(DefaultProjectBuilder.java:429)
 at org.apache.maven.project.DefaultProjectBuilder.build(DefaultProjectBuilder.java:398)
 at org.apache.maven.project.DefaultProjectBuilder.build(DefaultProjectBuilder.java:515)
 at org.apache.maven.project.DefaultProjectBuilder.build(DefaultProjectBuilder.java:398)
 at org.apache.maven.project.DefaultProjectBuilder.build(DefaultProjectBuilder.java:361)
 at org.apache.maven.graph.DefaultGraphBuilder.collectProjects(DefaultGraphBuilder.java:400)
 at org.apache.maven.graph.DefaultGraphBuilder.getProjectsForMavenReactor(DefaultGraphBuilder.java:391)
 at org.apache.maven.graph.DefaultGraphBuilder.build(DefaultGraphBuilder.java:78)
 at org.apache.maven.DefaultMaven.buildGraph(DefaultMaven.java:511)
 at org.apache.maven.DefaultMaven.doExecute(DefaultMaven.java:221)
 at org.apache.maven.DefaultMaven.doExecute(DefaultMaven.java:194)
 at org.apache.maven.DefaultMaven.execute(DefaultMaven.java:107)
 at org.apache.maven.cli.MavenCli.execute(MavenCli.java:993)
 at org.apache.maven.cli.MavenCli.doMain(MavenCli.java:345)
 at org.apache.maven.cli.MavenCli.main(MavenCli.java:191)
 at java.base/jdk.internal.reflect.NativeMethodAccessorImpl.invoke0(Native Method)
 at java.base/jdk.internal.reflect.NativeMethodAccessorImpl.invoke(NativeMethodAccessorImpl.java:62)
 at java.base/jdk.internal.reflect.DelegatingMethodAccessorImpl.invoke(DelegatingMethodAccessorImpl.java:43)
 at java.base/java.lang.reflect.Method.invoke(Method.java:564)
 at org.codehaus.plexus.classworlds.launcher.Launcher.launchEnhanced(Launcher.java:289)
 at org.codehaus.plexus.classworlds.launcher.Launcher.launch(Launcher.java:229)
 at org.codehaus.plexus.classworlds.launcher.Launcher.mainWithExitCode(Launcher.java:415)
 at org.codehaus.plexus.classworlds.launcher.Launcher.main(Launcher.java:356)
Caused by: org.eclipse.aether.resolution.ArtifactResolutionException: Failure to find org.apache.maven.plugin.rresource.it:it-parent:pom:1.6-SNAPSHOT in http://repository.apache.org/snapshots/ was cached in the local repository, resolution will not be reattempted until the update interval of apache-snapshots has elapsed or updates are forced
 at org.eclipse.aether.internal.impl.DefaultArtifactResolver.resolve(DefaultArtifactResolver.java:453)
 at org.eclipse.aether.internal.impl.DefaultArtifactResolver.resolveArtifacts(DefaultArtifactResolver.java:255)
 at org.eclipse.aether.internal.impl.DefaultArtifactResolver.resolveArtifact(DefaultArtifactResolver.java:232)
 at org.eclipse.aether.internal.impl.DefaultRepositorySystem.resolveArtifact(DefaultRepositorySystem.java:303)
 at org.apache.maven.project.ProjectModelResolver.resolveModel(ProjectModelResolver.java:193)
 ... 27 more
Caused by: org.eclipse.aether.transfer.ArtifactNotFoundException: Failure to find org.apache.maven.plugin.rresource.it:it-parent:pom:1.6-SNAPSHOT in http://repository.apache.org/snapshots/ was cached in the local repository, resolution will not be reattempted until the update interval of apache-snapshots has elapsed or updates are forced
 at org.eclipse.aether.internal.impl.DefaultUpdateCheckManager.newException(DefaultUpdateCheckManager.java:240)
 at org.eclipse.aether.internal.impl.DefaultUpdateCheckManager.checkArtifact(DefaultUpdateCheckManager.java:192)
 at org.eclipse.aether.internal.impl.DefaultArtifactResolver.gatherDownloads(DefaultArtifactResolver.java:594)
 at org.eclipse.aether.internal.impl.DefaultArtifactResolver.performDownloads(DefaultArtifactResolver.java:512)
 at org.eclipse.aether.internal.impl.DefaultArtifactResolver.resolve(DefaultArtifactResolver.java:430)
 ... 31 more
[ERROR] 
[ERROR] Re-run Maven using the -X switch to enable full debug logging.
[ERROR] 
[ERROR] For more information about the errors and possible solutions, please read the following articles:
[ERROR] [Help 1] http://cwiki.apache.org/confluence/display/MAVEN/ProjectBuildingException
[ERROR] [Help 2] http://cwiki.apache.org/confluence/display/MAVEN/UnresolvableModelException


Stack Trace:
org.apache.maven.it.VerificationException: 
Exit code was non-zero: 1; command line and log = 
F:\jenkins\tools\maven\apache-maven-3.5.0\bin\mvn -e --batch-mode -Dhttps.protocols=TLSv1.2 -Dmaven.repo.local=f:\jenkins\jenkins-slave\workspace\rces-plugin_MRRESOURCES-103-OWZ3HFZ43MS4CUVJZUVLTQDPH6VF24RFDOZDFCITEPHO3WVUHWJQ\windows-jdk9-m3.5.x_build\target/it-repo org.apache.maven.plugins:maven-clean-plugin:clean generate-resources
Picked up JAVA_TOOL_OPTIONS: -Dmaven.ext.class.path="f:\jenkins\jenkins-slave\workspace\rces-plugin_MRRESOURCES-103-OWZ3HFZ43MS4CUVJZUVLTQDPH6VF24RFDOZDFCITEPHO3WVUHWJQ@tmp\withMaven6bfd82ea\pipeline-maven-spy.jar" -Dorg.jenkinsci.plugins.pipeline.maven.reportsFolder="f:\jenkins\jenkins-slave\workspace\rces-plugin_MRRESOURCES-103-OWZ3HFZ43MS4CUVJZUVLTQDPH6VF24RFDOZDFCITEPHO3WVUHWJQ@tmp\withMaven6bfd82ea" 
[INFO] [jenkins-event-spy] Jenkins Maven Event Spy is disabled
[INFO] Error stacktraces are turned on.
[INFO] Scanning for projects...
[INFO] Downloading: http://repository.apache.org/snapshots/org/apache/maven/plugin/rresource/it/it-parent/1.6-SNAPSHOT/maven-metadata.xml
[INFO] Downloading: http://repository.apache.org/snapshots/org/apache/maven/plugin/rresource/it/it-parent/1.6-SNAPSHOT/it-parent-1.6-SNAPSHOT.pom
[ERROR] [ERROR] Some problems were encountered while processing the POMs:
[FATAL] Non-resolvable parent POM for org.apache.maven.plugin.rresource.it.mrr41:parent:[unknown-version]: Could not find artifact org.apache.maven.plugin.rresource.it:it-parent:pom:1.6-SNAPSHOT in apache-snapshots (http://repository.apache.org/snapshots/) and 'parent.relativePath' points at wrong local POM @ org.apache.maven.plugin.rresource.it.mrr41:parent:[unknown-version], F:\jenkins\jenkins-slave\workspace\rces-plugin_MRRESOURCES-103-OWZ3HFZ43MS4CUVJZUVLTQDPH6VF24RFDOZDFCITEPHO3WVUHWJQ\windows-jdk9-m3.5.x_build\target\test-classes\run-only-at-execution-root\pom.xml, line 24, column 11
[FATAL] Non-resolvable parent POM for org.apache.maven.plugin.rresource.it.mrr41:parent:[unknown-version]: Failure to find org.apache.maven.plugin.rresource.it:it-parent:pom:1.6-SNAPSHOT in http://repository.apache.org/snapshots/ was cached in the local repository, resolution will not be reattempted until the update interval of apache-snapshots has elapsed or updates are forced and 'parent.relativePath' points at wrong local POM @ org.apache.maven.plugin.rresource.it.mrr41:parent:[unknown-version], F:\jenkins\jenkins-slave\workspace\rces-plugin_MRRESOURCES-103-OWZ3HFZ43MS4CUVJZUVLTQDPH6VF24RFDOZDFCITEPHO3WVUHWJQ\windows-jdk9-m3.5.x_build\target\test-classes\run-only-at-execution-root\pom.xml, line 24, column 11
 @ 
[ERROR] The build could not read 2 projects -> [Help 1]
org.apache.maven.project.ProjectBuildingException: Some problems were encountered while processing the POMs:
[FATAL] Non-resolvable parent POM for org.apache.maven.plugin.rresource.it.mrr41:parent:[unknown-version]: Could not find artifact org.apache.maven.plugin.rresource.it:it-parent:pom:1.6-SNAPSHOT in apache-snapshots (http://repository.apache.org/snapshots/) and 'parent.relativePath' points at wrong local POM @ org.apache.maven.plugin.rresource.it.mrr41:parent:[unknown-version], F:\jenkins\jenkins-slave\workspace\rces-plugin_MRRESOURCES-103-OWZ3HFZ43MS4CUVJZUVLTQDPH6VF24RFDOZDFCITEPHO3WVUHWJQ\windows-jdk9-m3.5.x_build\target\test-classes\run-only-at-execution-root\pom.xml, line 24, column 11
[FATAL] Non-resolvable parent POM for org.apache.maven.plugin.rresource.it.mrr41:parent:[unknown-version]: Failure to find org.apache.maven.plugin.rresource.it:it-parent:pom:1.6-SNAPSHOT in http://repository.apache.org/snapshots/ was cached in the local repository, resolution will not be reattempted until the update interval of apache-snapshots has elapsed or updates are forced and 'parent.relativePath' points at wrong local POM @ org.apache.maven.plugin.rresource.it.mrr41:parent:[unknown-version], F:\jenkins\jenkins-slave\workspace\rces-plugin_MRRESOURCES-103-OWZ3HFZ43MS4CUVJZUVLTQDPH6VF24RFDOZDFCITEPHO3WVUHWJQ\windows-jdk9-m3.5.x_build\target\test-classes\run-only-at-execution-root\pom.xml, line 24, column 11

	at org.apache.maven.project.DefaultProjectBuilder.build(DefaultProjectBuilder.java:382)
	at org.apache.maven.graph.DefaultGraphBuilder.collectProjects(DefaultGraphBuilder.java:400)
	at org.apache.maven.graph.DefaultGraphBuilder.getProjectsForMavenReactor(DefaultGraphBuilder.java:391)
	at org.apache.maven.graph.DefaultGraphBuilder.build(DefaultGraphBuilder.java:78)
	at org.apache.maven.DefaultMaven.buildGraph(DefaultMaven.java:511)
	at org.apache.maven.DefaultMaven.doExecute(DefaultMaven.java:221)
	at org.apache.maven.DefaultMaven.doExecute(DefaultMaven.java:194)
	at org.apache.maven.DefaultMaven.execute(DefaultMaven.java:107)
	at org.apache.maven.cli.MavenCli.execute(MavenCli.java:993)
	at org.apache.maven.cli.MavenCli.doMain(MavenCli.java:345)
	at org.apache.maven.cli.MavenCli.main(MavenCli.java:191)
	at java.base/jdk.internal.reflect.NativeMethodAccessorImpl.invoke0(Native Method)
	at java.base/jdk.internal.reflect.NativeMethodAccessorImpl.invoke(NativeMethodAccessorImpl.java:62)
	at java.base/jdk.internal.reflect.DelegatingMethodAccessorImpl.invoke(DelegatingMethodAccessorImpl.java:43)
	at java.base/java.lang.reflect.Method.invoke(Method.java:564)
	at org.codehaus.plexus.classworlds.launcher.Launcher.launchEnhanced(Launcher.java:289)
	at org.codehaus.plexus.classworlds.launcher.Launcher.launch(Launcher.java:229)
	at org.codehaus.plexus.classworlds.launcher.Launcher.mainWithExitCode(Launcher.java:415)
	at org.codehaus.plexus.classworlds.launcher.Launcher.main(Launcher.java:356)
[ERROR]   
[ERROR]   The project org.apache.maven.plugin.rresource.it.mrr41:child-1:[unknown-version] (F:\jenkins\jenkins-slave\workspace\rces-plugin_MRRESOURCES-103-OWZ3HFZ43MS4CUVJZUVLTQDPH6VF24RFDOZDFCITEPHO3WVUHWJQ\windows-jdk9-m3.5.x_build\target\test-classes\run-only-at-execution-root\child1\pom.xml) has 1 error
[ERROR]     Non-resolvable parent POM for org.apache.maven.plugin.rresource.it.mrr41:parent:[unknown-version]: Could not find artifact org.apache.maven.plugin.rresource.it:it-parent:pom:1.6-SNAPSHOT in apache-snapshots (http://repository.apache.org/snapshots/) and 'parent.relativePath' points at wrong local POM @ org.apache.maven.plugin.rresource.it.mrr41:parent:[unknown-version], F:\jenkins\jenkins-slave\workspace\rces-plugin_MRRESOURCES-103-OWZ3HFZ43MS4CUVJZUVLTQDPH6VF24RFDOZDFCITEPHO3WVUHWJQ\windows-jdk9-m3.5.x_build\target\test-classes\run-only-at-execution-root\pom.xml, line 24, column 11 -> [Help 2]
org.apache.maven.model.resolution.UnresolvableModelException: Could not find artifact org.apache.maven.plugin.rresource.it:it-parent:pom:1.6-SNAPSHOT in apache-snapshots (http://repository.apache.org/snapshots/)
	at org.apache.maven.project.ProjectModelResolver.resolveModel(ProjectModelResolver.java:197)
	at org.apache.maven.project.ProjectModelResolver.resolveModel(ProjectModelResolver.java:243)
	at org.apache.maven.model.building.DefaultModelBuilder.readParentExternally(DefaultModelBuilder.java:1051)
	at org.apache.maven.model.building.DefaultModelBuilder.readParent(DefaultModelBuilder.java:851)
	at org.apache.maven.model.building.DefaultModelBuilder.build(DefaultModelBuilder.java:331)
	at org.apache.maven.project.DefaultProjectBuilder.build(DefaultProjectBuilder.java:429)
	at org.apache.maven.project.DefaultProjectBuilder.build(DefaultProjectBuilder.java:398)
	at org.apache.maven.project.DefaultProjectBuilder.build(DefaultProjectBuilder.java:515)
	at org.apache.maven.project.DefaultProjectBuilder.build(DefaultProjectBuilder.java:398)
	at org.apache.maven.project.DefaultProjectBuilder.build(DefaultProjectBuilder.java:361)
	at org.apache.maven.graph.DefaultGraphBuilder.collectProjects(DefaultGraphBuilder.java:400)
	at org.apache.maven.graph.DefaultGraphBuilder.getProjectsForMavenReactor(DefaultGraphBuilder.java:391)
	at org.apache.maven.graph.DefaultGraphBuilder.build(DefaultGraphBuilder.java:78)
	at org.apache.maven.DefaultMaven.buildGraph(DefaultMaven.java:511)
	at org.apache.maven.DefaultMaven.doExecute(DefaultMaven.java:221)
	at org.apache.maven.DefaultMaven.doExecute(DefaultMaven.java:194)
	at org.apache.maven.DefaultMaven.execute(DefaultMaven.java:107)
	at org.apache.maven.cli.MavenCli.execute(MavenCli.java:993)
	at org.apache.maven.cli.MavenCli.doMain(MavenCli.java:345)
	at org.apache.maven.cli.MavenCli.main(MavenCli.java:191)
	at java.base/jdk.internal.reflect.NativeMethodAccessorImpl.invoke0(Native Method)
	at java.base/jdk.internal.reflect.NativeMethodAccessorImpl.invoke(NativeMethodAccessorImpl.java:62)
	at java.base/jdk.internal.reflect.DelegatingMethodAccessorImpl.invoke(DelegatingMethodAccessorImpl.java:43)
	at java.base/java.lang.reflect.Method.invoke(Method.java:564)
	at org.codehaus.plexus.classworlds.launcher.Launcher.launchEnhanced(Launcher.java:289)
	at org.codehaus.plexus.classworlds.launcher.Launcher.launch(Launcher.java:229)
	at org.codehaus.plexus.classworlds.launcher.Launcher.mainWithExitCode(Launcher.java:415)
	at org.codehaus.plexus.classworlds.launcher.Launcher.main(Launcher.java:356)
Caused by: org.eclipse.aether.resolution.ArtifactResolutionException: Could not find artifact org.apache.maven.plugin.rresource.it:it-parent:pom:1.6-SNAPSHOT in apache-snapshots (http://repository.apache.org/snapshots/)
	at org.eclipse.aether.internal.impl.DefaultArtifactResolver.resolve(DefaultArtifactResolver.java:453)
	at org.eclipse.aether.internal.impl.DefaultArtifactResolver.resolveArtifacts(DefaultArtifactResolver.java:255)
	at org.eclipse.aether.internal.impl.DefaultArtifactResolver.resolveArtifact(DefaultArtifactResolver.java:232)
	at org.eclipse.aether.internal.impl.DefaultRepositorySystem.resolveArtifact(DefaultRepositorySystem.java:303)
	at org.apache.maven.project.ProjectModelResolver.resolveModel(ProjectModelResolver.java:193)
	... 27 more
Caused by: org.eclipse.aether.transfer.ArtifactNotFoundException: Could not find artifact org.apache.maven.plugin.rresource.it:it-parent:pom:1.6-SNAPSHOT in apache-snapshots (http://repository.apache.org/snapshots/)
	at org.eclipse.aether.connector.basic.ArtifactTransportListener.transferFailed(ArtifactTransportListener.java:48)
	at org.eclipse.aether.connector.basic.BasicRepositoryConnector$TaskRunner.run(BasicRepositoryConnector.java:364)
	at org.eclipse.aether.util.concurrency.RunnableErrorForwarder$1.run(RunnableErrorForwarder.java:76)
	at org.eclipse.aether.connector.basic.BasicRepositoryConnector$DirectExecutor.execute(BasicRepositoryConnector.java:590)
	at org.eclipse.aether.connector.basic.BasicRepositoryConnector.get(BasicRepositoryConnector.java:258)
	at org.eclipse.aether.internal.impl.DefaultArtifactResolver.performDownloads(DefaultArtifactResolver.java:529)
	at org.eclipse.aether.internal.impl.DefaultArtifactResolver.resolve(DefaultArtifactResolver.java:430)
	... 31 more
[ERROR]   
[ERROR]   The project org.apache.maven.plugin.rresource.it.mrr41:child-2:[unknown-version] (F:\jenkins\jenkins-slave\workspace\rces-plugin_MRRESOURCES-103-OWZ3HFZ43MS4CUVJZUVLTQDPH6VF24RFDOZDFCITEPHO3WVUHWJQ\windows-jdk9-m3.5.x_build\target\test-classes\run-only-at-execution-root\child2\pom.xml) has 1 error
[ERROR]     Non-resolvable parent POM for org.apache.maven.plugin.rresource.it.mrr41:parent:[unknown-version]: Failure to find org.apache.maven.plugin.rresource.it:it-parent:pom:1.6-SNAPSHOT in http://repository.apache.org/snapshots/ was cached in the local repository, resolution will not be reattempted until the update interval of apache-snapshots has elapsed or updates are forced and 'parent.relativePath' points at wrong local POM @ org.apache.maven.plugin.rresource.it.mrr41:parent:[unknown-version], F:\jenkins\jenkins-slave\workspace\rces-plugin_MRRESOURCES-103-OWZ3HFZ43MS4CUVJZUVLTQDPH6VF24RFDOZDFCITEPHO3WVUHWJQ\windows-jdk9-m3.5.x_build\target\test-classes\run-only-at-execution-root\pom.xml, line 24, column 11 -> [Help 2]
org.apache.maven.model.resolution.UnresolvableModelException: Failure to find org.apache.maven.plugin.rresource.it:it-parent:pom:1.6-SNAPSHOT in http://repository.apache.org/snapshots/ was cached in the local repository, resolution will not be reattempted until the update interval of apache-snapshots has elapsed or updates are forced
	at org.apache.maven.project.ProjectModelResolver.resolveModel(ProjectModelResolver.java:197)
	at org.apache.maven.project.ProjectModelResolver.resolveModel(ProjectModelResolver.java:243)
	at org.apache.maven.model.building.DefaultModelBuilder.readParentExternally(DefaultModelBuilder.java:1051)
	at org.apache.maven.model.building.DefaultModelBuilder.readParent(DefaultModelBuilder.java:851)
	at org.apache.maven.model.building.DefaultModelBuilder.build(DefaultModelBuilder.java:331)
	at org.apache.maven.project.DefaultProjectBuilder.build(DefaultProjectBuilder.java:429)
	at org.apache.maven.project.DefaultProjectBuilder.build(DefaultProjectBuilder.java:398)
	at org.apache.maven.project.DefaultProjectBuilder.build(DefaultProjectBuilder.java:515)
	at org.apache.maven.project.DefaultProjectBuilder.build(DefaultProjectBuilder.java:398)
	at org.apache.maven.project.DefaultProjectBuilder.build(DefaultProjectBuilder.java:361)
	at org.apache.maven.graph.DefaultGraphBuilder.collectProjects(DefaultGraphBuilder.java:400)
	at org.apache.maven.graph.DefaultGraphBuilder.getProjectsForMavenReactor(DefaultGraphBuilder.java:391)
	at org.apache.maven.graph.DefaultGraphBuilder.build(DefaultGraphBuilder.java:78)
	at org.apache.maven.DefaultMaven.buildGraph(DefaultMaven.java:511)
	at org.apache.maven.DefaultMaven.doExecute(DefaultMaven.java:221)
	at org.apache.maven.DefaultMaven.doExecute(DefaultMaven.java:194)
	at org.apache.maven.DefaultMaven.execute(DefaultMaven.java:107)
	at org.apache.maven.cli.MavenCli.execute(MavenCli.java:993)
	at org.apache.maven.cli.MavenCli.doMain(MavenCli.java:345)
	at org.apache.maven.cli.MavenCli.main(MavenCli.java:191)
	at java.base/jdk.internal.reflect.NativeMethodAccessorImpl.invoke0(Native Method)
	at java.base/jdk.internal.reflect.NativeMethodAccessorImpl.invoke(NativeMethodAccessorImpl.java:62)
	at java.base/jdk.internal.reflect.DelegatingMethodAccessorImpl.invoke(DelegatingMethodAccessorImpl.java:43)
	at java.base/java.lang.reflect.Method.invoke(Method.java:564)
	at org.codehaus.plexus.classworlds.launcher.Launcher.launchEnhanced(Launcher.java:289)
	at org.codehaus.plexus.classworlds.launcher.Launcher.launch(Launcher.java:229)
	at org.codehaus.plexus.classworlds.launcher.Launcher.mainWithExitCode(Launcher.java:415)
	at org.codehaus.plexus.classworlds.launcher.Launcher.main(Launcher.java:356)
Caused by: org.eclipse.aether.resolution.ArtifactResolutionException: Failure to find org.apache.maven.plugin.rresource.it:it-parent:pom:1.6-SNAPSHOT in http://repository.apache.org/snapshots/ was cached in the local repository, resolution will not be reattempted until the update interval of apache-snapshots has elapsed or updates are forced
	at org.eclipse.aether.internal.impl.DefaultArtifactResolver.resolve(DefaultArtifactResolver.java:453)
	at org.eclipse.aether.internal.impl.DefaultArtifactResolver.resolveArtifacts(DefaultArtifactResolver.java:255)
	at org.eclipse.aether.internal.impl.DefaultArtifactResolver.resolveArtifact(DefaultArtifactResolver.java:232)
	at org.eclipse.aether.internal.impl.DefaultRepositorySystem.resolveArtifact(DefaultRepositorySystem.java:303)
	at org.apache.maven.project.ProjectModelResolver.resolveModel(ProjectModelResolver.java:193)
	... 27 more
Caused by: org.eclipse.aether.transfer.ArtifactNotFoundException: Failure to find org.apache.maven.plugin.rresource.it:it-parent:pom:1.6-SNAPSHOT in http://repository.apache.org/snapshots/ was cached in the local repository, resolution will not be reattempted until the update interval of apache-snapshots has elapsed or updates are forced
	at org.eclipse.aether.internal.impl.DefaultUpdateCheckManager.newException(DefaultUpdateCheckManager.java:240)
	at org.eclipse.aether.internal.impl.DefaultUpdateCheckManager.checkArtifact(DefaultUpdateCheckManager.java:192)
	at org.eclipse.aether.internal.impl.DefaultArtifactResolver.gatherDownloads(DefaultArtifactResolver.java:594)
	at org.eclipse.aether.internal.impl.DefaultArtifactResolver.performDownloads(DefaultArtifactResolver.java:512)
	at org.eclipse.aether.internal.impl.DefaultArtifactResolver.resolve(DefaultArtifactResolver.java:430)
	... 31 more
[ERROR] 
[ERROR] Re-run Maven using the -X switch to enable full debug logging.
[ERROR] 
[ERROR] For more information about the errors and possible solutions, please read the following articles:
[ERROR] [Help 1] http://cwiki.apache.org/confluence/display/MAVEN/ProjectBuildingException
[ERROR] [Help 2] http://cwiki.apache.org/confluence/display/MAVEN/UnresolvableModelException

	at org.apache.maven.plugin.resources.remote.it.IT_RunOnlyAtExecutionRoot.test(IT_RunOnlyAtExecutionRoot.java:62)


FAILED:  org.apache.maven.plugin.resources.remote.it.IT_RunOnlyAtExecutionRoot.test

Error Message:
Exit code was non-zero: 1; command line and log = 
F:\jenkins\tools\maven\apache-maven-3.5.0\bin\mvn -e --batch-mode -Dhttps.protocols=TLSv1.2 -Dmaven.repo.local=f:\jenkins\jenkins-slave\workspace\rces-plugin_MRRESOURCES-103-OWZ3HFZ43MS4CUVJZUVLTQDPH6VF24RFDOZDFCITEPHO3WVUHWJQ@2\windows-jdk10-m3.5.x_build\target/it-repo org.apache.maven.plugins:maven-clean-plugin:clean generate-resources
Picked up JAVA_TOOL_OPTIONS: -Dmaven.ext.class.path="f:\jenkins\jenkins-slave\workspace\rces-plugin_MRRESOURCES-103-OWZ3HFZ43MS4CUVJZUVLTQDPH6VF24RFDOZDFCITEPHO3WVUHWJQ@2@tmp\withMaven507ff9be\pipeline-maven-spy.jar" -Dorg.jenkinsci.plugins.pipeline.maven.reportsFolder="f:\jenkins\jenkins-slave\workspace\rces-plugin_MRRESOURCES-103-OWZ3HFZ43MS4CUVJZUVLTQDPH6VF24RFDOZDFCITEPHO3WVUHWJQ@2@tmp\withMaven507ff9be" 
[INFO] [jenkins-event-spy] Jenkins Maven Event Spy is disabled
[INFO] Error stacktraces are turned on.
[INFO] Scanning for projects...
[INFO] Downloading: http://repository.apache.org/snapshots/org/apache/maven/plugin/rresource/it/it-parent/1.6-SNAPSHOT/maven-metadata.xml
[INFO] Downloading: http://repository.apache.org/snapshots/org/apache/maven/plugin/rresource/it/it-parent/1.6-SNAPSHOT/it-parent-1.6-SNAPSHOT.pom
[ERROR] [ERROR] Some problems were encountered while processing the POMs:
[FATAL] Non-resolvable parent POM for org.apache.maven.plugin.rresource.it.mrr41:parent:[unknown-version]: Could not find artifact org.apache.maven.plugin.rresource.it:it-parent:pom:1.6-SNAPSHOT in apache-snapshots (http://repository.apache.org/snapshots/) and 'parent.relativePath' points at wrong local POM @ org.apache.maven.plugin.rresource.it.mrr41:parent:[unknown-version], F:\jenkins\jenkins-slave\workspace\rces-plugin_MRRESOURCES-103-OWZ3HFZ43MS4CUVJZUVLTQDPH6VF24RFDOZDFCITEPHO3WVUHWJQ@2\windows-jdk10-m3.5.x_build\target\test-classes\run-only-at-execution-root\pom.xml, line 24, column 11
[FATAL] Non-resolvable parent POM for org.apache.maven.plugin.rresource.it.mrr41:parent:[unknown-version]: Failure to find org.apache.maven.plugin.rresource.it:it-parent:pom:1.6-SNAPSHOT in http://repository.apache.org/snapshots/ was cached in the local repository, resolution will not be reattempted until the update interval of apache-snapshots has elapsed or updates are forced and 'parent.relativePath' points at wrong local POM @ org.apache.maven.plugin.rresource.it.mrr41:parent:[unknown-version], F:\jenkins\jenkins-slave\workspace\rces-plugin_MRRESOURCES-103-OWZ3HFZ43MS4CUVJZUVLTQDPH6VF24RFDOZDFCITEPHO3WVUHWJQ@2\windows-jdk10-m3.5.x_build\target\test-classes\run-only-at-execution-root\pom.xml, line 24, column 11
 @ 
[ERROR] The build could not read 2 projects -> [Help 1]
org.apache.maven.project.ProjectBuildingException: Some problems were encountered while processing the POMs:
[FATAL] Non-resolvable parent POM for org.apache.maven.plugin.rresource.it.mrr41:parent:[unknown-version]: Could not find artifact org.apache.maven.plugin.rresource.it:it-parent:pom:1.6-SNAPSHOT in apache-snapshots (http://repository.apache.org/snapshots/) and 'parent.relativePath' points at wrong local POM @ org.apache.maven.plugin.rresource.it.mrr41:parent:[unknown-version], F:\jenkins\jenkins-slave\workspace\rces-plugin_MRRESOURCES-103-OWZ3HFZ43MS4CUVJZUVLTQDPH6VF24RFDOZDFCITEPHO3WVUHWJQ@2\windows-jdk10-m3.5.x_build\target\test-classes\run-only-at-execution-root\pom.xml, line 24, column 11
[FATAL] Non-resolvable parent POM for org.apache.maven.plugin.rresource.it.mrr41:parent:[unknown-version]: Failure to find org.apache.maven.plugin.rresource.it:it-parent:pom:1.6-SNAPSHOT in http://repository.apache.org/snapshots/ was cached in the local repository, resolution will not be reattempted until the update interval of apache-snapshots has elapsed or updates are forced and 'parent.relativePath' points at wrong local POM @ org.apache.maven.plugin.rresource.it.mrr41:parent:[unknown-version], F:\jenkins\jenkins-slave\workspace\rces-plugin_MRRESOURCES-103-OWZ3HFZ43MS4CUVJZUVLTQDPH6VF24RFDOZDFCITEPHO3WVUHWJQ@2\windows-jdk10-m3.5.x_build\target\test-classes\run-only-at-execution-root\pom.xml, line 24, column 11

 at org.apache.maven.project.DefaultProjectBuilder.build(DefaultProjectBuilder.java:382)
 at org.apache.maven.graph.DefaultGraphBuilder.collectProjects(DefaultGraphBuilder.java:400)
 at org.apache.maven.graph.DefaultGraphBuilder.getProjectsForMavenReactor(DefaultGraphBuilder.java:391)
 at org.apache.maven.graph.DefaultGraphBuilder.build(DefaultGraphBuilder.java:78)
 at org.apache.maven.DefaultMaven.buildGraph(DefaultMaven.java:511)
 at org.apache.maven.DefaultMaven.doExecute(DefaultMaven.java:221)
 at org.apache.maven.DefaultMaven.doExecute(DefaultMaven.java:194)
 at org.apache.maven.DefaultMaven.execute(DefaultMaven.java:107)
 at org.apache.maven.cli.MavenCli.execute(MavenCli.java:993)
 at org.apache.maven.cli.MavenCli.doMain(MavenCli.java:345)
 at org.apache.maven.cli.MavenCli.main(MavenCli.java:191)
 at java.base/jdk.internal.reflect.NativeMethodAccessorImpl.invoke0(Native Method)
 at java.base/jdk.internal.reflect.NativeMethodAccessorImpl.invoke(NativeMethodAccessorImpl.java:62)
 at java.base/jdk.internal.reflect.DelegatingMethodAccessorImpl.invoke(DelegatingMethodAccessorImpl.java:43)
 at java.base/java.lang.reflect.Method.invoke(Method.java:564)
 at org.codehaus.plexus.classworlds.launcher.Launcher.launchEnhanced(Launcher.java:289)
 at org.codehaus.plexus.classworlds.launcher.Launcher.launch(Launcher.java:229)
 at org.codehaus.plexus.classworlds.launcher.Launcher.mainWithExitCode(Launcher.java:415)
 at org.codehaus.plexus.classworlds.launcher.Launcher.main(Launcher.java:356)
[ERROR]   
[ERROR]   The project org.apache.maven.plugin.rresource.it.mrr41:child-1:[unknown-version] (F:\jenkins\jenkins-slave\workspace\rces-plugin_MRRESOURCES-103-OWZ3HFZ43MS4CUVJZUVLTQDPH6VF24RFDOZDFCITEPHO3WVUHWJQ@2\windows-jdk10-m3.5.x_build\target\test-classes\run-only-at-execution-root\child1\pom.xml) has 1 error
[ERROR]     Non-resolvable parent POM for org.apache.maven.plugin.rresource.it.mrr41:parent:[unknown-version]: Could not find artifact org.apache.maven.plugin.rresource.it:it-parent:pom:1.6-SNAPSHOT in apache-snapshots (http://repository.apache.org/snapshots/) and 'parent.relativePath' points at wrong local POM @ org.apache.maven.plugin.rresource.it.mrr41:parent:[unknown-version], F:\jenkins\jenkins-slave\workspace\rces-plugin_MRRESOURCES-103-OWZ3HFZ43MS4CUVJZUVLTQDPH6VF24RFDOZDFCITEPHO3WVUHWJQ@2\windows-jdk10-m3.5.x_build\target\test-classes\run-only-at-execution-root\pom.xml, line 24, column 11 -> [Help 2]
org.apache.maven.model.resolution.UnresolvableModelException: Could not find artifact org.apache.maven.plugin.rresource.it:it-parent:pom:1.6-SNAPSHOT in apache-snapshots (http://repository.apache.org/snapshots/)
 at org.apache.maven.project.ProjectModelResolver.resolveModel(ProjectModelResolver.java:197)
 at org.apache.maven.project.ProjectModelResolver.resolveModel(ProjectModelResolver.java:243)
 at org.apache.maven.model.building.DefaultModelBuilder.readParentExternally(DefaultModelBuilder.java:1051)
 at org.apache.maven.model.building.DefaultModelBuilder.readParent(DefaultModelBuilder.java:851)
 at org.apache.maven.model.building.DefaultModelBuilder.build(DefaultModelBuilder.java:331)
 at org.apache.maven.project.DefaultProjectBuilder.build(DefaultProjectBuilder.java:429)
 at org.apache.maven.project.DefaultProjectBuilder.build(DefaultProjectBuilder.java:398)
 at org.apache.maven.project.DefaultProjectBuilder.build(DefaultProjectBuilder.java:515)
 at org.apache.maven.project.DefaultProjectBuilder.build(DefaultProjectBuilder.java:398)
 at org.apache.maven.project.DefaultProjectBuilder.build(DefaultProjectBuilder.java:361)
 at org.apache.maven.graph.DefaultGraphBuilder.collectProjects(DefaultGraphBuilder.java:400)
 at org.apache.maven.graph.DefaultGraphBuilder.getProjectsForMavenReactor(DefaultGraphBuilder.java:391)
 at org.apache.maven.graph.DefaultGraphBuilder.build(DefaultGraphBuilder.java:78)
 at org.apache.maven.DefaultMaven.buildGraph(DefaultMaven.java:511)
 at org.apache.maven.DefaultMaven.doExecute(DefaultMaven.java:221)
 at org.apache.maven.DefaultMaven.doExecute(DefaultMaven.java:194)
 at org.apache.maven.DefaultMaven.execute(DefaultMaven.java:107)
 at org.apache.maven.cli.MavenCli.execute(MavenCli.java:993)
 at org.apache.maven.cli.MavenCli.doMain(MavenCli.java:345)
 at org.apache.maven.cli.MavenCli.main(MavenCli.java:191)
 at java.base/jdk.internal.reflect.NativeMethodAccessorImpl.invoke0(Native Method)
 at java.base/jdk.internal.reflect.NativeMethodAccessorImpl.invoke(NativeMethodAccessorImpl.java:62)
 at java.base/jdk.internal.reflect.DelegatingMethodAccessorImpl.invoke(DelegatingMethodAccessorImpl.java:43)
 at java.base/java.lang.reflect.Method.invoke(Method.java:564)
 at org.codehaus.plexus.classworlds.launcher.Launcher.launchEnhanced(Launcher.java:289)
 at org.codehaus.plexus.classworlds.launcher.Launcher.launch(Launcher.java:229)
 at org.codehaus.plexus.classworlds.launcher.Launcher.mainWithExitCode(Launcher.java:415)
 at org.codehaus.plexus.classworlds.launcher.Launcher.main(Launcher.java:356)
Caused by: org.eclipse.aether.resolution.ArtifactResolutionException: Could not find artifact org.apache.maven.plugin.rresource.it:it-parent:pom:1.6-SNAPSHOT in apache-snapshots (http://repository.apache.org/snapshots/)
 at org.eclipse.aether.internal.impl.DefaultArtifactResolver.resolve(DefaultArtifactResolver.java:453)
 at org.eclipse.aether.internal.impl.DefaultArtifactResolver.resolveArtifacts(DefaultArtifactResolver.java:255)
 at org.eclipse.aether.internal.impl.DefaultArtifactResolver.resolveArtifact(DefaultArtifactResolver.java:232)
 at org.eclipse.aether.internal.impl.DefaultRepositorySystem.resolveArtifact(DefaultRepositorySystem.java:303)
 at org.apache.maven.project.ProjectModelResolver.resolveModel(ProjectModelResolver.java:193)
 ... 27 more
Caused by: org.eclipse.aether.transfer.ArtifactNotFoundException: Could not find artifact org.apache.maven.plugin.rresource.it:it-parent:pom:1.6-SNAPSHOT in apache-snapshots (http://repository.apache.org/snapshots/)
 at org.eclipse.aether.connector.basic.ArtifactTransportListener.transferFailed(ArtifactTransportListener.java:48)
 at org.eclipse.aether.connector.basic.BasicRepositoryConnector$TaskRunner.run(BasicRepositoryConnector.java:364)
 at org.eclipse.aether.util.concurrency.RunnableErrorForwarder$1.run(RunnableErrorForwarder.java:76)
 at org.eclipse.aether.connector.basic.BasicRepositoryConnector$DirectExecutor.execute(BasicRepositoryConnector.java:590)
 at org.eclipse.aether.connector.basic.BasicRepositoryConnector.get(BasicRepositoryConnector.java:258)
 at org.eclipse.aether.internal.impl.DefaultArtifactResolver.performDownloads(DefaultArtifactResolver.java:529)
 at org.eclipse.aether.internal.impl.DefaultArtifactResolver.resolve(DefaultArtifactResolver.java:430)
 ... 31 more
[ERROR]   
[ERROR]   The project org.apache.maven.plugin.rresource.it.mrr41:child-2:[unknown-version] (F:\jenkins\jenkins-slave\workspace\rces-plugin_MRRESOURCES-103-OWZ3HFZ43MS4CUVJZUVLTQDPH6VF24RFDOZDFCITEPHO3WVUHWJQ@2\windows-jdk10-m3.5.x_build\target\test-classes\run-only-at-execution-root\child2\pom.xml) has 1 error
[ERROR]     Non-resolvable parent POM for org.apache.maven.plugin.rresource.it.mrr41:parent:[unknown-version]: Failure to find org.apache.maven.plugin.rresource.it:it-parent:pom:1.6-SNAPSHOT in http://repository.apache.org/snapshots/ was cached in the local repository, resolution will not be reattempted until the update interval of apache-snapshots has elapsed or updates are forced and 'parent.relativePath' points at wrong local POM @ org.apache.maven.plugin.rresource.it.mrr41:parent:[unknown-version], F:\jenkins\jenkins-slave\workspace\rces-plugin_MRRESOURCES-103-OWZ3HFZ43MS4CUVJZUVLTQDPH6VF24RFDOZDFCITEPHO3WVUHWJQ@2\windows-jdk10-m3.5.x_build\target\test-classes\run-only-at-execution-root\pom.xml, line 24, column 11 -> [Help 2]
org.apache.maven.model.resolution.UnresolvableModelException: Failure to find org.apache.maven.plugin.rresource.it:it-parent:pom:1.6-SNAPSHOT in http://repository.apache.org/snapshots/ was cached in the local repository, resolution will not be reattempted until the update interval of apache-snapshots has elapsed or updates are forced
 at org.apache.maven.project.ProjectModelResolver.resolveModel(ProjectModelResolver.java:197)
 at org.apache.maven.project.ProjectModelResolver.resolveModel(ProjectModelResolver.java:243)
 at org.apache.maven.model.building.DefaultModelBuilder.readParentExternally(DefaultModelBuilder.java:1051)
 at org.apache.maven.model.building.DefaultModelBuilder.readParent(DefaultModelBuilder.java:851)
 at org.apache.maven.model.building.DefaultModelBuilder.build(DefaultModelBuilder.java:331)
 at org.apache.maven.project.DefaultProjectBuilder.build(DefaultProjectBuilder.java:429)
 at org.apache.maven.project.DefaultProjectBuilder.build(DefaultProjectBuilder.java:398)
 at org.apache.maven.project.DefaultProjectBuilder.build(DefaultProjectBuilder.java:515)
 at org.apache.maven.project.DefaultProjectBuilder.build(DefaultProjectBuilder.java:398)
 at org.apache.maven.project.DefaultProjectBuilder.build(DefaultProjectBuilder.java:361)
 at org.apache.maven.graph.DefaultGraphBuilder.collectProjects(DefaultGraphBuilder.java:400)
 at org.apache.maven.graph.DefaultGraphBuilder.getProjectsForMavenReactor(DefaultGraphBuilder.java:391)
 at org.apache.maven.graph.DefaultGraphBuilder.build(DefaultGraphBuilder.java:78)
 at org.apache.maven.DefaultMaven.buildGraph(DefaultMaven.java:511)
 at org.apache.maven.DefaultMaven.doExecute(DefaultMaven.java:221)
 at org.apache.maven.DefaultMaven.doExecute(DefaultMaven.java:194)
 at org.apache.maven.DefaultMaven.execute(DefaultMaven.java:107)
 at org.apache.maven.cli.MavenCli.execute(MavenCli.java:993)
 at org.apache.maven.cli.MavenCli.doMain(MavenCli.java:345)
 at org.apache.maven.cli.MavenCli.main(MavenCli.java:191)
 at java.base/jdk.internal.reflect.NativeMethodAccessorImpl.invoke0(Native Method)
 at java.base/jdk.internal.reflect.NativeMethodAccessorImpl.invoke(NativeMethodAccessorImpl.java:62)
 at java.base/jdk.internal.reflect.DelegatingMethodAccessorImpl.invoke(DelegatingMethodAccessorImpl.java:43)
 at java.base/java.lang.reflect.Method.invoke(Method.java:564)
 at org.codehaus.plexus.classworlds.launcher.Launcher.launchEnhanced(Launcher.java:289)
 at org.codehaus.plexus.classworlds.launcher.Launcher.launch(Launcher.java:229)
 at org.codehaus.plexus.classworlds.launcher.Launcher.mainWithExitCode(Launcher.java:415)
 at org.codehaus.plexus.classworlds.launcher.Launcher.main(Launcher.java:356)
Caused by: org.eclipse.aether.resolution.ArtifactResolutionException: Failure to find org.apache.maven.plugin.rresource.it:it-parent:pom:1.6-SNAPSHOT in http://repository.apache.org/snapshots/ was cached in the local repository, resolution will not be reattempted until the update interval of apache-snapshots has elapsed or updates are forced
 at org.eclipse.aether.internal.impl.DefaultArtifactResolver.resolve(DefaultArtifactResolver.java:453)
 at org.eclipse.aether.internal.impl.DefaultArtifactResolver.resolveArtifacts(DefaultArtifactResolver.java:255)
 at org.eclipse.aether.internal.impl.DefaultArtifactResolver.resolveArtifact(DefaultArtifactResolver.java:232)
 at org.eclipse.aether.internal.impl.DefaultRepositorySystem.resolveArtifact(DefaultRepositorySystem.java:303)
 at org.apache.maven.project.ProjectModelResolver.resolveModel(ProjectModelResolver.java:193)
 ... 27 more
Caused by: org.eclipse.aether.transfer.ArtifactNotFoundException: Failure to find org.apache.maven.plugin.rresource.it:it-parent:pom:1.6-SNAPSHOT in http://repository.apache.org/snapshots/ was cached in the local repository, resolution will not be reattempted until the update interval of apache-snapshots has elapsed or updates are forced
 at org.eclipse.aether.internal.impl.DefaultUpdateCheckManager.newException(DefaultUpdateCheckManager.java:240)
 at org.eclipse.aether.internal.impl.DefaultUpdateCheckManager.checkArtifact(DefaultUpdateCheckManager.java:192)
 at org.eclipse.aether.internal.impl.DefaultArtifactResolver.gatherDownloads(DefaultArtifactResolver.java:594)
 at org.eclipse.aether.internal.impl.DefaultArtifactResolver.performDownloads(DefaultArtifactResolver.java:512)
 at org.eclipse.aether.internal.impl.DefaultArtifactResolver.resolve(DefaultArtifactResolver.java:430)
 ... 31 more
[ERROR] 
[ERROR] Re-run Maven using the -X switch to enable full debug logging.
[ERROR] 
[ERROR] For more information about the errors and possible solutions, please read the following articles:
[ERROR] [Help 1] http://cwiki.apache.org/confluence/display/MAVEN/ProjectBuildingException
[ERROR] [Help 2] http://cwiki.apache.org/confluence/display/MAVEN/UnresolvableModelException


Stack Trace:
org.apache.maven.it.VerificationException: 
Exit code was non-zero: 1; command line and log = 
F:\jenkins\tools\maven\apache-maven-3.5.0\bin\mvn -e --batch-mode -Dhttps.protocols=TLSv1.2 -Dmaven.repo.local=f:\jenkins\jenkins-slave\workspace\rces-plugin_MRRESOURCES-103-OWZ3HFZ43MS4CUVJZUVLTQDPH6VF24RFDOZDFCITEPHO3WVUHWJQ@2\windows-jdk10-m3.5.x_build\target/it-repo org.apache.maven.plugins:maven-clean-plugin:clean generate-resources
Picked up JAVA_TOOL_OPTIONS: -Dmaven.ext.class.path="f:\jenkins\jenkins-slave\workspace\rces-plugin_MRRESOURCES-103-OWZ3HFZ43MS4CUVJZUVLTQDPH6VF24RFDOZDFCITEPHO3WVUHWJQ@2@tmp\withMaven507ff9be\pipeline-maven-spy.jar" -Dorg.jenkinsci.plugins.pipeline.maven.reportsFolder="f:\jenkins\jenkins-slave\workspace\rces-plugin_MRRESOURCES-103-OWZ3HFZ43MS4CUVJZUVLTQDPH6VF24RFDOZDFCITEPHO3WVUHWJQ@2@tmp\withMaven507ff9be" 
[INFO] [jenkins-event-spy] Jenkins Maven Event Spy is disabled
[INFO] Error stacktraces are turned on.
[INFO] Scanning for projects...
[INFO] Downloading: http://repository.apache.org/snapshots/org/apache/maven/plugin/rresource/it/it-parent/1.6-SNAPSHOT/maven-metadata.xml
[INFO] Downloading: http://repository.apache.org/snapshots/org/apache/maven/plugin/rresource/it/it-parent/1.6-SNAPSHOT/it-parent-1.6-SNAPSHOT.pom
[ERROR] [ERROR] Some problems were encountered while processing the POMs:
[FATAL] Non-resolvable parent POM for org.apache.maven.plugin.rresource.it.mrr41:parent:[unknown-version]: Could not find artifact org.apache.maven.plugin.rresource.it:it-parent:pom:1.6-SNAPSHOT in apache-snapshots (http://repository.apache.org/snapshots/) and 'parent.relativePath' points at wrong local POM @ org.apache.maven.plugin.rresource.it.mrr41:parent:[unknown-version], F:\jenkins\jenkins-slave\workspace\rces-plugin_MRRESOURCES-103-OWZ3HFZ43MS4CUVJZUVLTQDPH6VF24RFDOZDFCITEPHO3WVUHWJQ@2\windows-jdk10-m3.5.x_build\target\test-classes\run-only-at-execution-root\pom.xml, line 24, column 11
[FATAL] Non-resolvable parent POM for org.apache.maven.plugin.rresource.it.mrr41:parent:[unknown-version]: Failure to find org.apache.maven.plugin.rresource.it:it-parent:pom:1.6-SNAPSHOT in http://repository.apache.org/snapshots/ was cached in the local repository, resolution will not be reattempted until the update interval of apache-snapshots has elapsed or updates are forced and 'parent.relativePath' points at wrong local POM @ org.apache.maven.plugin.rresource.it.mrr41:parent:[unknown-version], F:\jenkins\jenkins-slave\workspace\rces-plugin_MRRESOURCES-103-OWZ3HFZ43MS4CUVJZUVLTQDPH6VF24RFDOZDFCITEPHO3WVUHWJQ@2\windows-jdk10-m3.5.x_build\target\test-classes\run-only-at-execution-root\pom.xml, line 24, column 11
 @ 
[ERROR] The build could not read 2 projects -> [Help 1]
org.apache.maven.project.ProjectBuildingException: Some problems were encountered while processing the POMs:
[FATAL] Non-resolvable parent POM for org.apache.maven.plugin.rresource.it.mrr41:parent:[unknown-version]: Could not find artifact org.apache.maven.plugin.rresource.it:it-parent:pom:1.6-SNAPSHOT in apache-snapshots (http://repository.apache.org/snapshots/) and 'parent.relativePath' points at wrong local POM @ org.apache.maven.plugin.rresource.it.mrr41:parent:[unknown-version], F:\jenkins\jenkins-slave\workspace\rces-plugin_MRRESOURCES-103-OWZ3HFZ43MS4CUVJZUVLTQDPH6VF24RFDOZDFCITEPHO3WVUHWJQ@2\windows-jdk10-m3.5.x_build\target\test-classes\run-only-at-execution-root\pom.xml, line 24, column 11
[FATAL] Non-resolvable parent POM for org.apache.maven.plugin.rresource.it.mrr41:parent:[unknown-version]: Failure to find org.apache.maven.plugin.rresource.it:it-parent:pom:1.6-SNAPSHOT in http://repository.apache.org/snapshots/ was cached in the local repository, resolution will not be reattempted until the update interval of apache-snapshots has elapsed or updates are forced and 'parent.relativePath' points at wrong local POM @ org.apache.maven.plugin.rresource.it.mrr41:parent:[unknown-version], F:\jenkins\jenkins-slave\workspace\rces-plugin_MRRESOURCES-103-OWZ3HFZ43MS4CUVJZUVLTQDPH6VF24RFDOZDFCITEPHO3WVUHWJQ@2\windows-jdk10-m3.5.x_build\target\test-classes\run-only-at-execution-root\pom.xml, line 24, column 11

	at org.apache.maven.project.DefaultProjectBuilder.build(DefaultProjectBuilder.java:382)
	at org.apache.maven.graph.DefaultGraphBuilder.collectProjects(DefaultGraphBuilder.java:400)
	at org.apache.maven.graph.DefaultGraphBuilder.getProjectsForMavenReactor(DefaultGraphBuilder.java:391)
	at org.apache.maven.graph.DefaultGraphBuilder.build(DefaultGraphBuilder.java:78)
	at org.apache.maven.DefaultMaven.buildGraph(DefaultMaven.java:511)
	at org.apache.maven.DefaultMaven.doExecute(DefaultMaven.java:221)
	at org.apache.maven.DefaultMaven.doExecute(DefaultMaven.java:194)
	at org.apache.maven.DefaultMaven.execute(DefaultMaven.java:107)
	at org.apache.maven.cli.MavenCli.execute(MavenCli.java:993)
	at org.apache.maven.cli.MavenCli.doMain(MavenCli.java:345)
	at org.apache.maven.cli.MavenCli.main(MavenCli.java:191)
	at java.base/jdk.internal.reflect.NativeMethodAccessorImpl.invoke0(Native Method)
	at java.base/jdk.internal.reflect.NativeMethodAccessorImpl.invoke(NativeMethodAccessorImpl.java:62)
	at java.base/jdk.internal.reflect.DelegatingMethodAccessorImpl.invoke(DelegatingMethodAccessorImpl.java:43)
	at java.base/java.lang.reflect.Method.invoke(Method.java:564)
	at org.codehaus.plexus.classworlds.launcher.Launcher.launchEnhanced(Launcher.java:289)
	at org.codehaus.plexus.classworlds.launcher.Launcher.launch(Launcher.java:229)
	at org.codehaus.plexus.classworlds.launcher.Launcher.mainWithExitCode(Launcher.java:415)
	at org.codehaus.plexus.classworlds.launcher.Launcher.main(Launcher.java:356)
[ERROR]   
[ERROR]   The project org.apache.maven.plugin.rresource.it.mrr41:child-1:[unknown-version] (F:\jenkins\jenkins-slave\workspace\rces-plugin_MRRESOURCES-103-OWZ3HFZ43MS4CUVJZUVLTQDPH6VF24RFDOZDFCITEPHO3WVUHWJQ@2\windows-jdk10-m3.5.x_build\target\test-classes\run-only-at-execution-root\child1\pom.xml) has 1 error
[ERROR]     Non-resolvable parent POM for org.apache.maven.plugin.rresource.it.mrr41:parent:[unknown-version]: Could not find artifact org.apache.maven.plugin.rresource.it:it-parent:pom:1.6-SNAPSHOT in apache-snapshots (http://repository.apache.org/snapshots/) and 'parent.relativePath' points at wrong local POM @ org.apache.maven.plugin.rresource.it.mrr41:parent:[unknown-version], F:\jenkins\jenkins-slave\workspace\rces-plugin_MRRESOURCES-103-OWZ3HFZ43MS4CUVJZUVLTQDPH6VF24RFDOZDFCITEPHO3WVUHWJQ@2\windows-jdk10-m3.5.x_build\target\test-classes\run-only-at-execution-root\pom.xml, line 24, column 11 -> [Help 2]
org.apache.maven.model.resolution.UnresolvableModelException: Could not find artifact org.apache.maven.plugin.rresource.it:it-parent:pom:1.6-SNAPSHOT in apache-snapshots (http://repository.apache.org/snapshots/)
	at org.apache.maven.project.ProjectModelResolver.resolveModel(ProjectModelResolver.java:197)
	at org.apache.maven.project.ProjectModelResolver.resolveModel(ProjectModelResolver.java:243)
	at org.apache.maven.model.building.DefaultModelBuilder.readParentExternally(DefaultModelBuilder.java:1051)
	at org.apache.maven.model.building.DefaultModelBuilder.readParent(DefaultModelBuilder.java:851)
	at org.apache.maven.model.building.DefaultModelBuilder.build(DefaultModelBuilder.java:331)
	at org.apache.maven.project.DefaultProjectBuilder.build(DefaultProjectBuilder.java:429)
	at org.apache.maven.project.DefaultProjectBuilder.build(DefaultProjectBuilder.java:398)
	at org.apache.maven.project.DefaultProjectBuilder.build(DefaultProjectBuilder.java:515)
	at org.apache.maven.project.DefaultProjectBuilder.build(DefaultProjectBuilder.java:398)
	at org.apache.maven.project.DefaultProjectBuilder.build(DefaultProjectBuilder.java:361)
	at org.apache.maven.graph.DefaultGraphBuilder.collectProjects(DefaultGraphBuilder.java:400)
	at org.apache.maven.graph.DefaultGraphBuilder.getProjectsForMavenReactor(DefaultGraphBuilder.java:391)
	at org.apache.maven.graph.DefaultGraphBuilder.build(DefaultGraphBuilder.java:78)
	at org.apache.maven.DefaultMaven.buildGraph(DefaultMaven.java:511)
	at org.apache.maven.DefaultMaven.doExecute(DefaultMaven.java:221)
	at org.apache.maven.DefaultMaven.doExecute(DefaultMaven.java:194)
	at org.apache.maven.DefaultMaven.execute(DefaultMaven.java:107)
	at org.apache.maven.cli.MavenCli.execute(MavenCli.java:993)
	at org.apache.maven.cli.MavenCli.doMain(MavenCli.java:345)
	at org.apache.maven.cli.MavenCli.main(MavenCli.java:191)
	at java.base/jdk.internal.reflect.NativeMethodAccessorImpl.invoke0(Native Method)
	at java.base/jdk.internal.reflect.NativeMethodAccessorImpl.invoke(NativeMethodAccessorImpl.java:62)
	at java.base/jdk.internal.reflect.DelegatingMethodAccessorImpl.invoke(DelegatingMethodAccessorImpl.java:43)
	at java.base/java.lang.reflect.Method.invoke(Method.java:564)
	at org.codehaus.plexus.classworlds.launcher.Launcher.launchEnhanced(Launcher.java:289)
	at org.codehaus.plexus.classworlds.launcher.Launcher.launch(Launcher.java:229)
	at org.codehaus.plexus.classworlds.launcher.Launcher.mainWithExitCode(Launcher.java:415)
	at org.codehaus.plexus.classworlds.launcher.Launcher.main(Launcher.java:356)
Caused by: org.eclipse.aether.resolution.ArtifactResolutionException: Could not find artifact org.apache.maven.plugin.rresource.it:it-parent:pom:1.6-SNAPSHOT in apache-snapshots (http://repository.apache.org/snapshots/)
	at org.eclipse.aether.internal.impl.DefaultArtifactResolver.resolve(DefaultArtifactResolver.java:453)
	at org.eclipse.aether.internal.impl.DefaultArtifactResolver.resolveArtifacts(DefaultArtifactResolver.java:255)
	at org.eclipse.aether.internal.impl.DefaultArtifactResolver.resolveArtifact(DefaultArtifactResolver.java:232)
	at org.eclipse.aether.internal.impl.DefaultRepositorySystem.resolveArtifact(DefaultRepositorySystem.java:303)
	at org.apache.maven.project.ProjectModelResolver.resolveModel(ProjectModelResolver.java:193)
	... 27 more
Caused by: org.eclipse.aether.transfer.ArtifactNotFoundException: Could not find artifact org.apache.maven.plugin.rresource.it:it-parent:pom:1.6-SNAPSHOT in apache-snapshots (http://repository.apache.org/snapshots/)
	at org.eclipse.aether.connector.basic.ArtifactTransportListener.transferFailed(ArtifactTransportListener.java:48)
	at org.eclipse.aether.connector.basic.BasicRepositoryConnector$TaskRunner.run(BasicRepositoryConnector.java:364)
	at org.eclipse.aether.util.concurrency.RunnableErrorForwarder$1.run(RunnableErrorForwarder.java:76)
	at org.eclipse.aether.connector.basic.BasicRepositoryConnector$DirectExecutor.execute(BasicRepositoryConnector.java:590)
	at org.eclipse.aether.connector.basic.BasicRepositoryConnector.get(BasicRepositoryConnector.java:258)
	at org.eclipse.aether.internal.impl.DefaultArtifactResolver.performDownloads(DefaultArtifactResolver.java:529)
	at org.eclipse.aether.internal.impl.DefaultArtifactResolver.resolve(DefaultArtifactResolver.java:430)
	... 31 more
[ERROR]   
[ERROR]   The project org.apache.maven.plugin.rresource.it.mrr41:child-2:[unknown-version] (F:\jenkins\jenkins-slave\workspace\rces-plugin_MRRESOURCES-103-OWZ3HFZ43MS4CUVJZUVLTQDPH6VF24RFDOZDFCITEPHO3WVUHWJQ@2\windows-jdk10-m3.5.x_build\target\test-classes\run-only-at-execution-root\child2\pom.xml) has 1 error
[ERROR]     Non-resolvable parent POM for org.apache.maven.plugin.rresource.it.mrr41:parent:[unknown-version]: Failure to find org.apache.maven.plugin.rresource.it:it-parent:pom:1.6-SNAPSHOT in http://repository.apache.org/snapshots/ was cached in the local repository, resolution will not be reattempted until the update interval of apache-snapshots has elapsed or updates are forced and 'parent.relativePath' points at wrong local POM @ org.apache.maven.plugin.rresource.it.mrr41:parent:[unknown-version], F:\jenkins\jenkins-slave\workspace\rces-plugin_MRRESOURCES-103-OWZ3HFZ43MS4CUVJZUVLTQDPH6VF24RFDOZDFCITEPHO3WVUHWJQ@2\windows-jdk10-m3.5.x_build\target\test-classes\run-only-at-execution-root\pom.xml, line 24, column 11 -> [Help 2]
org.apache.maven.model.resolution.UnresolvableModelException: Failure to find org.apache.maven.plugin.rresource.it:it-parent:pom:1.6-SNAPSHOT in http://repository.apache.org/snapshots/ was cached in the local repository, resolution will not be reattempted until the update interval of apache-snapshots has elapsed or updates are forced
	at org.apache.maven.project.ProjectModelResolver.resolveModel(ProjectModelResolver.java:197)
	at org.apache.maven.project.ProjectModelResolver.resolveModel(ProjectModelResolver.java:243)
	at org.apache.maven.model.building.DefaultModelBuilder.readParentExternally(DefaultModelBuilder.java:1051)
	at org.apache.maven.model.building.DefaultModelBuilder.readParent(DefaultModelBuilder.java:851)
	at org.apache.maven.model.building.DefaultModelBuilder.build(DefaultModelBuilder.java:331)
	at org.apache.maven.project.DefaultProjectBuilder.build(DefaultProjectBuilder.java:429)
	at org.apache.maven.project.DefaultProjectBuilder.build(DefaultProjectBuilder.java:398)
	at org.apache.maven.project.DefaultProjectBuilder.build(DefaultProjectBuilder.java:515)
	at org.apache.maven.project.DefaultProjectBuilder.build(DefaultProjectBuilder.java:398)
	at org.apache.maven.project.DefaultProjectBuilder.build(DefaultProjectBuilder.java:361)
	at org.apache.maven.graph.DefaultGraphBuilder.collectProjects(DefaultGraphBuilder.java:400)
	at org.apache.maven.graph.DefaultGraphBuilder.getProjectsForMavenReactor(DefaultGraphBuilder.java:391)
	at org.apache.maven.graph.DefaultGraphBuilder.build(DefaultGraphBuilder.java:78)
	at org.apache.maven.DefaultMaven.buildGraph(DefaultMaven.java:511)
	at org.apache.maven.DefaultMaven.doExecute(DefaultMaven.java:221)
	at org.apache.maven.DefaultMaven.doExecute(DefaultMaven.java:194)
	at org.apache.maven.DefaultMaven.execute(DefaultMaven.java:107)
	at org.apache.maven.cli.MavenCli.execute(MavenCli.java:993)
	at org.apache.maven.cli.MavenCli.doMain(MavenCli.java:345)
	at org.apache.maven.cli.MavenCli.main(MavenCli.java:191)
	at java.base/jdk.internal.reflect.NativeMethodAccessorImpl.invoke0(Native Method)
	at java.base/jdk.internal.reflect.NativeMethodAccessorImpl.invoke(NativeMethodAccessorImpl.java:62)
	at java.base/jdk.internal.reflect.DelegatingMethodAccessorImpl.invoke(DelegatingMethodAccessorImpl.java:43)
	at java.base/java.lang.reflect.Method.invoke(Method.java:564)
	at org.codehaus.plexus.classworlds.launcher.Launcher.launchEnhanced(Launcher.java:289)
	at org.codehaus.plexus.classworlds.launcher.Launcher.launch(Launcher.java:229)
	at org.codehaus.plexus.classworlds.launcher.Launcher.mainWithExitCode(Launcher.java:415)
	at org.codehaus.plexus.classworlds.launcher.Launcher.main(Launcher.java:356)
Caused by: org.eclipse.aether.resolution.ArtifactResolutionException: Failure to find org.apache.maven.plugin.rresource.it:it-parent:pom:1.6-SNAPSHOT in http://repository.apache.org/snapshots/ was cached in the local repository, resolution will not be reattempted until the update interval of apache-snapshots has elapsed or updates are forced
	at org.eclipse.aether.internal.impl.DefaultArtifactResolver.resolve(DefaultArtifactResolver.java:453)
	at org.eclipse.aether.internal.impl.DefaultArtifactResolver.resolveArtifacts(DefaultArtifactResolver.java:255)
	at org.eclipse.aether.internal.impl.DefaultArtifactResolver.resolveArtifact(DefaultArtifactResolver.java:232)
	at org.eclipse.aether.internal.impl.DefaultRepositorySystem.resolveArtifact(DefaultRepositorySystem.java:303)
	at org.apache.maven.project.ProjectModelResolver.resolveModel(ProjectModelResolver.java:193)
	... 27 more
Caused by: org.eclipse.aether.transfer.ArtifactNotFoundException: Failure to find org.apache.maven.plugin.rresource.it:it-parent:pom:1.6-SNAPSHOT in http://repository.apache.org/snapshots/ was cached in the local repository, resolution will not be reattempted until the update interval of apache-snapshots has elapsed or updates are forced
	at org.eclipse.aether.internal.impl.DefaultUpdateCheckManager.newException(DefaultUpdateCheckManager.java:240)
	at org.eclipse.aether.internal.impl.DefaultUpdateCheckManager.checkArtifact(DefaultUpdateCheckManager.java:192)
	at org.eclipse.aether.internal.impl.DefaultArtifactResolver.gatherDownloads(DefaultArtifactResolver.java:594)
	at org.eclipse.aether.internal.impl.DefaultArtifactResolver.performDownloads(DefaultArtifactResolver.java:512)
	at org.eclipse.aether.internal.impl.DefaultArtifactResolver.resolve(DefaultArtifactResolver.java:430)
	... 31 more
[ERROR] 
[ERROR] Re-run Maven using the -X switch to enable full debug logging.
[ERROR] 
[ERROR] For more information about the errors and possible solutions, please read the following articles:
[ERROR] [Help 1] http://cwiki.apache.org/confluence/display/MAVEN/ProjectBuildingException
[ERROR] [Help 2] http://cwiki.apache.org/confluence/display/MAVEN/UnresolvableModelException

	at org.apache.maven.plugin.resources.remote.it.IT_RunOnlyAtExecutionRoot.test(IT_RunOnlyAtExecutionRoot.java:62)




Build log:
[...truncated 4.93 MB...]
[windows-jdk10-m3.5.x_build] [INFO] Downloading: https://repo.maven.apache.org/maven2/commons-logging/commons-logging/1.0.4/commons-logging-1.0.4.jar
[windows-jdk10-m3.5.x_build] [INFO] Downloading: https://repo.maven.apache.org/maven2/org/apache/maven/doxia/doxia-integration-tools/1.6/doxia-integration-tools-1.6.jar
[windows-jdk10-m3.5.x_build] [INFO] Downloaded: https://repo.maven.apache.org/maven2/commons-logging/commons-logging/1.0.4/commons-logging-1.0.4.jar (38 kB at 1.9 MB/s)
[windows-jdk10-m3.5.x_build] [INFO] Downloading: https://repo.maven.apache.org/maven2/commons-io/commons-io/1.4/commons-io-1.4.jar
[windows-jdk10-m3.5.x_build] [INFO] Downloaded: https://repo.maven.apache.org/maven2/commons-digester/commons-digester/1.6/commons-digester-1.6.jar (168 kB at 6.7 MB/s)
[windows-jdk10-m3.5.x_build] [INFO] Downloading: https://repo.maven.apache.org/maven2/org/codehaus/plexus/plexus-resources/1.1.0/plexus-resources-1.1.0.jar
[windows-jdk10-m3.5.x_build] [INFO] Downloaded: https://repo.maven.apache.org/maven2/commons-io/commons-io/1.4/commons-io-1.4.jar (109 kB at 2.2 MB/s)
[windows-jdk10-m3.5.x_build] [INFO] Downloading: https://repo.maven.apache.org/maven2/com/puppycrawl/tools/checkstyle/6.18/checkstyle-6.18.jar
[windows-jdk10-m3.5.x_build] [INFO] Downloaded: https://repo.maven.apache.org/maven2/org/apache/maven/doxia/doxia-core/1.2/doxia-core-1.2.jar (154 kB at 3.0 MB/s)
[windows-jdk10-m3.5.x_build] [INFO] Downloading: https://repo.maven.apache.org/maven2/antlr/antlr/2.7.7/antlr-2.7.7.jar
[windows-jdk10-m3.5.x_build] [INFO] Downloaded: https://repo.maven.apache.org/maven2/antlr/antlr/2.7.7/antlr-2.7.7.jar (445 kB at 3.5 MB/s)
[windows-jdk10-m3.5.x_build] [INFO] Downloading: https://repo.maven.apache.org/maven2/org/antlr/antlr4-runtime/4.5.3/antlr4-runtime-4.5.3.jar
[windows-jdk10-m3.5.x_build] [INFO] Downloaded: https://repo.maven.apache.org/maven2/com/puppycrawl/tools/checkstyle/6.18/checkstyle-6.18.jar (1.2 MB at 7.0 MB/s)
[windows-jdk10-m3.5.x_build] [INFO] Downloading: https://repo.maven.apache.org/maven2/commons-beanutils/commons-beanutils/1.9.2/commons-beanutils-1.9.2.jar
[windows-jdk10-m3.5.x_build] [INFO] Downloaded: https://repo.maven.apache.org/maven2/org/apache/maven/shared/maven-shared-resources/2/maven-shared-resources-2.jar (13 kB at 66 kB/s)
[windows-jdk10-m3.5.x_build] [INFO] Downloading: https://repo.maven.apache.org/maven2/commons-cli/commons-cli/1.3.1/commons-cli-1.3.1.jar
[windows-jdk10-m3.5.x_build] [INFO] Downloaded: https://repo.maven.apache.org/maven2/org/apache/maven/doxia/doxia-integration-tools/1.6/doxia-integration-tools-1.6.jar (45 kB at 224 kB/s)
[windows-jdk10-m3.5.x_build] [INFO] Downloading: https://repo.maven.apache.org/maven2/com/google/guava/guava/19.0/guava-19.0.jar
[windows-jdk10-m3.5.x_build] [INFO] Downloaded: https://repo.maven.apache.org/maven2/org/codehaus/plexus/plexus-resources/1.1.0/plexus-resources-1.1.0.jar (23 kB at 114 kB/s)
[windows-jdk10-m3.5.x_build] [INFO] Downloading: https://repo.maven.apache.org/maven2/commons-lang/commons-lang/2.1/commons-lang-2.1.jar
[windows-jdk10-m3.5.x_build] [INFO] Downloaded: https://repo.maven.apache.org/maven2/commons-lang/commons-lang/2.1/commons-lang-2.1.jar (208 kB at 831 kB/s)
[windows-jdk10-m3.5.x_build] [INFO] Downloading: https://repo.maven.apache.org/maven2/javax/xml/bind/jaxb-api/2.3.0/jaxb-api-2.3.0.jar
[windows-jdk10-m3.5.x_build] [INFO] Downloaded: https://repo.maven.apache.org/maven2/org/antlr/antlr4-runtime/4.5.3/antlr4-runtime-4.5.3.jar (302 kB at 1.2 MB/s)
[windows-jdk10-m3.5.x_build] [INFO] Downloaded: https://repo.maven.apache.org/maven2/commons-cli/commons-cli/1.3.1/commons-cli-1.3.1.jar (53 kB at 203 kB/s)
[windows-jdk10-m3.5.x_build] [INFO] Downloaded: https://repo.maven.apache.org/maven2/javax/xml/bind/jaxb-api/2.3.0/jaxb-api-2.3.0.jar (126 kB at 471 kB/s)
[windows-jdk10-m3.5.x_build] [INFO] Downloaded: https://repo.maven.apache.org/maven2/commons-beanutils/commons-beanutils/1.9.2/commons-beanutils-1.9.2.jar (234 kB at 863 kB/s)
[windows-jdk10-m3.5.x_build] [INFO] Downloaded: https://repo.maven.apache.org/maven2/com/google/guava/guava/19.0/guava-19.0.jar (2.3 MB at 8.2 MB/s)
[windows-jdk9-m3.5.x_build] [INFO] 
[windows-jdk9-m3.5.x_build] [INFO] --- maven-failsafe-plugin:2.22.0:verify (integration-tests) @ maven-remote-resources-plugin ---
[windows-jdk9-m3.5.x_build] [ERROR] There are test failures.
[windows-jdk9-m3.5.x_build] 
[windows-jdk9-m3.5.x_build] Please refer to f:\jenkins\jenkins-slave\workspace\rces-plugin_MRRESOURCES-103-OWZ3HFZ43MS4CUVJZUVLTQDPH6VF24RFDOZDFCITEPHO3WVUHWJQ\windows-jdk9-m3.5.x_build\target\failsafe-reports for the individual test results.
[windows-jdk9-m3.5.x_build] Please refer to dump files (if any exist) [date]-jvmRun[N].dump, [date].dumpstream and [date]-jvmRun[N].dumpstream.
[windows-jdk9-m3.5.x_build] [INFO] 
[windows-jdk9-m3.5.x_build] [INFO] --- maven-invoker-plugin:3.1.0:verify (integration-test) @ maven-remote-resources-plugin ---
[windows-jdk9-m3.5.x_build] [INFO] -------------------------------------------------
[windows-jdk9-m3.5.x_build] [INFO] Build Summary:
[windows-jdk9-m3.5.x_build] [INFO]   Passed: 1, Failed: 0, Errors: 0, Skipped: 0
[windows-jdk9-m3.5.x_build] [INFO] -------------------------------------------------
[windows-jdk9-m3.5.x_build] [INFO] ------------------------------------------------------------------------
[windows-jdk9-m3.5.x_build] [INFO] BUILD SUCCESS
[windows-jdk9-m3.5.x_build] [INFO] ------------------------------------------------------------------------
[windows-jdk9-m3.5.x_build] [INFO] Total time: 02:17 min
[windows-jdk9-m3.5.x_build] [INFO] Finished at: 2018-08-03T07:00:38Z
[windows-jdk9-m3.5.x_build] [INFO] Final Memory: 45M/150M
[windows-jdk9-m3.5.x_build] [INFO] ------------------------------------------------------------------------
[windows-jdk9-m3.5.x_build] [INFO] [jenkins-event-spy] Generated F:\jenkins\jenkins-slave\workspace\rces-plugin_MRRESOURCES-103-OWZ3HFZ43MS4CUVJZUVLTQDPH6VF24RFDOZDFCITEPHO3WVUHWJQ@tmp\withMaven6bfd82ea\maven-spy-20180803-065820-8914021353190372444899.log
[windows-jdk10-m3.5.x_build] [INFO] 
[windows-jdk10-m3.5.x_build] [INFO] --- maven-failsafe-plugin:2.22.0:verify (integration-tests) @ maven-remote-resources-plugin ---
[windows-jdk10-m3.5.x_build] [ERROR] There are test failures.
[windows-jdk10-m3.5.x_build] 
[windows-jdk10-m3.5.x_build] Please refer to f:\jenkins\jenkins-slave\workspace\rces-plugin_MRRESOURCES-103-OWZ3HFZ43MS4CUVJZUVLTQDPH6VF24RFDOZDFCITEPHO3WVUHWJQ@2\windows-jdk10-m3.5.x_build\target\failsafe-reports for the individual test results.
[windows-jdk10-m3.5.x_build] Please refer to dump files (if any exist) [date]-jvmRun[N].dump, [date].dumpstream and [date]-jvmRun[N].dumpstream.
[windows-jdk10-m3.5.x_build] [INFO] 
[windows-jdk10-m3.5.x_build] [INFO] --- maven-invoker-plugin:3.1.0:verify (integration-test) @ maven-remote-resources-plugin ---
[windows-jdk10-m3.5.x_build] [INFO] -------------------------------------------------
[windows-jdk10-m3.5.x_build] [INFO] Build Summary:
[windows-jdk10-m3.5.x_build] [INFO]   Passed: 1, Failed: 0, Errors: 0, Skipped: 0
[windows-jdk10-m3.5.x_build] [INFO] -------------------------------------------------
[windows-jdk10-m3.5.x_build] [INFO] ------------------------------------------------------------------------
[windows-jdk10-m3.5.x_build] [INFO] BUILD SUCCESS
[windows-jdk10-m3.5.x_build] [INFO] ------------------------------------------------------------------------
[windows-jdk10-m3.5.x_build] [INFO] Total time: 02:16 min
[windows-jdk10-m3.5.x_build] [INFO] Finished at: 2018-08-03T07:00:38Z
[windows-jdk10-m3.5.x_build] [INFO] Final Memory: 44M/154M
[windows-jdk10-m3.5.x_build] [INFO] ------------------------------------------------------------------------
[windows-jdk10-m3.5.x_build] [INFO] [jenkins-event-spy] Generated F:\jenkins\jenkins-slave\workspace\rces-plugin_MRRESOURCES-103-OWZ3HFZ43MS4CUVJZUVLTQDPH6VF24RFDOZDFCITEPHO3WVUHWJQ@2@tmp\withMaven507ff9be\maven-spy-20180803-065822-12512324312990684594222.log
[Pipeline] [windows-jdk9-m3.5.x_build] }
[Pipeline] [windows-jdk9-m3.5.x_build] // dir
[Pipeline] [windows-jdk9-m3.5.x_build] }
[windows-jdk9-m3.5.x_build] [withMaven] artifactsPublisher - Archive artifact windows-jdk9-m3.5.x_build\pom.xml under org\apache\maven\plugins\maven-remote-resources-plugin\1.6-SNAPSHOT\maven-remote-resources-plugin-1.6-SNAPSHOT.pom
[windows-jdk9-m3.5.x_build] [withMaven] artifactsPublisher - Archive artifact windows-jdk9-m3.5.x_build\target\maven-remote-resources-plugin-1.6-SNAPSHOT.jar under org\apache\maven\plugins\maven-remote-resources-plugin\1.6-SNAPSHOT\maven-remote-resources-plugin-1.6-SNAPSHOT.jar
[windows-jdk9-m3.5.x_build] [withMaven] invokerPublisher - Archive invoker results for Maven artifact MavenArtifact{org.apache.maven.plugins:maven-remote-resources-plugin::1.6-SNAPSHOT(version: 1.6-SNAPSHOT, snapshot:false) } generated by PluginInvocation{org.apache.maven.plugins:maven-invoker-plugin:3.1.0@integration-test  integration-test}: windows-jdk9-m3.5.x_build\target\invoker-reports\*.xml
[windows-jdk9-m3.5.x_build] performing MavenInvokerRecorder, reportsFilenamePattern:'**/windows-jdk9-m3.5.x_build\target\invoker-reports/BUILD*.xml', invokerBuildDir:'**/windows-jdk9-m3.5.x_build\target\it'
[windows-jdk9-m3.5.x_build] Found reports:[f:\jenkins\jenkins-slave\workspace\rces-plugin_MRRESOURCES-103-OWZ3HFZ43MS4CUVJZUVLTQDPH6VF24RFDOZDFCITEPHO3WVUHWJQ\windows-jdk9-m3.5.x_build\target\invoker-reports\BUILD-maven-remote-resources-test.xml]
[windows-jdk9-m3.5.x_build] Found logs:[f:\jenkins\jenkins-slave\workspace\rces-plugin_MRRESOURCES-103-OWZ3HFZ43MS4CUVJZUVLTQDPH6VF24RFDOZDFCITEPHO3WVUHWJQ\windows-jdk9-m3.5.x_build\target\it\maven-remote-resources-test\build.log]
[windows-jdk9-m3.5.x_build] Finished parsing Maven Invoker results (found 1)
[windows-jdk9-m3.5.x_build] [withMaven] junitPublisher - Archive test results for Maven artifact org.apache.maven.plugins:maven-remote-resources-plugin:1.6-SNAPSHOT generated by maven-surefire-plugin:test (default-test): windows-jdk9-m3.5.x_build\target\surefire-reports\*.xml
[windows-jdk9-m3.5.x_build] Recording test results
[windows-jdk9-m3.5.x_build] [withMaven] junitPublisher - Archive test results for Maven artifact org.apache.maven.plugins:maven-remote-resources-plugin:1.6-SNAPSHOT generated by maven-failsafe-plugin:integration-test (integration-tests): windows-jdk9-m3.5.x_build\target\failsafe-reports\*.xml
[windows-jdk9-m3.5.x_build] Recording test results
[windows-jdk9-m3.5.x_build] [withMaven] openTasksPublisher - Scan Tasks for Maven artifact org.apache.maven.plugins:maven-remote-resources-plugin:1.6-SNAPSHOT in source directory windows-jdk9-m3.5.x_build\src\main\java
[windows-jdk9-m3.5.x_build] [TASKS] Scanning folder 'f:\jenkins\jenkins-slave\workspace\rces-plugin_MRRESOURCES-103-OWZ3HFZ43MS4CUVJZUVLTQDPH6VF24RFDOZDFCITEPHO3WVUHWJQ' for files matching the pattern 'windows-jdk9-m3.5.x_build\src\main\java\**\*' - excludes: null
[windows-jdk9-m3.5.x_build] [TASKS] Found 3 files to scan for tasks
[windows-jdk9-m3.5.x_build] [TASKS] Found 2 open tasks.
[windows-jdk9-m3.5.x_build] Skipping warnings blame since pipelines do not have an SCM link.%n
[windows-jdk9-m3.5.x_build] [TASKS] Computing warning deltas based on reference build #21
[Pipeline] [windows-jdk10-m3.5.x_build] }
[Pipeline] [windows-jdk9-m3.5.x_build] // withMaven
[Pipeline] [windows-jdk10-m3.5.x_build] // dir
[windows-jdk7-m3.3.x_build] [INFO] Tests run: 1, Failures: 0, Errors: 0, Skipped: 0, Time elapsed: 13.448 s - in org.apache.maven.plugin.resources.remote.it.IT_RunOnlyAtExecutionRoot
[windows-jdk7-m3.3.x_build] [INFO] Running org.apache.maven.plugin.resources.remote.it.IT_SupplementalArtifact
[Pipeline] [windows-jdk9-m3.5.x_build] cleanWs
[windows-jdk9-m3.5.x_build] [WS-CLEANUP] Deleting project workspace...[WS-CLEANUP] done
[Pipeline] [windows-jdk10-m3.5.x_build] }
[windows-jdk10-m3.5.x_build] [withMaven] artifactsPublisher - Archive artifact windows-jdk10-m3.5.x_build\pom.xml under org\apache\maven\plugins\maven-remote-resources-plugin\1.6-SNAPSHOT\maven-remote-resources-plugin-1.6-SNAPSHOT.pom
[windows-jdk10-m3.5.x_build] [withMaven] artifactsPublisher - Archive artifact windows-jdk10-m3.5.x_build\target\maven-remote-resources-plugin-1.6-SNAPSHOT.jar under org\apache\maven\plugins\maven-remote-resources-plugin\1.6-SNAPSHOT\maven-remote-resources-plugin-1.6-SNAPSHOT.jar
[windows-jdk10-m3.5.x_build] [withMaven] invokerPublisher - Archive invoker results for Maven artifact MavenArtifact{org.apache.maven.plugins:maven-remote-resources-plugin::1.6-SNAPSHOT(version: 1.6-SNAPSHOT, snapshot:false) } generated by PluginInvocation{org.apache.maven.plugins:maven-invoker-plugin:3.1.0@integration-test  integration-test}: windows-jdk10-m3.5.x_build\target\invoker-reports\*.xml
[windows-jdk10-m3.5.x_build] performing MavenInvokerRecorder, reportsFilenamePattern:'**/windows-jdk10-m3.5.x_build\target\invoker-reports/BUILD*.xml', invokerBuildDir:'**/windows-jdk10-m3.5.x_build\target\it'
[windows-jdk10-m3.5.x_build] Found reports:[f:\jenkins\jenkins-slave\workspace\rces-plugin_MRRESOURCES-103-OWZ3HFZ43MS4CUVJZUVLTQDPH6VF24RFDOZDFCITEPHO3WVUHWJQ@2\windows-jdk10-m3.5.x_build\target\invoker-reports\BUILD-maven-remote-resources-test.xml]
[windows-jdk10-m3.5.x_build] Found logs:[f:\jenkins\jenkins-slave\workspace\rces-plugin_MRRESOURCES-103-OWZ3HFZ43MS4CUVJZUVLTQDPH6VF24RFDOZDFCITEPHO3WVUHWJQ@2\windows-jdk10-m3.5.x_build\target\it\maven-remote-resources-test\build.log]
[windows-jdk10-m3.5.x_build] Finished parsing Maven Invoker results (found 1)
[windows-jdk10-m3.5.x_build] [withMaven] junitPublisher - Archive test results for Maven artifact org.apache.maven.plugins:maven-remote-resources-plugin:1.6-SNAPSHOT generated by maven-surefire-plugin:test (default-test): windows-jdk10-m3.5.x_build\target\surefire-reports\*.xml
[windows-jdk10-m3.5.x_build] Recording test results
[windows-jdk10-m3.5.x_build] [withMaven] junitPublisher - Archive test results for Maven artifact org.apache.maven.plugins:maven-remote-resources-plugin:1.6-SNAPSHOT generated by maven-failsafe-plugin:integration-test (integration-tests): windows-jdk10-m3.5.x_build\target\failsafe-reports\*.xml
[windows-jdk10-m3.5.x_build] Recording test results
[windows-jdk10-m3.5.x_build] [withMaven] openTasksPublisher - Scan Tasks for Maven artifact org.apache.maven.plugins:maven-remote-resources-plugin:1.6-SNAPSHOT in source directory windows-jdk10-m3.5.x_build\src\main\java
[windows-jdk10-m3.5.x_build] [TASKS] Scanning folder 'f:\jenkins\jenkins-slave\workspace\rces-plugin_MRRESOURCES-103-OWZ3HFZ43MS4CUVJZUVLTQDPH6VF24RFDOZDFCITEPHO3WVUHWJQ@2' for files matching the pattern 'windows-jdk10-m3.5.x_build\src\main\java\**\*' - excludes: null
[windows-jdk10-m3.5.x_build] [TASKS] Found 3 files to scan for tasks
[windows-jdk10-m3.5.x_build] [TASKS] Found 2 open tasks.
[windows-jdk10-m3.5.x_build] Skipping warnings blame since pipelines do not have an SCM link.%n
[windows-jdk10-m3.5.x_build] [TASKS] Computing warning deltas based on reference build #21
[Pipeline] [windows-jdk10-m3.5.x_build] // withMaven
[Pipeline] [windows-jdk9-m3.5.x_build] }
[Pipeline] [windows-jdk10-m3.5.x_build] cleanWs
[Pipeline] [windows-jdk9-m3.5.x_build] // stage
[Pipeline] [windows-jdk9-m3.5.x_build] }
[Pipeline] [windows-jdk9-m3.5.x_build] // node
[Pipeline] [windows-jdk9-m3.5.x_build] }
[windows-jdk10-m3.5.x_build] [WS-CLEANUP] Deleting project workspace...[WS-CLEANUP] done
[Pipeline] [windows-jdk10-m3.5.x_build] }
[Pipeline] [windows-jdk10-m3.5.x_build] // stage
[Pipeline] [windows-jdk10-m3.5.x_build] }
[Pipeline] [windows-jdk10-m3.5.x_build] // node
[Pipeline] [windows-jdk10-m3.5.x_build] }
[windows-jdk7-m3.3.x_build] [INFO] Tests run: 1, Failures: 0, Errors: 0, Skipped: 0, Time elapsed: 16.73 s - in org.apache.maven.plugin.resources.remote.it.IT_SupplementalArtifact
[windows-jdk7-m3.3.x_build] [INFO] 
[windows-jdk7-m3.3.x_build] [INFO] Results:
[windows-jdk7-m3.3.x_build] [INFO] 
[windows-jdk7-m3.3.x_build] [INFO] Tests run: 9, Failures: 0, Errors: 0, Skipped: 0
[windows-jdk7-m3.3.x_build] [INFO] 
[windows-jdk7-m3.3.x_build] [INFO] 
[windows-jdk7-m3.3.x_build] [INFO] --- maven-invoker-plugin:3.1.0:integration-test (integration-test) @ maven-remote-resources-plugin ---
[windows-jdk7-m3.3.x_build] [INFO] Building: maven-remote-resources-test\pom.xml
[windows-jdk7-m3.3.x_build] [INFO]           maven-remote-resources-test\pom.xml .............. SUCCESS (23.7 s)
[windows-jdk7-m3.3.x_build] [INFO] 
[windows-jdk7-m3.3.x_build] [INFO] --- maven-checkstyle-plugin:3.0.0:check (checkstyle-check) @ maven-remote-resources-plugin ---
[windows-jdk7-m3.3.x_build] [INFO] Downloading: https://repo.maven.apache.org/maven2/org/apache/maven/shared/maven-shared-resources/2/maven-shared-resources-2.pom
[windows-jdk7-m3.3.x_build] [INFO] Downloaded: https://repo.maven.apache.org/maven2/org/apache/maven/shared/maven-shared-resources/2/maven-shared-resources-2.pom (3 KB at 120.3 KB/sec)
[windows-jdk7-m3.3.x_build] [INFO] Downloading: https://repo.maven.apache.org/maven2/org/codehaus/plexus/plexus-utils/3.0.10/plexus-utils-3.0.10.pom
[windows-jdk7-m3.3.x_build] [INFO] Downloaded: https://repo.maven.apache.org/maven2/org/codehaus/plexus/plexus-utils/3.0.10/plexus-utils-3.0.10.pom (4 KB at 113.7 KB/sec)
[windows-jdk7-m3.3.x_build] [INFO] Downloading: https://repo.maven.apache.org/maven2/org/codehaus/plexus/plexus/3.3/plexus-3.3.pom
[windows-jdk7-m3.3.x_build] [INFO] Downloaded: https://repo.maven.apache.org/maven2/org/codehaus/plexus/plexus/3.3/plexus-3.3.pom (20 KB at 719.8 KB/sec)
[windows-jdk7-m3.3.x_build] [INFO] Downloading: https://repo.maven.apache.org/maven2/org/apache/maven/doxia/doxia-integration-tools/1.6/doxia-integration-tools-1.6.pom
[windows-jdk7-m3.3.x_build] [INFO] Downloaded: https://repo.maven.apache.org/maven2/org/apache/maven/doxia/doxia-integration-tools/1.6/doxia-integration-tools-1.6.pom (7 KB at 283.1 KB/sec)
[windows-jdk7-m3.3.x_build] [INFO] Downloading: https://repo.maven.apache.org/maven2/org/apache/maven/doxia/doxia-tools/3/doxia-tools-3.pom
[windows-jdk7-m3.3.x_build] [INFO] Downloaded: https://repo.maven.apache.org/maven2/org/apache/maven/doxia/doxia-tools/3/doxia-tools-3.pom (10 KB at 440.7 KB/sec)
[windows-jdk7-m3.3.x_build] [INFO] Downloading: https://repo.maven.apache.org/maven2/org/codehaus/plexus/plexus-resources/1.1.0/plexus-resources-1.1.0.pom
[windows-jdk7-m3.3.x_build] [INFO] Downloaded: https://repo.maven.apache.org/maven2/org/codehaus/plexus/plexus-resources/1.1.0/plexus-resources-1.1.0.pom (4 KB at 107.0 KB/sec)
[windows-jdk7-m3.3.x_build] [INFO] Downloading: https://repo.maven.apache.org/maven2/com/puppycrawl/tools/checkstyle/6.18/checkstyle-6.18.pom
[windows-jdk7-m3.3.x_build] [INFO] Downloaded: https://repo.maven.apache.org/maven2/com/puppycrawl/tools/checkstyle/6.18/checkstyle-6.18.pom (70 KB at 1734.1 KB/sec)
[windows-jdk7-m3.3.x_build] [INFO] Downloading: https://repo.maven.apache.org/maven2/antlr/antlr/2.7.7/antlr-2.7.7.pom
[windows-jdk7-m3.3.x_build] [INFO] Downloaded: https://repo.maven.apache.org/maven2/antlr/antlr/2.7.7/antlr-2.7.7.pom (632 B at 20.6 KB/sec)
[windows-jdk7-m3.3.x_build] [INFO] Downloading: https://repo.maven.apache.org/maven2/org/antlr/antlr4-runtime/4.5.3/antlr4-runtime-4.5.3.pom
[windows-jdk7-m3.3.x_build] [INFO] Downloaded: https://repo.maven.apache.org/maven2/org/antlr/antlr4-runtime/4.5.3/antlr4-runtime-4.5.3.pom (3 KB at 80.6 KB/sec)
[windows-jdk7-m3.3.x_build] [INFO] Downloading: https://repo.maven.apache.org/maven2/org/antlr/antlr4-master/4.5.3/antlr4-master-4.5.3.pom
[windows-jdk7-m3.3.x_build] [INFO] Downloaded: https://repo.maven.apache.org/maven2/org/antlr/antlr4-master/4.5.3/antlr4-master-4.5.3.pom (4 KB at 128.5 KB/sec)
[windows-jdk7-m3.3.x_build] [INFO] Downloading: https://repo.maven.apache.org/maven2/commons-beanutils/commons-beanutils/1.9.2/commons-beanutils-1.9.2.pom
[windows-jdk7-m3.3.x_build] [INFO] Downloaded: https://repo.maven.apache.org/maven2/commons-beanutils/commons-beanutils/1.9.2/commons-beanutils-1.9.2.pom (14 KB at 481.7 KB/sec)
[windows-jdk7-m3.3.x_build] [INFO] Downloading: https://repo.maven.apache.org/maven2/org/apache/commons/commons-parent/33/commons-parent-33.pom
[windows-jdk7-m3.3.x_build] [INFO] Downloaded: https://repo.maven.apache.org/maven2/org/apache/commons/commons-parent/33/commons-parent-33.pom (52 KB at 1440.1 KB/sec)
[windows-jdk7-m3.3.x_build] [INFO] Downloading: https://repo.maven.apache.org/maven2/commons-cli/commons-cli/1.3.1/commons-cli-1.3.1.pom
[windows-jdk7-m3.3.x_build] [INFO] Downloaded: https://repo.maven.apache.org/maven2/commons-cli/commons-cli/1.3.1/commons-cli-1.3.1.pom (11 KB at 350.0 KB/sec)
[windows-jdk7-m3.3.x_build] [INFO] Downloading: https://repo.maven.apache.org/maven2/com/google/guava/guava/19.0/guava-19.0.pom
[windows-jdk7-m3.3.x_build] [INFO] Downloaded: https://repo.maven.apache.org/maven2/com/google/guava/guava/19.0/guava-19.0.pom (7 KB at 236.9 KB/sec)
[windows-jdk7-m3.3.x_build] [INFO] Downloading: https://repo.maven.apache.org/maven2/com/google/guava/guava-parent/19.0/guava-parent-19.0.pom
[windows-jdk7-m3.3.x_build] [INFO] Downloaded: https://repo.maven.apache.org/maven2/com/google/guava/guava-parent/19.0/guava-parent-19.0.pom (10 KB at 344.5 KB/sec)
[windows-jdk7-m3.3.x_build] [INFO] Downloading: https://repo.maven.apache.org/maven2/org/sonatype/oss/oss-parent/7/oss-parent-7.pom
[windows-jdk7-m3.3.x_build] [INFO] Downloaded: https://repo.maven.apache.org/maven2/org/sonatype/oss/oss-parent/7/oss-parent-7.pom (5 KB at 174.5 KB/sec)
[windows-jdk7-m3.3.x_build] [INFO] Downloading: https://repo.maven.apache.org/maven2/org/apache/maven/shared/maven-shared-resources/2/maven-shared-resources-2.jar
[windows-jdk7-m3.3.x_build] [INFO] Downloading: https://repo.maven.apache.org/maven2/org/apache/maven/doxia/doxia-core/1.2/doxia-core-1.2.jar
[windows-jdk7-m3.3.x_build] [INFO] Downloading: https://repo.maven.apache.org/maven2/commons-digester/commons-digester/1.6/commons-digester-1.6.jar
[windows-jdk7-m3.3.x_build] [INFO] Downloading: https://repo.maven.apache.org/maven2/org/apache/maven/doxia/doxia-integration-tools/1.6/doxia-integration-tools-1.6.jar
[windows-jdk7-m3.3.x_build] [INFO] Downloading: https://repo.maven.apache.org/maven2/commons-logging/commons-logging/1.0.4/commons-logging-1.0.4.jar
[windows-jdk7-m3.3.x_build] [INFO] Downloaded: https://repo.maven.apache.org/maven2/commons-logging/commons-logging/1.0.4/commons-logging-1.0.4.jar (38 KB at 1197.5 KB/sec)
[windows-jdk7-m3.3.x_build] [INFO] Downloading: https://repo.maven.apache.org/maven2/commons-io/commons-io/1.4/commons-io-1.4.jar
[windows-jdk7-m3.3.x_build] [INFO] Downloaded: https://repo.maven.apache.org/maven2/org/apache/maven/doxia/doxia-core/1.2/doxia-core-1.2.jar (151 KB at 3344.6 KB/sec)
[windows-jdk7-m3.3.x_build] [INFO] Downloading: https://repo.maven.apache.org/maven2/org/codehaus/plexus/plexus-resources/1.1.0/plexus-resources-1.1.0.jar
[windows-jdk7-m3.3.x_build] [INFO] Downloaded: https://repo.maven.apache.org/maven2/commons-digester/commons-digester/1.6/commons-digester-1.6.jar (165 KB at 3500.0 KB/sec)
[windows-jdk7-m3.3.x_build] [INFO] Downloading: https://repo.maven.apache.org/maven2/com/puppycrawl/tools/checkstyle/6.18/checkstyle-6.18.jar
[windows-jdk7-m3.3.x_build] [INFO] Downloaded: https://repo.maven.apache.org/maven2/commons-io/commons-io/1.4/commons-io-1.4.jar (107 KB at 1054.3 KB/sec)
[windows-jdk7-m3.3.x_build] [INFO] Downloading: https://repo.maven.apache.org/maven2/antlr/antlr/2.7.7/antlr-2.7.7.jar
[windows-jdk7-m3.3.x_build] [INFO] Downloaded: https://repo.maven.apache.org/maven2/org/apache/maven/shared/maven-shared-resources/2/maven-shared-resources-2.jar (13 KB at 117.0 KB/sec)
[windows-jdk7-m3.3.x_build] [INFO] Downloading: https://repo.maven.apache.org/maven2/org/antlr/antlr4-runtime/4.5.3/antlr4-runtime-4.5.3.jar
[windows-jdk7-m3.3.x_build] [INFO] Downloaded: https://repo.maven.apache.org/maven2/com/puppycrawl/tools/checkstyle/6.18/checkstyle-6.18.jar (1132 KB at 8837.2 KB/sec)
[windows-jdk7-m3.3.x_build] [INFO] Downloading: https://repo.maven.apache.org/maven2/commons-beanutils/commons-beanutils/1.9.2/commons-beanutils-1.9.2.jar
[windows-jdk7-m3.3.x_build] [INFO] Downloaded: https://repo.maven.apache.org/maven2/antlr/antlr/2.7.7/antlr-2.7.7.jar (435 KB at 2958.2 KB/sec)
[windows-jdk7-m3.3.x_build] [INFO] Downloading: https://repo.maven.apache.org/maven2/commons-cli/commons-cli/1.3.1/commons-cli-1.3.1.jar
[windows-jdk7-m3.3.x_build] [INFO] Downloaded: https://repo.maven.apache.org/maven2/commons-beanutils/commons-beanutils/1.9.2/commons-beanutils-1.9.2.jar (229 KB at 1445.4 KB/sec)
[windows-jdk7-m3.3.x_build] [INFO] Downloading: https://repo.maven.apache.org/maven2/com/google/guava/guava/19.0/guava-19.0.jar
[windows-jdk7-m3.3.x_build] [INFO] Downloaded: https://repo.maven.apache.org/maven2/org/antlr/antlr4-runtime/4.5.3/antlr4-runtime-4.5.3.jar (296 KB at 1756.9 KB/sec)
[windows-jdk7-m3.3.x_build] [INFO] Downloading: https://repo.maven.apache.org/maven2/commons-lang/commons-lang/2.1/commons-lang-2.1.jar
[windows-jdk7-m3.3.x_build] [INFO] Downloaded: https://repo.maven.apache.org/maven2/commons-cli/commons-cli/1.3.1/commons-cli-1.3.1.jar (52 KB at 270.9 KB/sec)
[windows-jdk7-m3.3.x_build] [INFO] Downloaded: https://repo.maven.apache.org/maven2/commons-lang/commons-lang/2.1/commons-lang-2.1.jar (203 KB at 1004.2 KB/sec)
[windows-jdk7-m3.3.x_build] [INFO] Downloaded: https://repo.maven.apache.org/maven2/org/codehaus/plexus/plexus-resources/1.1.0/plexus-resources-1.1.0.jar (23 KB at 109.5 KB/sec)
[windows-jdk7-m3.3.x_build] [INFO] Downloaded: https://repo.maven.apache.org/maven2/com/google/guava/guava/19.0/guava-19.0.jar (2255 KB at 8981.7 KB/sec)
[windows-jdk7-m3.3.x_build] [INFO] Downloaded: https://repo.maven.apache.org/maven2/org/apache/maven/doxia/doxia-integration-tools/1.6/doxia-integration-tools-1.6.jar (44 KB at 154.6 KB/sec)
[windows-jdk7-m3.3.x_build] [INFO] 
[windows-jdk7-m3.3.x_build] [INFO] --- maven-failsafe-plugin:2.22.0:verify (integration-tests) @ maven-remote-resources-plugin ---
[windows-jdk7-m3.3.x_build] [INFO] 
[windows-jdk7-m3.3.x_build] [INFO] --- maven-invoker-plugin:3.1.0:verify (integration-test) @ maven-remote-resources-plugin ---
[windows-jdk7-m3.3.x_build] [INFO] -------------------------------------------------
[windows-jdk7-m3.3.x_build] [INFO] Build Summary:
[windows-jdk7-m3.3.x_build] [INFO]   Passed: 1, Failed: 0, Errors: 0, Skipped: 0
[windows-jdk7-m3.3.x_build] [INFO] -------------------------------------------------
[windows-jdk7-m3.3.x_build] [INFO] ------------------------------------------------------------------------
[windows-jdk7-m3.3.x_build] [INFO] BUILD SUCCESS
[windows-jdk7-m3.3.x_build] [INFO] ------------------------------------------------------------------------
[windows-jdk7-m3.3.x_build] [INFO] Total time: 03:30 min
[windows-jdk7-m3.3.x_build] [INFO] Finished at: 2018-08-03T00:01:32-07:00
[windows-jdk7-m3.3.x_build] [INFO] Final Memory: 49M/382M
[windows-jdk7-m3.3.x_build] [INFO] ------------------------------------------------------------------------
[windows-jdk7-m3.3.x_build] [INFO] [jenkins-event-spy] Generated F:\jenkins\jenkins-slave\workspace\rces-plugin_MRRESOURCES-103-OWZ3HFZ43MS4CUVJZUVLTQDPH6VF24RFDOZDFCITEPHO3WVUHWJQ@tmp\withMavenc362b683\maven-spy-20180802-235801-1725030466303990368574.log
[windows-jdk7-m3.3.x_build] Picked up JAVA_TOOL_OPTIONS: -Dmaven.ext.class.path="f:\jenkins\jenkins-slave\workspace\rces-plugin_MRRESOURCES-103-OWZ3HFZ43MS4CUVJZUVLTQDPH6VF24RFDOZDFCITEPHO3WVUHWJQ@tmp\withMavenc362b683\pipeline-maven-spy.jar" -Dorg.jenkinsci.plugins.pipeline.maven.reportsFolder="f:\jenkins\jenkins-slave\workspace\rces-plugin_MRRESOURCES-103-OWZ3HFZ43MS4CUVJZUVLTQDPH6VF24RFDOZDFCITEPHO3WVUHWJQ@tmp\withMavenc362b683" 
[Pipeline] [windows-jdk7-m3.3.x_build] }
[Pipeline] [windows-jdk7-m3.3.x_build] // dir
[Pipeline] [windows-jdk7-m3.3.x_build] }
[windows-jdk7-m3.3.x_build] [withMaven] artifactsPublisher - Archive artifact windows-jdk7-m3.3.x_build\pom.xml under org\apache\maven\plugins\maven-remote-resources-plugin\1.6-SNAPSHOT\maven-remote-resources-plugin-1.6-SNAPSHOT.pom
[windows-jdk7-m3.3.x_build] [withMaven] artifactsPublisher - Archive artifact windows-jdk7-m3.3.x_build\target\maven-remote-resources-plugin-1.6-SNAPSHOT.jar under org\apache\maven\plugins\maven-remote-resources-plugin\1.6-SNAPSHOT\maven-remote-resources-plugin-1.6-SNAPSHOT.jar
[windows-jdk7-m3.3.x_build] [withMaven] invokerPublisher - Archive invoker results for Maven artifact MavenArtifact{org.apache.maven.plugins:maven-remote-resources-plugin::1.6-SNAPSHOT(version: 1.6-SNAPSHOT, snapshot:false) } generated by PluginInvocation{org.apache.maven.plugins:maven-invoker-plugin:3.1.0@integration-test  integration-test}: windows-jdk7-m3.3.x_build\target\invoker-reports\*.xml
[windows-jdk7-m3.3.x_build] performing MavenInvokerRecorder, reportsFilenamePattern:'**/windows-jdk7-m3.3.x_build\target\invoker-reports/BUILD*.xml', invokerBuildDir:'**/windows-jdk7-m3.3.x_build\target\it'
[windows-jdk7-m3.3.x_build] Found reports:[f:\jenkins\jenkins-slave\workspace\rces-plugin_MRRESOURCES-103-OWZ3HFZ43MS4CUVJZUVLTQDPH6VF24RFDOZDFCITEPHO3WVUHWJQ\windows-jdk7-m3.3.x_build\target\invoker-reports\BUILD-maven-remote-resources-test.xml]
[windows-jdk7-m3.3.x_build] Found logs:[f:\jenkins\jenkins-slave\workspace\rces-plugin_MRRESOURCES-103-OWZ3HFZ43MS4CUVJZUVLTQDPH6VF24RFDOZDFCITEPHO3WVUHWJQ\windows-jdk7-m3.3.x_build\target\it\maven-remote-resources-test\build.log]
[windows-jdk7-m3.3.x_build] Finished parsing Maven Invoker results (found 1)
[windows-jdk7-m3.3.x_build] [withMaven] junitPublisher - Archive test results for Maven artifact org.apache.maven.plugins:maven-remote-resources-plugin:1.6-SNAPSHOT generated by maven-surefire-plugin:test (default-test): windows-jdk7-m3.3.x_build\target\surefire-reports\*.xml
[windows-jdk7-m3.3.x_build] Recording test results
[windows-jdk7-m3.3.x_build] [withMaven] junitPublisher - Archive test results for Maven artifact org.apache.maven.plugins:maven-remote-resources-plugin:1.6-SNAPSHOT generated by maven-failsafe-plugin:integration-test (integration-tests): windows-jdk7-m3.3.x_build\target\failsafe-reports\*.xml
[windows-jdk7-m3.3.x_build] Recording test results
[windows-jdk7-m3.3.x_build] [withMaven] openTasksPublisher - Scan Tasks for Maven artifact org.apache.maven.plugins:maven-remote-resources-plugin:1.6-SNAPSHOT in source directory windows-jdk7-m3.3.x_build\src\main\java
[windows-jdk7-m3.3.x_build] [TASKS] Scanning folder 'f:\jenkins\jenkins-slave\workspace\rces-plugin_MRRESOURCES-103-OWZ3HFZ43MS4CUVJZUVLTQDPH6VF24RFDOZDFCITEPHO3WVUHWJQ' for files matching the pattern 'windows-jdk7-m3.3.x_build\src\main\java\**\*' - excludes: null
[windows-jdk7-m3.3.x_build] [TASKS] Found 3 files to scan for tasks
[windows-jdk7-m3.3.x_build] [TASKS] Found 2 open tasks.
[windows-jdk7-m3.3.x_build] Skipping warnings blame since pipelines do not have an SCM link.%n
[windows-jdk7-m3.3.x_build] [TASKS] Computing warning deltas based on reference build #21
[Pipeline] [windows-jdk7-m3.3.x_build] // withMaven
[Pipeline] [windows-jdk7-m3.3.x_build] cleanWs
[windows-jdk7-m3.3.x_build] [WS-CLEANUP] Deleting project workspace...[WS-CLEANUP] done
[Pipeline] [windows-jdk7-m3.3.x_build] }
[Pipeline] [windows-jdk7-m3.3.x_build] // stage
[Pipeline] [windows-jdk7-m3.3.x_build] }
[Pipeline] [windows-jdk7-m3.3.x_build] // node
[Pipeline] [windows-jdk7-m3.3.x_build] }
[Pipeline] // parallel
[Pipeline] stage
[Pipeline] { (Notifications)
[Pipeline] echo
Build result: UNSTABLE
[Pipeline] jiraIssueSelector
[Pipeline] emailext
Mime
  • Unnamed multipart/mixed (inline, None, 0 bytes)
View raw message