maven-notifications mailing list archives

Site index · List index
Message view « Date » · « Thread »
Top « Date » · « Thread »
From Apache Jenkins Server <jenk...@builds.apache.org>
Subject Build failed in Jenkins: Maven TLP » maven-install-plugin » MSHARED-695 #15
Date Wed, 08 Aug 2018 15:34:49 GMT
See https://builds.apache.org/job/maven-box/job/maven-install-plugin/job/MSHARED-695/15/

Changes:

* Based on moving the checksum generation to deploy plugin this test can
* Based on moving the checksum generation to deploy plugin this test can
* Based on moving the checksum generation to deploy plugin this test can
* Based on moving the checksum generation to deploy plugin this test can
* Based on moving the checksum generation to deploy plugin this test can
* Based on moving the checksum generation to deploy plugin this test can
* Based on moving the checksum generation to deploy plugin this test can
* Based on moving the checksum generation to deploy plugin this test can
* Based on moving the checksum generation to deploy plugin this test can
* Based on moving the checksum generation to deploy plugin this test can
* Based on moving the checksum generation to deploy plugin this test can
* Based on moving the checksum generation to deploy plugin this test can
* Based on moving the checksum generation to deploy plugin this test can

All tests passed

Build log:
[...truncated 4.51 MB...]
[windows-jdk9-m3.5.x_build] [INFO] run post-build script verify.groovy
[windows-jdk9-m3.5.x_build] [INFO]           no-main-artifact-2\pom.xml ....................... SUCCESS (6.6 s)
[windows-jdk9-m3.5.x_build] [INFO] Building: non-changed-artifact\pom.xml
[windows-jdk7-m3.2.x_build] [INFO] Downloaded: https://repo.maven.apache.org/maven2/com/google/guava/guava-parent/19.0/guava-parent-19.0.pom (10 KB at 419.4 KB/sec)
[windows-jdk7-m3.2.x_build] [INFO] Downloading: https://repo.maven.apache.org/maven2/org/sonatype/oss/oss-parent/7/oss-parent-7.pom
[windows-jdk7-m3.2.x_build] [INFO] Downloaded: https://repo.maven.apache.org/maven2/org/sonatype/oss/oss-parent/7/oss-parent-7.pom (5 KB at 336.5 KB/sec)
[windows-jdk7-m3.2.x_build] [INFO] Downloading: https://repo.maven.apache.org/maven2/org/apache/maven/shared/maven-shared-resources/2/maven-shared-resources-2.jar
[windows-jdk7-m3.2.x_build] [INFO] Downloading: https://repo.maven.apache.org/maven2/org/apache/maven/doxia/doxia-core/1.2/doxia-core-1.2.jar
[windows-jdk7-m3.2.x_build] [INFO] Downloading: https://repo.maven.apache.org/maven2/commons-logging/commons-logging/1.0.4/commons-logging-1.0.4.jar
[windows-jdk7-m3.2.x_build] [INFO] Downloading: https://repo.maven.apache.org/maven2/org/apache/maven/doxia/doxia-integration-tools/1.6/doxia-integration-tools-1.6.jar
[windows-jdk7-m3.2.x_build] [INFO] Downloading: https://repo.maven.apache.org/maven2/commons-digester/commons-digester/1.6/commons-digester-1.6.jar
[windows-jdk7-m3.2.x_build] [INFO] Downloaded: https://repo.maven.apache.org/maven2/commons-logging/commons-logging/1.0.4/commons-logging-1.0.4.jar (38 KB at 1687.5 KB/sec)
[windows-jdk7-m3.2.x_build] [INFO] Downloading: https://repo.maven.apache.org/maven2/commons-io/commons-io/1.4/commons-io-1.4.jar
[windows-jdk7-m3.2.x_build] [INFO] Downloaded: https://repo.maven.apache.org/maven2/org/apache/maven/doxia/doxia-core/1.2/doxia-core-1.2.jar (151 KB at 4300.3 KB/sec)
[windows-jdk7-m3.2.x_build] [INFO] Downloading: https://repo.maven.apache.org/maven2/org/codehaus/plexus/plexus-resources/1.1.0/plexus-resources-1.1.0.jar
[windows-jdk7-m3.2.x_build] [INFO] Downloaded: https://repo.maven.apache.org/maven2/commons-digester/commons-digester/1.6/commons-digester-1.6.jar (165 KB at 4328.9 KB/sec)
[windows-jdk7-m3.2.x_build] [INFO] Downloading: https://repo.maven.apache.org/maven2/com/puppycrawl/tools/checkstyle/6.18/checkstyle-6.18.jar
[windows-jdk7-m3.2.x_build] [INFO] Downloaded: https://repo.maven.apache.org/maven2/commons-io/commons-io/1.4/commons-io-1.4.jar (107 KB at 1298.6 KB/sec)
[windows-jdk7-m3.2.x_build] [INFO] Downloading: https://repo.maven.apache.org/maven2/antlr/antlr/2.7.7/antlr-2.7.7.jar
[windows-jdk7-m3.2.x_build] [INFO] Downloaded: https://repo.maven.apache.org/maven2/com/puppycrawl/tools/checkstyle/6.18/checkstyle-6.18.jar (1132 KB at 10982.2 KB/sec)
[windows-jdk7-m3.2.x_build] [INFO] Downloading: https://repo.maven.apache.org/maven2/org/antlr/antlr4-runtime/4.5.3/antlr4-runtime-4.5.3.jar
[windows-jdk7-m3.2.x_build] [INFO] Downloaded: https://repo.maven.apache.org/maven2/org/apache/maven/shared/maven-shared-resources/2/maven-shared-resources-2.jar (13 KB at 122.6 KB/sec)
[windows-jdk7-m3.2.x_build] [INFO] Downloading: https://repo.maven.apache.org/maven2/commons-beanutils/commons-beanutils/1.9.2/commons-beanutils-1.9.2.jar
[windows-jdk7-m3.2.x_build] [INFO] Downloaded: https://repo.maven.apache.org/maven2/antlr/antlr/2.7.7/antlr-2.7.7.jar (435 KB at 4102.4 KB/sec)
[windows-jdk7-m3.2.x_build] [INFO] Downloading: https://repo.maven.apache.org/maven2/commons-cli/commons-cli/1.3.1/commons-cli-1.3.1.jar
[windows-jdk7-m3.2.x_build] [INFO] Downloaded: https://repo.maven.apache.org/maven2/commons-cli/commons-cli/1.3.1/commons-cli-1.3.1.jar (52 KB at 389.1 KB/sec)
[windows-jdk7-m3.2.x_build] [INFO] Downloading: https://repo.maven.apache.org/maven2/com/google/guava/guava/19.0/guava-19.0.jar
[windows-jdk7-m3.2.x_build] [INFO] Downloaded: https://repo.maven.apache.org/maven2/org/antlr/antlr4-runtime/4.5.3/antlr4-runtime-4.5.3.jar (296 KB at 2078.6 KB/sec)
[windows-jdk7-m3.2.x_build] [INFO] Downloading: https://repo.maven.apache.org/maven2/commons-lang/commons-lang/2.1/commons-lang-2.1.jar
[windows-jdk7-m3.2.x_build] [INFO] Downloaded: https://repo.maven.apache.org/maven2/commons-beanutils/commons-beanutils/1.9.2/commons-beanutils-1.9.2.jar (229 KB at 1087.5 KB/sec)
[windows-jdk7-m3.2.x_build] [INFO] Downloaded: https://repo.maven.apache.org/maven2/org/apache/maven/doxia/doxia-integration-tools/1.6/doxia-integration-tools-1.6.jar (44 KB at 202.7 KB/sec)
[windows-jdk7-m3.2.x_build] [INFO] Downloaded: https://repo.maven.apache.org/maven2/commons-lang/commons-lang/2.1/commons-lang-2.1.jar (203 KB at 897.6 KB/sec)
[windows-jdk7-m3.2.x_build] [INFO] Downloaded: https://repo.maven.apache.org/maven2/com/google/guava/guava/19.0/guava-19.0.jar (2255 KB at 9887.8 KB/sec)
[windows-jdk7-m3.2.x_build] [INFO] Downloaded: https://repo.maven.apache.org/maven2/org/codehaus/plexus/plexus-resources/1.1.0/plexus-resources-1.1.0.jar (23 KB at 93.7 KB/sec)
[windows-jdk7-m3.2.x_build] [INFO] 
[windows-jdk7-m3.2.x_build] [INFO] --- maven-invoker-plugin:3.0.1:verify (integration-test) @ maven-install-plugin ---
[windows-jdk7-m3.2.x_build] [INFO] -------------------------------------------------
[windows-jdk7-m3.2.x_build] [INFO] Build Summary:
[windows-jdk7-m3.2.x_build] [INFO]   Passed: 25, Failed: 5, Errors: 0, Skipped: 0
[windows-jdk7-m3.2.x_build] [INFO] -------------------------------------------------
[windows-jdk7-m3.2.x_build] [ERROR] The following builds failed:
[windows-jdk7-m3.2.x_build] [ERROR] *  attach-jar-checksum\pom.xml
[windows-jdk7-m3.2.x_build] [ERROR] *  jar-sources-javadoc\pom.xml
[windows-jdk7-m3.2.x_build] [ERROR] *  local-repo-override-with-checksum-generatePom\pom.xml
[windows-jdk7-m3.2.x_build] [ERROR] *  local-repo-override-with-checksum\pom.xml
[windows-jdk7-m3.2.x_build] [ERROR] *  pom-checksum\pom.xml
[windows-jdk7-m3.2.x_build] [INFO] -------------------------------------------------
[windows-jdk7-m3.2.x_build] [INFO] ------------------------------------------------------------------------
[windows-jdk7-m3.2.x_build] [INFO] BUILD FAILURE
[windows-jdk7-m3.2.x_build] [INFO] ------------------------------------------------------------------------
[windows-jdk7-m3.2.x_build] [INFO] Total time: 04:24 min
[windows-jdk7-m3.2.x_build] [INFO] Finished at: 2018-08-08T08:33:56-07:00
[windows-jdk7-m3.2.x_build] [INFO] Final Memory: 51M/487M
[windows-jdk7-m3.2.x_build] [INFO] ------------------------------------------------------------------------
[windows-jdk7-m3.2.x_build] [INFO] [jenkins-event-spy] Generated F:\jenkins\jenkins-slave\workspace\-install-plugin_MSHARED-695-WXNFDBWIFTYUDO42B6WX2QA7KRR2RELHUWDSVRN7HHIE2IPI3CEQ@2@tmp\withMavene353f145\maven-spy-20180808-082931-686735303805319364312.log
[windows-jdk7-m3.2.x_build] [ERROR] Failed to execute goal org.apache.maven.plugins:maven-invoker-plugin:3.0.1:verify (integration-test) on project maven-install-plugin: 5 builds failed. See console output above for details. -> [Help 1]
[windows-jdk7-m3.2.x_build] [ERROR] 
[windows-jdk7-m3.2.x_build] [ERROR] To see the full stack trace of the errors, re-run Maven with the -e switch.
[windows-jdk7-m3.2.x_build] [ERROR] Re-run Maven using the -X switch to enable full debug logging.
[windows-jdk7-m3.2.x_build] [ERROR] 
[windows-jdk7-m3.2.x_build] [ERROR] For more information about the errors and possible solutions, please read the following articles:
[windows-jdk7-m3.2.x_build] [ERROR] [Help 1] http://cwiki.apache.org/confluence/display/MAVEN/MojoFailureException
[windows-jdk7-m3.2.x_build] Picked up JAVA_TOOL_OPTIONS: -Dmaven.ext.class.path="f:\jenkins\jenkins-slave\workspace\-install-plugin_MSHARED-695-WXNFDBWIFTYUDO42B6WX2QA7KRR2RELHUWDSVRN7HHIE2IPI3CEQ@2@tmp\withMavene353f145\pipeline-maven-spy.jar" -Dorg.jenkinsci.plugins.pipeline.maven.reportsFolder="f:\jenkins\jenkins-slave\workspace\-install-plugin_MSHARED-695-WXNFDBWIFTYUDO42B6WX2QA7KRR2RELHUWDSVRN7HHIE2IPI3CEQ@2@tmp\withMavene353f145" 
[Pipeline] [windows-jdk7-m3.2.x_build] }
[Pipeline] [windows-jdk7-m3.2.x_build] // dir
[Pipeline] [windows-jdk7-m3.2.x_build] }
[windows-jdk7-m3.2.x_build] [withMaven] invokerPublisher - Archive invoker results for Maven artifact MavenArtifact{org.apache.maven.plugins:maven-install-plugin::3.0.0-SNAPSHOT(version: 3.0.0-SNAPSHOT, snapshot:false) } generated by PluginInvocation{org.apache.maven.plugins:maven-invoker-plugin:3.0.1@integration-test  integration-test}: windows-jdk7-m3.2.x_build\target\invoker-reports\*.xml
[windows-jdk7-m3.2.x_build] performing MavenInvokerRecorder, reportsFilenamePattern:'**/windows-jdk7-m3.2.x_build\target\invoker-reports/BUILD*.xml', invokerBuildDir:'**/windows-jdk7-m3.2.x_build\target\it'
[windows-jdk7-m3.2.x_build] Found reports:[f:\jenkins\jenkins-slave\workspace\-install-plugin_MSHARED-695-WXNFDBWIFTYUDO42B6WX2QA7KRR2RELHUWDSVRN7HHIE2IPI3CEQ@2\windows-jdk7-m3.2.x_build\target\invoker-reports\BUILD-MINSTALL-108.xml, f:\jenkins\jenkins-slave\workspace\-install-plugin_MSHARED-695-WXNFDBWIFTYUDO42B6WX2QA7KRR2RELHUWDSVRN7HHIE2IPI3CEQ@2\windows-jdk7-m3.2.x_build\target\invoker-reports\BUILD-MINSTALL-52.xml, f:\jenkins\jenkins-slave\workspace\-install-plugin_MSHARED-695-WXNFDBWIFTYUDO42B6WX2QA7KRR2RELHUWDSVRN7HHIE2IPI3CEQ@2\windows-jdk7-m3.2.x_build\target\invoker-reports\BUILD-MINSTALL-98.xml, f:\jenkins\jenkins-slave\workspace\-install-plugin_MSHARED-695-WXNFDBWIFTYUDO42B6WX2QA7KRR2RELHUWDSVRN7HHIE2IPI3CEQ@2\windows-jdk7-m3.2.x_build\target\invoker-reports\BUILD-MINSTALL-99.xml, f:\jenkins\jenkins-slave\workspace\-install-plugin_MSHARED-695-WXNFDBWIFTYUDO42B6WX2QA7KRR2RELHUWDSVRN7HHIE2IPI3CEQ@2\windows-jdk7-m3.2.x_build\target\invoker-reports\BUILD-attach-jar-checksum.xml, f:\jenkins\jenkins-slave\workspace\-install-plugin_MSHARED-695-WXNFDBWIFTYUDO42B6WX2QA7KRR2RELHUWDSVRN7HHIE2IPI3CEQ@2\windows-jdk7-m3.2.x_build\target\invoker-reports\BUILD-attach-release-jar.xml, f:\jenkins\jenkins-slave\workspace\-install-plugin_MSHARED-695-WXNFDBWIFTYUDO42B6WX2QA7KRR2RELHUWDSVRN7HHIE2IPI3CEQ@2\windows-jdk7-m3.2.x_build\target\invoker-reports\BUILD-gav-validation.xml, f:\jenkins\jenkins-slave\workspace\-install-plugin_MSHARED-695-WXNFDBWIFTYUDO42B6WX2QA7KRR2RELHUWDSVRN7HHIE2IPI3CEQ@2\windows-jdk7-m3.2.x_build\target\invoker-reports\BUILD-generate-pom-auto-1.xml, f:\jenkins\jenkins-slave\workspace\-install-plugin_MSHARED-695-WXNFDBWIFTYUDO42B6WX2QA7KRR2RELHUWDSVRN7HHIE2IPI3CEQ@2\windows-jdk7-m3.2.x_build\target\invoker-reports\BUILD-generate-pom-auto-2.xml, f:\jenkins\jenkins-slave\workspace\-install-plugin_MSHARED-695-WXNFDBWIFTYUDO42B6WX2QA7KRR2RELHUWDSVRN7HHIE2IPI3CEQ@2\windows-jdk7-m3.2.x_build\target\invoker-reports\BUILD-install-at-end-fail.xml, f:\jenkins\jenkins-slave\workspace\-install-plugin_MSHARED-695-WXNFDBWIFTYUDO42B6WX2QA7KRR2RELHUWDSVRN7HHIE2IPI3CEQ@2\windows-jdk7-m3.2.x_build\target\invoker-reports\BUILD-install-at-end-pass.xml, f:\jenkins\jenkins-slave\workspace\-install-plugin_MSHARED-695-WXNFDBWIFTYUDO42B6WX2QA7KRR2RELHUWDSVRN7HHIE2IPI3CEQ@2\windows-jdk7-m3.2.x_build\target\invoker-reports\BUILD-install-file-minstall-121-bundle.xml, f:\jenkins\jenkins-slave\workspace\-install-plugin_MSHARED-695-WXNFDBWIFTYUDO42B6WX2QA7KRR2RELHUWDSVRN7HHIE2IPI3CEQ@2\windows-jdk7-m3.2.x_build\target\invoker-reports\BUILD-install-file-minstall-121-java-source.xml, f:\jenkins\jenkins-slave\workspace\-install-plugin_MSHARED-695-WXNFDBWIFTYUDO42B6WX2QA7KRR2RELHUWDSVRN7HHIE2IPI3CEQ@2\windows-jdk7-m3.2.x_build\target\invoker-reports\BUILD-install-file-minstall-121-maven-archetype.xml, f:\jenkins\jenkins-slave\workspace\-install-plugin_MSHARED-695-WXNFDBWIFTYUDO42B6WX2QA7KRR2RELHUWDSVRN7HHIE2IPI3CEQ@2\windows-jdk7-m3.2.x_build\target\invoker-reports\BUILD-install-file-minstall-121-war.xml, f:\jenkins\jenkins-slave\workspace\-install-plugin_MSHARED-695-WXNFDBWIFTYUDO42B6WX2QA7KRR2RELHUWDSVRN7HHIE2IPI3CEQ@2\windows-jdk7-m3.2.x_build\target\invoker-reports\BUILD-install-file-minstall-121.xml, f:\jenkins\jenkins-slave\workspace\-install-plugin_MSHARED-695-WXNFDBWIFTYUDO42B6WX2QA7KRR2RELHUWDSVRN7HHIE2IPI3CEQ@2\windows-jdk7-m3.2.x_build\target\invoker-reports\BUILD-jar-sources-javadoc.xml, f:\jenkins\jenkins-slave\workspace\-install-plugin_MSHARED-695-WXNFDBWIFTYUDO42B6WX2QA7KRR2RELHUWDSVRN7HHIE2IPI3CEQ@2\windows-jdk7-m3.2.x_build\target\invoker-reports\BUILD-local-repo-override-with-checksum-generatePom.xml, f:\jenkins\jenkins-slave\workspace\-install-plugin_MSHARED-695-WXNFDBWIFTYUDO42B6WX2QA7KRR2RELHUWDSVRN7HHIE2IPI3CEQ@2\windows-jdk7-m3.2.x_build\target\invoker-reports\BUILD-local-repo-override-with-checksum.xml, f:\jenkins\jenkins-slave\workspace\-install-plugin_MSHARED-695-WXNFDBWIFTYUDO42B6WX2QA7KRR2RELHUWDSVRN7HHIE2IPI3CEQ@2\windows-jdk7-m3.2.x_build\target\invoker-reports\BUILD-local-repo-override.xml, f:\jenkins\jenkins-slave\workspace\-install-plugin_MSHARED-695-WXNFDBWIFTYUDO42B6WX2QA7KRR2RELHUWDSVRN7HHIE2IPI3CEQ@2\windows-jdk7-m3.2.x_build\target\invoker-reports\BUILD-minstall-55.xml, f:\jenkins\jenkins-slave\workspace\-install-plugin_MSHARED-695-WXNFDBWIFTYUDO42B6WX2QA7KRR2RELHUWDSVRN7HHIE2IPI3CEQ@2\windows-jdk7-m3.2.x_build\target\invoker-reports\BUILD-no-main-artifact-1.xml, f:\jenkins\jenkins-slave\workspace\-install-plugin_MSHARED-695-WXNFDBWIFTYUDO42B6WX2QA7KRR2RELHUWDSVRN7HHIE2IPI3CEQ@2\windows-jdk7-m3.2.x_build\target\invoker-reports\BUILD-no-main-artifact-2.xml, f:\jenkins\jenkins-slave\workspace\-install-plugin_MSHARED-695-WXNFDBWIFTYUDO42B6WX2QA7KRR2RELHUWDSVRN7HHIE2IPI3CEQ@2\windows-jdk7-m3.2.x_build\target\invoker-reports\BUILD-non-changed-artifact.xml, f:\jenkins\jenkins-slave\workspace\-install-plugin_MSHARED-695-WXNFDBWIFTYUDO42B6WX2QA7KRR2RELHUWDSVRN7HHIE2IPI3CEQ@2\windows-jdk7-m3.2.x_build\target\invoker-reports\BUILD-pom-checksum.xml, f:\jenkins\jenkins-slave\workspace\-install-plugin_MSHARED-695-WXNFDBWIFTYUDO42B6WX2QA7KRR2RELHUWDSVRN7HHIE2IPI3CEQ@2\windows-jdk7-m3.2.x_build\target\invoker-reports\BUILD-release-jar.xml, f:\jenkins\jenkins-slave\workspace\-install-plugin_MSHARED-695-WXNFDBWIFTYUDO42B6WX2QA7KRR2RELHUWDSVRN7HHIE2IPI3CEQ@2\windows-jdk7-m3.2.x_build\target\invoker-reports\BUILD-release-pom.xml, f:\jenkins\jenkins-slave\workspace\-install-plugin_MSHARED-695-WXNFDBWIFTYUDO42B6WX2QA7KRR2RELHUWDSVRN7HHIE2IPI3CEQ@2\windows-jdk7-m3.2.x_build\target\invoker-reports\BUILD-skip-install.xml, f:\jenkins\jenkins-slave\workspace\-install-plugin_MSHARED-695-WXNFDBWIFTYUDO42B6WX2QA7KRR2RELHUWDSVRN7HHIE2IPI3CEQ@2\windows-jdk7-m3.2.x_build\target\invoker-reports\BUILD-snapshot-jar.xml, f:\jenkins\jenkins-slave\workspace\-install-plugin_MSHARED-695-WXNFDBWIFTYUDO42B6WX2QA7KRR2RELHUWDSVRN7HHIE2IPI3CEQ@2\windows-jdk7-m3.2.x_build\target\invoker-reports\BUILD-snapshot-pom.xml]
[windows-jdk7-m3.2.x_build] Found logs:[f:\jenkins\jenkins-slave\workspace\-install-plugin_MSHARED-695-WXNFDBWIFTYUDO42B6WX2QA7KRR2RELHUWDSVRN7HHIE2IPI3CEQ@2\windows-jdk7-m3.2.x_build\target\it\MINSTALL-108\build.log, f:\jenkins\jenkins-slave\workspace\-install-plugin_MSHARED-695-WXNFDBWIFTYUDO42B6WX2QA7KRR2RELHUWDSVRN7HHIE2IPI3CEQ@2\windows-jdk7-m3.2.x_build\target\it\MINSTALL-52\build.log, f:\jenkins\jenkins-slave\workspace\-install-plugin_MSHARED-695-WXNFDBWIFTYUDO42B6WX2QA7KRR2RELHUWDSVRN7HHIE2IPI3CEQ@2\windows-jdk7-m3.2.x_build\target\it\MINSTALL-98\build.log, f:\jenkins\jenkins-slave\workspace\-install-plugin_MSHARED-695-WXNFDBWIFTYUDO42B6WX2QA7KRR2RELHUWDSVRN7HHIE2IPI3CEQ@2\windows-jdk7-m3.2.x_build\target\it\MINSTALL-99\build.log, f:\jenkins\jenkins-slave\workspace\-install-plugin_MSHARED-695-WXNFDBWIFTYUDO42B6WX2QA7KRR2RELHUWDSVRN7HHIE2IPI3CEQ@2\windows-jdk7-m3.2.x_build\target\it\attach-jar-checksum\build.log, f:\jenkins\jenkins-slave\workspace\-install-plugin_MSHARED-695-WXNFDBWIFTYUDO42B6WX2QA7KRR2RELHUWDSVRN7HHIE2IPI3CEQ@2\windows-jdk7-m3.2.x_build\target\it\attach-release-jar\build.log, f:\jenkins\jenkins-slave\workspace\-install-plugin_MSHARED-695-WXNFDBWIFTYUDO42B6WX2QA7KRR2RELHUWDSVRN7HHIE2IPI3CEQ@2\windows-jdk7-m3.2.x_build\target\it\gav-validation\build.log, f:\jenkins\jenkins-slave\workspace\-install-plugin_MSHARED-695-WXNFDBWIFTYUDO42B6WX2QA7KRR2RELHUWDSVRN7HHIE2IPI3CEQ@2\windows-jdk7-m3.2.x_build\target\it\generate-pom-auto-1\build.log, f:\jenkins\jenkins-slave\workspace\-install-plugin_MSHARED-695-WXNFDBWIFTYUDO42B6WX2QA7KRR2RELHUWDSVRN7HHIE2IPI3CEQ@2\windows-jdk7-m3.2.x_build\target\it\generate-pom-auto-2\build.log, f:\jenkins\jenkins-slave\workspace\-install-plugin_MSHARED-695-WXNFDBWIFTYUDO42B6WX2QA7KRR2RELHUWDSVRN7HHIE2IPI3CEQ@2\windows-jdk7-m3.2.x_build\target\it\install-at-end-fail\build.log, f:\jenkins\jenkins-slave\workspace\-install-plugin_MSHARED-695-WXNFDBWIFTYUDO42B6WX2QA7KRR2RELHUWDSVRN7HHIE2IPI3CEQ@2\windows-jdk7-m3.2.x_build\target\it\install-at-end-pass\build.log, f:\jenkins\jenkins-slave\workspace\-install-plugin_MSHARED-695-WXNFDBWIFTYUDO42B6WX2QA7KRR2RELHUWDSVRN7HHIE2IPI3CEQ@2\windows-jdk7-m3.2.x_build\target\it\install-file-minstall-121-bundle\build.log, f:\jenkins\jenkins-slave\workspace\-install-plugin_MSHARED-695-WXNFDBWIFTYUDO42B6WX2QA7KRR2RELHUWDSVRN7HHIE2IPI3CEQ@2\windows-jdk7-m3.2.x_build\target\it\install-file-minstall-121-java-source\build.log, f:\jenkins\jenkins-slave\workspace\-install-plugin_MSHARED-695-WXNFDBWIFTYUDO42B6WX2QA7KRR2RELHUWDSVRN7HHIE2IPI3CEQ@2\windows-jdk7-m3.2.x_build\target\it\install-file-minstall-121-maven-archetype\build.log, f:\jenkins\jenkins-slave\workspace\-install-plugin_MSHARED-695-WXNFDBWIFTYUDO42B6WX2QA7KRR2RELHUWDSVRN7HHIE2IPI3CEQ@2\windows-jdk7-m3.2.x_build\target\it\install-file-minstall-121-war\build.log, f:\jenkins\jenkins-slave\workspace\-install-plugin_MSHARED-695-WXNFDBWIFTYUDO42B6WX2QA7KRR2RELHUWDSVRN7HHIE2IPI3CEQ@2\windows-jdk7-m3.2.x_build\target\it\install-file-minstall-121\build.log, f:\jenkins\jenkins-slave\workspace\-install-plugin_MSHARED-695-WXNFDBWIFTYUDO42B6WX2QA7KRR2RELHUWDSVRN7HHIE2IPI3CEQ@2\windows-jdk7-m3.2.x_build\target\it\jar-sources-javadoc\build.log, f:\jenkins\jenkins-slave\workspace\-install-plugin_MSHARED-695-WXNFDBWIFTYUDO42B6WX2QA7KRR2RELHUWDSVRN7HHIE2IPI3CEQ@2\windows-jdk7-m3.2.x_build\target\it\local-repo-override-with-checksum-generatePom\build.log, f:\jenkins\jenkins-slave\workspace\-install-plugin_MSHARED-695-WXNFDBWIFTYUDO42B6WX2QA7KRR2RELHUWDSVRN7HHIE2IPI3CEQ@2\windows-jdk7-m3.2.x_build\target\it\local-repo-override-with-checksum\build.log, f:\jenkins\jenkins-slave\workspace\-install-plugin_MSHARED-695-WXNFDBWIFTYUDO42B6WX2QA7KRR2RELHUWDSVRN7HHIE2IPI3CEQ@2\windows-jdk7-m3.2.x_build\target\it\local-repo-override\build.log, f:\jenkins\jenkins-slave\workspace\-install-plugin_MSHARED-695-WXNFDBWIFTYUDO42B6WX2QA7KRR2RELHUWDSVRN7HHIE2IPI3CEQ@2\windows-jdk7-m3.2.x_build\target\it\minstall-55\build.log, f:\jenkins\jenkins-slave\workspace\-install-plugin_MSHARED-695-WXNFDBWIFTYUDO42B6WX2QA7KRR2RELHUWDSVRN7HHIE2IPI3CEQ@2\windows-jdk7-m3.2.x_build\target\it\no-main-artifact-1\build.log, f:\jenkins\jenkins-slave\workspace\-install-plugin_MSHARED-695-WXNFDBWIFTYUDO42B6WX2QA7KRR2RELHUWDSVRN7HHIE2IPI3CEQ@2\windows-jdk7-m3.2.x_build\target\it\no-main-artifact-2\build.log, f:\jenkins\jenkins-slave\workspace\-install-plugin_MSHARED-695-WXNFDBWIFTYUDO42B6WX2QA7KRR2RELHUWDSVRN7HHIE2IPI3CEQ@2\windows-jdk7-m3.2.x_build\target\it\non-changed-artifact\build.log, f:\jenkins\jenkins-slave\workspace\-install-plugin_MSHARED-695-WXNFDBWIFTYUDO42B6WX2QA7KRR2RELHUWDSVRN7HHIE2IPI3CEQ@2\windows-jdk7-m3.2.x_build\target\it\pom-checksum\build.log, f:\jenkins\jenkins-slave\workspace\-install-plugin_MSHARED-695-WXNFDBWIFTYUDO42B6WX2QA7KRR2RELHUWDSVRN7HHIE2IPI3CEQ@2\windows-jdk7-m3.2.x_build\target\it\release-jar\build.log, f:\jenkins\jenkins-slave\workspace\-install-plugin_MSHARED-695-WXNFDBWIFTYUDO42B6WX2QA7KRR2RELHUWDSVRN7HHIE2IPI3CEQ@2\windows-jdk7-m3.2.x_build\target\it\release-pom\build.log, f:\jenkins\jenkins-slave\workspace\-install-plugin_MSHARED-695-WXNFDBWIFTYUDO42B6WX2QA7KRR2RELHUWDSVRN7HHIE2IPI3CEQ@2\windows-jdk7-m3.2.x_build\target\it\skip-install\build.log, f:\jenkins\jenkins-slave\workspace\-install-plugin_MSHARED-695-WXNFDBWIFTYUDO42B6WX2QA7KRR2RELHUWDSVRN7HHIE2IPI3CEQ@2\windows-jdk7-m3.2.x_build\target\it\snapshot-jar\build.log, f:\jenkins\jenkins-slave\workspace\-install-plugin_MSHARED-695-WXNFDBWIFTYUDO42B6WX2QA7KRR2RELHUWDSVRN7HHIE2IPI3CEQ@2\windows-jdk7-m3.2.x_build\target\it\snapshot-pom\build.log]
[windows-jdk7-m3.2.x_build] Finished parsing Maven Invoker results (found 30)
[windows-jdk7-m3.2.x_build] [withMaven] junitPublisher - Archive test results for Maven artifact org.apache.maven.plugins:maven-install-plugin:3.0.0-SNAPSHOT generated by maven-surefire-plugin:test (default-test): windows-jdk7-m3.2.x_build\target\surefire-reports\*.xml
[windows-jdk7-m3.2.x_build] Recording test results
[windows-jdk7-m3.2.x_build] [withMaven] openTasksPublisher - Scan Tasks for Maven artifact org.apache.maven.plugins:maven-install-plugin:3.0.0-SNAPSHOT in source directory windows-jdk7-m3.2.x_build\src\main\java
[windows-jdk7-m3.2.x_build] [TASKS] Scanning folder 'f:\jenkins\jenkins-slave\workspace\-install-plugin_MSHARED-695-WXNFDBWIFTYUDO42B6WX2QA7KRR2RELHUWDSVRN7HHIE2IPI3CEQ@2' for files matching the pattern 'windows-jdk7-m3.2.x_build\src\main\java\**\*' - excludes: null
[windows-jdk7-m3.2.x_build] [TASKS] Found 3 files to scan for tasks
[windows-jdk7-m3.2.x_build] [TASKS] Found 0 open tasks.
[windows-jdk7-m3.2.x_build] Skipping warnings blame since pipelines do not have an SCM link.%n
[windows-jdk7-m3.2.x_build] [TASKS] Computing warning deltas based on reference build #12
[Pipeline] [windows-jdk7-m3.2.x_build] // withMaven
[Pipeline] [windows-jdk7-m3.2.x_build] cleanWs
[windows-jdk7-m3.2.x_build] [WS-CLEANUP] Deleting project workspace...[WS-CLEANUP] done
[Pipeline] [windows-jdk7-m3.2.x_build] cleanWs
[windows-jdk7-m3.2.x_build] [WS-CLEANUP] Deleting project workspace...[WS-CLEANUP] done
[Pipeline] [windows-jdk7-m3.2.x_build] }
[Pipeline] [windows-jdk7-m3.2.x_build] // stage
[Pipeline] [windows-jdk7-m3.2.x_build] }
[Pipeline] [windows-jdk7-m3.2.x_build] // node
[Pipeline] [windows-jdk7-m3.2.x_build] }
[windows-jdk7-m3.2.x_build] Failed in branch windows-jdk7-m3.2.x_build
[windows-jdk9-m3.5.x_build] [INFO] run post-build script verify.groovy
[windows-jdk9-m3.5.x_build] [INFO]           non-changed-artifact\pom.xml ..................... SUCCESS (13.8 s)
[windows-jdk9-m3.5.x_build] [INFO] Building: pom-checksum\pom.xml
[windows-jdk9-m3.5.x_build] [INFO] run pre-build script setup.bsh
[windows-jdk9-m3.5.x_build] [INFO] run post-build script verify.bsh
[windows-jdk9-m3.5.x_build] [INFO]           pom-checksum\pom.xml ............................. FAILED (5.5 s)
[windows-jdk9-m3.5.x_build] [INFO]   The post-build script did not succeed. f:\jenkins\jenkins-slave\workspace\-install-plugin_MSHARED-695-WXNFDBWIFTYUDO42B6WX2QA7KRR2RELHUWDSVRN7HHIE2IPI3CEQ\windows-jdk9-m3.5.x_build\target\local-repo\org\apache\maven\its\install\pc\test\1.0-SNAPSHOT\test-1.0-SNAPSHOT.pom.md5 (The system cannot find the file specified)
[windows-jdk9-m3.5.x_build] [INFO] Building: release-jar\pom.xml
[windows-jdk9-m3.5.x_build] [INFO] run pre-build script setup.bsh
[windows-jdk9-m3.5.x_build] [INFO] run post-build script verify.bsh
[windows-jdk9-m3.5.x_build] [INFO]           release-jar\pom.xml .............................. SUCCESS (6.3 s)
[windows-jdk9-m3.5.x_build] [INFO] Building: release-pom\pom.xml
[windows-jdk9-m3.5.x_build] [INFO] run pre-build script setup.bsh
[windows-jdk9-m3.5.x_build] [INFO] run post-build script verify.bsh
[windows-jdk9-m3.5.x_build] [INFO]           release-pom\pom.xml .............................. SUCCESS (5.4 s)
[windows-jdk9-m3.5.x_build] [INFO] Building: skip-install\pom.xml
[windows-jdk9-m3.5.x_build] [INFO] run pre-build script setup.bsh
[windows-jdk9-m3.5.x_build] [INFO] run post-build script verify.bsh
[windows-jdk9-m3.5.x_build] [INFO]           skip-install\pom.xml ............................. SUCCESS (6.4 s)
[windows-jdk9-m3.5.x_build] [INFO] Building: snapshot-jar\pom.xml
[windows-jdk9-m3.5.x_build] [INFO] run pre-build script setup.bsh
[windows-jdk9-m3.5.x_build] [INFO] run post-build script verify.bsh
[windows-jdk9-m3.5.x_build] [INFO]           snapshot-jar\pom.xml ............................. SUCCESS (6.2 s)
[windows-jdk9-m3.5.x_build] [INFO] Building: snapshot-pom\pom.xml
[windows-jdk9-m3.5.x_build] [INFO] run pre-build script setup.bsh
[windows-jdk9-m3.5.x_build] [INFO] run post-build script verify.bsh
[windows-jdk9-m3.5.x_build] [INFO]           snapshot-pom\pom.xml ............................. SUCCESS (5.6 s)
[windows-jdk9-m3.5.x_build] [INFO] 
[windows-jdk9-m3.5.x_build] [INFO] --- maven-checkstyle-plugin:3.0.0:check (checkstyle-check) @ maven-install-plugin ---
[windows-jdk9-m3.5.x_build] [INFO] Downloading: https://repo.maven.apache.org/maven2/org/apache/maven/shared/maven-shared-resources/2/maven-shared-resources-2.pom
[windows-jdk9-m3.5.x_build] [INFO] Downloaded: https://repo.maven.apache.org/maven2/org/apache/maven/shared/maven-shared-resources/2/maven-shared-resources-2.pom (3.0 kB at 114 kB/s)
[windows-jdk9-m3.5.x_build] [INFO] Downloading: https://repo.maven.apache.org/maven2/org/codehaus/plexus/plexus-utils/3.0.10/plexus-utils-3.0.10.pom
[windows-jdk9-m3.5.x_build] [INFO] Downloaded: https://repo.maven.apache.org/maven2/org/codehaus/plexus/plexus-utils/3.0.10/plexus-utils-3.0.10.pom (3.1 kB at 137 kB/s)
[windows-jdk9-m3.5.x_build] [INFO] Downloading: https://repo.maven.apache.org/maven2/org/codehaus/plexus/plexus/3.3/plexus-3.3.pom
[windows-jdk9-m3.5.x_build] [INFO] Downloaded: https://repo.maven.apache.org/maven2/org/codehaus/plexus/plexus/3.3/plexus-3.3.pom (20 kB at 711 kB/s)
[windows-jdk9-m3.5.x_build] [INFO] Downloading: https://repo.maven.apache.org/maven2/org/apache/maven/doxia/doxia-integration-tools/1.6/doxia-integration-tools-1.6.pom
[windows-jdk9-m3.5.x_build] [INFO] Downloaded: https://repo.maven.apache.org/maven2/org/apache/maven/doxia/doxia-integration-tools/1.6/doxia-integration-tools-1.6.pom (7.0 kB at 240 kB/s)
[windows-jdk9-m3.5.x_build] [INFO] Downloading: https://repo.maven.apache.org/maven2/org/apache/maven/doxia/doxia-tools/3/doxia-tools-3.pom
[windows-jdk9-m3.5.x_build] [INFO] Downloaded: https://repo.maven.apache.org/maven2/org/apache/maven/doxia/doxia-tools/3/doxia-tools-3.pom (9.9 kB at 414 kB/s)
[windows-jdk9-m3.5.x_build] [INFO] Downloading: https://repo.maven.apache.org/maven2/org/codehaus/plexus/plexus-resources/1.1.0/plexus-resources-1.1.0.pom
[windows-jdk9-m3.5.x_build] [INFO] Downloaded: https://repo.maven.apache.org/maven2/org/codehaus/plexus/plexus-resources/1.1.0/plexus-resources-1.1.0.pom (3.2 kB at 138 kB/s)
[windows-jdk9-m3.5.x_build] [INFO] Downloading: https://repo.maven.apache.org/maven2/com/puppycrawl/tools/checkstyle/6.18/checkstyle-6.18.pom
[windows-jdk9-m3.5.x_build] [INFO] Downloaded: https://repo.maven.apache.org/maven2/com/puppycrawl/tools/checkstyle/6.18/checkstyle-6.18.pom (71 kB at 2.2 MB/s)
[windows-jdk9-m3.5.x_build] [INFO] Downloading: https://repo.maven.apache.org/maven2/antlr/antlr/2.7.7/antlr-2.7.7.pom
[windows-jdk9-m3.5.x_build] [INFO] Downloaded: https://repo.maven.apache.org/maven2/antlr/antlr/2.7.7/antlr-2.7.7.pom (632 B at 23 kB/s)
[windows-jdk9-m3.5.x_build] [INFO] Downloading: https://repo.maven.apache.org/maven2/org/antlr/antlr4-runtime/4.5.3/antlr4-runtime-4.5.3.pom
[windows-jdk9-m3.5.x_build] [INFO] Downloaded: https://repo.maven.apache.org/maven2/org/antlr/antlr4-runtime/4.5.3/antlr4-runtime-4.5.3.pom (2.3 kB at 80 kB/s)
[windows-jdk9-m3.5.x_build] [INFO] Downloading: https://repo.maven.apache.org/maven2/org/antlr/antlr4-master/4.5.3/antlr4-master-4.5.3.pom
[windows-jdk9-m3.5.x_build] [INFO] Downloaded: https://repo.maven.apache.org/maven2/org/antlr/antlr4-master/4.5.3/antlr4-master-4.5.3.pom (3.7 kB at 127 kB/s)
[windows-jdk9-m3.5.x_build] [INFO] Downloading: https://repo.maven.apache.org/maven2/commons-beanutils/commons-beanutils/1.9.2/commons-beanutils-1.9.2.pom
[windows-jdk9-m3.5.x_build] [INFO] Downloaded: https://repo.maven.apache.org/maven2/commons-beanutils/commons-beanutils/1.9.2/commons-beanutils-1.9.2.pom (14 kB at 397 kB/s)
[windows-jdk9-m3.5.x_build] [INFO] Downloading: https://repo.maven.apache.org/maven2/org/apache/commons/commons-parent/33/commons-parent-33.pom
[windows-jdk9-m3.5.x_build] [INFO] Downloaded: https://repo.maven.apache.org/maven2/org/apache/commons/commons-parent/33/commons-parent-33.pom (53 kB at 1.3 MB/s)
[windows-jdk9-m3.5.x_build] [INFO] Downloading: https://repo.maven.apache.org/maven2/commons-cli/commons-cli/1.3.1/commons-cli-1.3.1.pom
[windows-jdk9-m3.5.x_build] [INFO] Downloaded: https://repo.maven.apache.org/maven2/commons-cli/commons-cli/1.3.1/commons-cli-1.3.1.pom (10 kB at 315 kB/s)
[windows-jdk9-m3.5.x_build] [INFO] Downloading: https://repo.maven.apache.org/maven2/com/google/guava/guava/19.0/guava-19.0.pom
[windows-jdk9-m3.5.x_build] [INFO] Downloaded: https://repo.maven.apache.org/maven2/com/google/guava/guava/19.0/guava-19.0.pom (6.8 kB at 219 kB/s)
[windows-jdk9-m3.5.x_build] [INFO] Downloading: https://repo.maven.apache.org/maven2/com/google/guava/guava-parent/19.0/guava-parent-19.0.pom
[windows-jdk9-m3.5.x_build] [INFO] Downloaded: https://repo.maven.apache.org/maven2/com/google/guava/guava-parent/19.0/guava-parent-19.0.pom (9.9 kB at 380 kB/s)
[windows-jdk9-m3.5.x_build] [INFO] Downloading: https://repo.maven.apache.org/maven2/org/sonatype/oss/oss-parent/7/oss-parent-7.pom
[windows-jdk9-m3.5.x_build] [INFO] Downloaded: https://repo.maven.apache.org/maven2/org/sonatype/oss/oss-parent/7/oss-parent-7.pom (4.8 kB at 166 kB/s)
[windows-jdk9-m3.5.x_build] [INFO] Downloading: https://repo.maven.apache.org/maven2/javax/xml/bind/jaxb-api/2.3.0/jaxb-api-2.3.0.pom
[windows-jdk9-m3.5.x_build] [INFO] Downloaded: https://repo.maven.apache.org/maven2/javax/xml/bind/jaxb-api/2.3.0/jaxb-api-2.3.0.pom (23 kB at 657 kB/s)
[windows-jdk9-m3.5.x_build] [INFO] Downloading: https://repo.maven.apache.org/maven2/javax/xml/bind/jaxb-api-parent/2.3.0/jaxb-api-parent-2.3.0.pom
[windows-jdk9-m3.5.x_build] [INFO] Downloaded: https://repo.maven.apache.org/maven2/javax/xml/bind/jaxb-api-parent/2.3.0/jaxb-api-parent-2.3.0.pom (5.6 kB at 226 kB/s)
[windows-jdk9-m3.5.x_build] [INFO] Downloading: https://repo.maven.apache.org/maven2/net/java/jvnet-parent/5/jvnet-parent-5.pom
[windows-jdk9-m3.5.x_build] [INFO] Downloaded: https://repo.maven.apache.org/maven2/net/java/jvnet-parent/5/jvnet-parent-5.pom (8.9 kB at 317 kB/s)
[windows-jdk9-m3.5.x_build] [INFO] Downloading: https://repo.maven.apache.org/maven2/org/apache/maven/shared/maven-shared-resources/2/maven-shared-resources-2.jar
[windows-jdk9-m3.5.x_build] [INFO] Downloading: https://repo.maven.apache.org/maven2/org/apache/maven/doxia/doxia-integration-tools/1.6/doxia-integration-tools-1.6.jar
[windows-jdk9-m3.5.x_build] [INFO] Downloading: https://repo.maven.apache.org/maven2/org/apache/maven/doxia/doxia-core/1.2/doxia-core-1.2.jar
[windows-jdk9-m3.5.x_build] [INFO] Downloading: https://repo.maven.apache.org/maven2/commons-logging/commons-logging/1.0.4/commons-logging-1.0.4.jar
[windows-jdk9-m3.5.x_build] [INFO] Downloading: https://repo.maven.apache.org/maven2/commons-digester/commons-digester/1.6/commons-digester-1.6.jar
[windows-jdk9-m3.5.x_build] [INFO] Downloaded: https://repo.maven.apache.org/maven2/commons-logging/commons-logging/1.0.4/commons-logging-1.0.4.jar (38 kB at 927 kB/s)
[windows-jdk9-m3.5.x_build] [INFO] Downloading: https://repo.maven.apache.org/maven2/commons-io/commons-io/1.4/commons-io-1.4.jar
[windows-jdk9-m3.5.x_build] [INFO] Downloaded: https://repo.maven.apache.org/maven2/commons-digester/commons-digester/1.6/commons-digester-1.6.jar (168 kB at 3.2 MB/s)
[windows-jdk9-m3.5.x_build] [INFO] Downloading: https://repo.maven.apache.org/maven2/org/codehaus/plexus/plexus-resources/1.1.0/plexus-resources-1.1.0.jar
[windows-jdk9-m3.5.x_build] [INFO] Downloaded: https://repo.maven.apache.org/maven2/org/apache/maven/doxia/doxia-core/1.2/doxia-core-1.2.jar (154 kB at 2.9 MB/s)
[windows-jdk9-m3.5.x_build] [INFO] Downloading: https://repo.maven.apache.org/maven2/com/puppycrawl/tools/checkstyle/6.18/checkstyle-6.18.jar
[windows-jdk9-m3.5.x_build] [INFO] Downloaded: https://repo.maven.apache.org/maven2/commons-io/commons-io/1.4/commons-io-1.4.jar (109 kB at 1.2 MB/s)
[windows-jdk9-m3.5.x_build] [INFO] Downloading: https://repo.maven.apache.org/maven2/antlr/antlr/2.7.7/antlr-2.7.7.jar
[windows-jdk9-m3.5.x_build] [INFO] Downloaded: https://repo.maven.apache.org/maven2/org/apache/maven/shared/maven-shared-resources/2/maven-shared-resources-2.jar (13 kB at 113 kB/s)
[windows-jdk9-m3.5.x_build] [INFO] Downloading: https://repo.maven.apache.org/maven2/org/antlr/antlr4-runtime/4.5.3/antlr4-runtime-4.5.3.jar
[windows-jdk9-m3.5.x_build] [INFO] Downloaded: https://repo.maven.apache.org/maven2/com/puppycrawl/tools/checkstyle/6.18/checkstyle-6.18.jar (1.2 MB at 9.0 MB/s)
[windows-jdk9-m3.5.x_build] [INFO] Downloading: https://repo.maven.apache.org/maven2/commons-beanutils/commons-beanutils/1.9.2/commons-beanutils-1.9.2.jar
[windows-jdk9-m3.5.x_build] [INFO] Downloaded: https://repo.maven.apache.org/maven2/antlr/antlr/2.7.7/antlr-2.7.7.jar (445 kB at 3.2 MB/s)
[windows-jdk9-m3.5.x_build] [INFO] Downloading: https://repo.maven.apache.org/maven2/commons-cli/commons-cli/1.3.1/commons-cli-1.3.1.jar
[windows-jdk9-m3.5.x_build] [INFO] Downloaded: https://repo.maven.apache.org/maven2/org/antlr/antlr4-runtime/4.5.3/antlr4-runtime-4.5.3.jar (302 kB at 1.9 MB/s)
[windows-jdk9-m3.5.x_build] [INFO] Downloading: https://repo.maven.apache.org/maven2/com/google/guava/guava/19.0/guava-19.0.jar
[windows-jdk9-m3.5.x_build] [INFO] Downloaded: https://repo.maven.apache.org/maven2/commons-beanutils/commons-beanutils/1.9.2/commons-beanutils-1.9.2.jar (234 kB at 1.5 MB/s)
[windows-jdk9-m3.5.x_build] [INFO] Downloading: https://repo.maven.apache.org/maven2/commons-lang/commons-lang/2.1/commons-lang-2.1.jar
[windows-jdk9-m3.5.x_build] [INFO] Downloaded: https://repo.maven.apache.org/maven2/commons-cli/commons-cli/1.3.1/commons-cli-1.3.1.jar (53 kB at 301 kB/s)
[windows-jdk9-m3.5.x_build] [INFO] Downloading: https://repo.maven.apache.org/maven2/javax/xml/bind/jaxb-api/2.3.0/jaxb-api-2.3.0.jar
[windows-jdk9-m3.5.x_build] [INFO] Downloaded: https://repo.maven.apache.org/maven2/commons-lang/commons-lang/2.1/commons-lang-2.1.jar (208 kB at 1.0 MB/s)
[windows-jdk9-m3.5.x_build] [INFO] Downloaded: https://repo.maven.apache.org/maven2/javax/xml/bind/jaxb-api/2.3.0/jaxb-api-2.3.0.jar (126 kB at 593 kB/s)
[windows-jdk9-m3.5.x_build] [INFO] Downloaded: https://repo.maven.apache.org/maven2/com/google/guava/guava/19.0/guava-19.0.jar (2.3 MB at 9.2 MB/s)
[windows-jdk9-m3.5.x_build] [INFO] Downloaded: https://repo.maven.apache.org/maven2/org/codehaus/plexus/plexus-resources/1.1.0/plexus-resources-1.1.0.jar (23 kB at 87 kB/s)
[windows-jdk9-m3.5.x_build] [INFO] Downloaded: https://repo.maven.apache.org/maven2/org/apache/maven/doxia/doxia-integration-tools/1.6/doxia-integration-tools-1.6.jar (45 kB at 139 kB/s)
[windows-jdk9-m3.5.x_build] [INFO] 
[windows-jdk9-m3.5.x_build] [INFO] --- maven-invoker-plugin:3.0.1:verify (integration-test) @ maven-install-plugin ---
[windows-jdk9-m3.5.x_build] [INFO] -------------------------------------------------
[windows-jdk9-m3.5.x_build] [INFO] Build Summary:
[windows-jdk9-m3.5.x_build] [INFO]   Passed: 25, Failed: 5, Errors: 0, Skipped: 0
[windows-jdk9-m3.5.x_build] [INFO] -------------------------------------------------
[windows-jdk9-m3.5.x_build] [ERROR] The following builds failed:
[windows-jdk9-m3.5.x_build] [ERROR] *  attach-jar-checksum\pom.xml
[windows-jdk9-m3.5.x_build] [ERROR] *  jar-sources-javadoc\pom.xml
[windows-jdk9-m3.5.x_build] [ERROR] *  local-repo-override-with-checksum-generatePom\pom.xml
[windows-jdk9-m3.5.x_build] [ERROR] *  local-repo-override-with-checksum\pom.xml
[windows-jdk9-m3.5.x_build] [ERROR] *  pom-checksum\pom.xml
[windows-jdk9-m3.5.x_build] [INFO] -------------------------------------------------
[windows-jdk9-m3.5.x_build] [INFO] ------------------------------------------------------------------------
[windows-jdk9-m3.5.x_build] [INFO] BUILD FAILURE
[windows-jdk9-m3.5.x_build] [INFO] ------------------------------------------------------------------------
[windows-jdk9-m3.5.x_build] [INFO] Total time: 05:11 min
[windows-jdk9-m3.5.x_build] [INFO] Finished at: 2018-08-08T08:34:45-07:00
[windows-jdk9-m3.5.x_build] [INFO] Final Memory: 47M/157M
[windows-jdk9-m3.5.x_build] [INFO] ------------------------------------------------------------------------
[windows-jdk9-m3.5.x_build] [INFO] [jenkins-event-spy] Generated F:\jenkins\jenkins-slave\workspace\-install-plugin_MSHARED-695-WXNFDBWIFTYUDO42B6WX2QA7KRR2RELHUWDSVRN7HHIE2IPI3CEQ@tmp\withMavenf02d0d62\maven-spy-20180808-082933-127210838794670160413.log
[windows-jdk9-m3.5.x_build] [ERROR] Failed to execute goal org.apache.maven.plugins:maven-invoker-plugin:3.0.1:verify (integration-test) on project maven-install-plugin: 5 builds failed. See console output above for details. -> [Help 1]
[windows-jdk9-m3.5.x_build] [ERROR] 
[windows-jdk9-m3.5.x_build] [ERROR] To see the full stack trace of the errors, re-run Maven with the -e switch.
[windows-jdk9-m3.5.x_build] [ERROR] Re-run Maven using the -X switch to enable full debug logging.
[windows-jdk9-m3.5.x_build] [ERROR] 
[windows-jdk9-m3.5.x_build] [ERROR] For more information about the errors and possible solutions, please read the following articles:
[windows-jdk9-m3.5.x_build] [ERROR] [Help 1] http://cwiki.apache.org/confluence/display/MAVEN/MojoFailureException
[Pipeline] [windows-jdk9-m3.5.x_build] }
[Pipeline] [windows-jdk9-m3.5.x_build] // dir
[Pipeline] [windows-jdk9-m3.5.x_build] }
[windows-jdk9-m3.5.x_build] [withMaven] invokerPublisher - Archive invoker results for Maven artifact MavenArtifact{org.apache.maven.plugins:maven-install-plugin::3.0.0-SNAPSHOT(version: 3.0.0-SNAPSHOT, snapshot:false) } generated by PluginInvocation{org.apache.maven.plugins:maven-invoker-plugin:3.0.1@integration-test  integration-test}: windows-jdk9-m3.5.x_build\target\invoker-reports\*.xml
[windows-jdk9-m3.5.x_build] performing MavenInvokerRecorder, reportsFilenamePattern:'**/windows-jdk9-m3.5.x_build\target\invoker-reports/BUILD*.xml', invokerBuildDir:'**/windows-jdk9-m3.5.x_build\target\it'
[windows-jdk9-m3.5.x_build] Found reports:[f:\jenkins\jenkins-slave\workspace\-install-plugin_MSHARED-695-WXNFDBWIFTYUDO42B6WX2QA7KRR2RELHUWDSVRN7HHIE2IPI3CEQ\windows-jdk9-m3.5.x_build\target\invoker-reports\BUILD-MINSTALL-108.xml, f:\jenkins\jenkins-slave\workspace\-install-plugin_MSHARED-695-WXNFDBWIFTYUDO42B6WX2QA7KRR2RELHUWDSVRN7HHIE2IPI3CEQ\windows-jdk9-m3.5.x_build\target\invoker-reports\BUILD-MINSTALL-52.xml, f:\jenkins\jenkins-slave\workspace\-install-plugin_MSHARED-695-WXNFDBWIFTYUDO42B6WX2QA7KRR2RELHUWDSVRN7HHIE2IPI3CEQ\windows-jdk9-m3.5.x_build\target\invoker-reports\BUILD-MINSTALL-98.xml, f:\jenkins\jenkins-slave\workspace\-install-plugin_MSHARED-695-WXNFDBWIFTYUDO42B6WX2QA7KRR2RELHUWDSVRN7HHIE2IPI3CEQ\windows-jdk9-m3.5.x_build\target\invoker-reports\BUILD-MINSTALL-99.xml, f:\jenkins\jenkins-slave\workspace\-install-plugin_MSHARED-695-WXNFDBWIFTYUDO42B6WX2QA7KRR2RELHUWDSVRN7HHIE2IPI3CEQ\windows-jdk9-m3.5.x_build\target\invoker-reports\BUILD-attach-jar-checksum.xml, f:\jenkins\jenkins-slave\workspace\-install-plugin_MSHARED-695-WXNFDBWIFTYUDO42B6WX2QA7KRR2RELHUWDSVRN7HHIE2IPI3CEQ\windows-jdk9-m3.5.x_build\target\invoker-reports\BUILD-attach-release-jar.xml, f:\jenkins\jenkins-slave\workspace\-install-plugin_MSHARED-695-WXNFDBWIFTYUDO42B6WX2QA7KRR2RELHUWDSVRN7HHIE2IPI3CEQ\windows-jdk9-m3.5.x_build\target\invoker-reports\BUILD-gav-validation.xml, f:\jenkins\jenkins-slave\workspace\-install-plugin_MSHARED-695-WXNFDBWIFTYUDO42B6WX2QA7KRR2RELHUWDSVRN7HHIE2IPI3CEQ\windows-jdk9-m3.5.x_build\target\invoker-reports\BUILD-generate-pom-auto-1.xml, f:\jenkins\jenkins-slave\workspace\-install-plugin_MSHARED-695-WXNFDBWIFTYUDO42B6WX2QA7KRR2RELHUWDSVRN7HHIE2IPI3CEQ\windows-jdk9-m3.5.x_build\target\invoker-reports\BUILD-generate-pom-auto-2.xml, f:\jenkins\jenkins-slave\workspace\-install-plugin_MSHARED-695-WXNFDBWIFTYUDO42B6WX2QA7KRR2RELHUWDSVRN7HHIE2IPI3CEQ\windows-jdk9-m3.5.x_build\target\invoker-reports\BUILD-install-at-end-fail.xml, f:\jenkins\jenkins-slave\workspace\-install-plugin_MSHARED-695-WXNFDBWIFTYUDO42B6WX2QA7KRR2RELHUWDSVRN7HHIE2IPI3CEQ\windows-jdk9-m3.5.x_build\target\invoker-reports\BUILD-install-at-end-pass.xml, f:\jenkins\jenkins-slave\workspace\-install-plugin_MSHARED-695-WXNFDBWIFTYUDO42B6WX2QA7KRR2RELHUWDSVRN7HHIE2IPI3CEQ\windows-jdk9-m3.5.x_build\target\invoker-reports\BUILD-install-file-minstall-121-bundle.xml, f:\jenkins\jenkins-slave\workspace\-install-plugin_MSHARED-695-WXNFDBWIFTYUDO42B6WX2QA7KRR2RELHUWDSVRN7HHIE2IPI3CEQ\windows-jdk9-m3.5.x_build\target\invoker-reports\BUILD-install-file-minstall-121-java-source.xml, f:\jenkins\jenkins-slave\workspace\-install-plugin_MSHARED-695-WXNFDBWIFTYUDO42B6WX2QA7KRR2RELHUWDSVRN7HHIE2IPI3CEQ\windows-jdk9-m3.5.x_build\target\invoker-reports\BUILD-install-file-minstall-121-maven-archetype.xml, f:\jenkins\jenkins-slave\workspace\-install-plugin_MSHARED-695-WXNFDBWIFTYUDO42B6WX2QA7KRR2RELHUWDSVRN7HHIE2IPI3CEQ\windows-jdk9-m3.5.x_build\target\invoker-reports\BUILD-install-file-minstall-121-war.xml, f:\jenkins\jenkins-slave\workspace\-install-plugin_MSHARED-695-WXNFDBWIFTYUDO42B6WX2QA7KRR2RELHUWDSVRN7HHIE2IPI3CEQ\windows-jdk9-m3.5.x_build\target\invoker-reports\BUILD-install-file-minstall-121.xml, f:\jenkins\jenkins-slave\workspace\-install-plugin_MSHARED-695-WXNFDBWIFTYUDO42B6WX2QA7KRR2RELHUWDSVRN7HHIE2IPI3CEQ\windows-jdk9-m3.5.x_build\target\invoker-reports\BUILD-jar-sources-javadoc.xml, f:\jenkins\jenkins-slave\workspace\-install-plugin_MSHARED-695-WXNFDBWIFTYUDO42B6WX2QA7KRR2RELHUWDSVRN7HHIE2IPI3CEQ\windows-jdk9-m3.5.x_build\target\invoker-reports\BUILD-local-repo-override-with-checksum-generatePom.xml, f:\jenkins\jenkins-slave\workspace\-install-plugin_MSHARED-695-WXNFDBWIFTYUDO42B6WX2QA7KRR2RELHUWDSVRN7HHIE2IPI3CEQ\windows-jdk9-m3.5.x_build\target\invoker-reports\BUILD-local-repo-override-with-checksum.xml, f:\jenkins\jenkins-slave\workspace\-install-plugin_MSHARED-695-WXNFDBWIFTYUDO42B6WX2QA7KRR2RELHUWDSVRN7HHIE2IPI3CEQ\windows-jdk9-m3.5.x_build\target\invoker-reports\BUILD-local-repo-override.xml, f:\jenkins\jenkins-slave\workspace\-install-plugin_MSHARED-695-WXNFDBWIFTYUDO42B6WX2QA7KRR2RELHUWDSVRN7HHIE2IPI3CEQ\windows-jdk9-m3.5.x_build\target\invoker-reports\BUILD-minstall-55.xml, f:\jenkins\jenkins-slave\workspace\-install-plugin_MSHARED-695-WXNFDBWIFTYUDO42B6WX2QA7KRR2RELHUWDSVRN7HHIE2IPI3CEQ\windows-jdk9-m3.5.x_build\target\invoker-reports\BUILD-no-main-artifact-1.xml, f:\jenkins\jenkins-slave\workspace\-install-plugin_MSHARED-695-WXNFDBWIFTYUDO42B6WX2QA7KRR2RELHUWDSVRN7HHIE2IPI3CEQ\windows-jdk9-m3.5.x_build\target\invoker-reports\BUILD-no-main-artifact-2.xml, f:\jenkins\jenkins-slave\workspace\-install-plugin_MSHARED-695-WXNFDBWIFTYUDO42B6WX2QA7KRR2RELHUWDSVRN7HHIE2IPI3CEQ\windows-jdk9-m3.5.x_build\target\invoker-reports\BUILD-non-changed-artifact.xml, f:\jenkins\jenkins-slave\workspace\-install-plugin_MSHARED-695-WXNFDBWIFTYUDO42B6WX2QA7KRR2RELHUWDSVRN7HHIE2IPI3CEQ\windows-jdk9-m3.5.x_build\target\invoker-reports\BUILD-pom-checksum.xml, f:\jenkins\jenkins-slave\workspace\-install-plugin_MSHARED-695-WXNFDBWIFTYUDO42B6WX2QA7KRR2RELHUWDSVRN7HHIE2IPI3CEQ\windows-jdk9-m3.5.x_build\target\invoker-reports\BUILD-release-jar.xml, f:\jenkins\jenkins-slave\workspace\-install-plugin_MSHARED-695-WXNFDBWIFTYUDO42B6WX2QA7KRR2RELHUWDSVRN7HHIE2IPI3CEQ\windows-jdk9-m3.5.x_build\target\invoker-reports\BUILD-release-pom.xml, f:\jenkins\jenkins-slave\workspace\-install-plugin_MSHARED-695-WXNFDBWIFTYUDO42B6WX2QA7KRR2RELHUWDSVRN7HHIE2IPI3CEQ\windows-jdk9-m3.5.x_build\target\invoker-reports\BUILD-skip-install.xml, f:\jenkins\jenkins-slave\workspace\-install-plugin_MSHARED-695-WXNFDBWIFTYUDO42B6WX2QA7KRR2RELHUWDSVRN7HHIE2IPI3CEQ\windows-jdk9-m3.5.x_build\target\invoker-reports\BUILD-snapshot-jar.xml, f:\jenkins\jenkins-slave\workspace\-install-plugin_MSHARED-695-WXNFDBWIFTYUDO42B6WX2QA7KRR2RELHUWDSVRN7HHIE2IPI3CEQ\windows-jdk9-m3.5.x_build\target\invoker-reports\BUILD-snapshot-pom.xml]
[windows-jdk9-m3.5.x_build] Found logs:[f:\jenkins\jenkins-slave\workspace\-install-plugin_MSHARED-695-WXNFDBWIFTYUDO42B6WX2QA7KRR2RELHUWDSVRN7HHIE2IPI3CEQ\windows-jdk9-m3.5.x_build\target\it\MINSTALL-108\build.log, f:\jenkins\jenkins-slave\workspace\-install-plugin_MSHARED-695-WXNFDBWIFTYUDO42B6WX2QA7KRR2RELHUWDSVRN7HHIE2IPI3CEQ\windows-jdk9-m3.5.x_build\target\it\MINSTALL-52\build.log, f:\jenkins\jenkins-slave\workspace\-install-plugin_MSHARED-695-WXNFDBWIFTYUDO42B6WX2QA7KRR2RELHUWDSVRN7HHIE2IPI3CEQ\windows-jdk9-m3.5.x_build\target\it\MINSTALL-98\build.log, f:\jenkins\jenkins-slave\workspace\-install-plugin_MSHARED-695-WXNFDBWIFTYUDO42B6WX2QA7KRR2RELHUWDSVRN7HHIE2IPI3CEQ\windows-jdk9-m3.5.x_build\target\it\MINSTALL-99\build.log, f:\jenkins\jenkins-slave\workspace\-install-plugin_MSHARED-695-WXNFDBWIFTYUDO42B6WX2QA7KRR2RELHUWDSVRN7HHIE2IPI3CEQ\windows-jdk9-m3.5.x_build\target\it\attach-jar-checksum\build.log, f:\jenkins\jenkins-slave\workspace\-install-plugin_MSHARED-695-WXNFDBWIFTYUDO42B6WX2QA7KRR2RELHUWDSVRN7HHIE2IPI3CEQ\windows-jdk9-m3.5.x_build\target\it\attach-release-jar\build.log, f:\jenkins\jenkins-slave\workspace\-install-plugin_MSHARED-695-WXNFDBWIFTYUDO42B6WX2QA7KRR2RELHUWDSVRN7HHIE2IPI3CEQ\windows-jdk9-m3.5.x_build\target\it\gav-validation\build.log, f:\jenkins\jenkins-slave\workspace\-install-plugin_MSHARED-695-WXNFDBWIFTYUDO42B6WX2QA7KRR2RELHUWDSVRN7HHIE2IPI3CEQ\windows-jdk9-m3.5.x_build\target\it\generate-pom-auto-1\build.log, f:\jenkins\jenkins-slave\workspace\-install-plugin_MSHARED-695-WXNFDBWIFTYUDO42B6WX2QA7KRR2RELHUWDSVRN7HHIE2IPI3CEQ\windows-jdk9-m3.5.x_build\target\it\generate-pom-auto-2\build.log, f:\jenkins\jenkins-slave\workspace\-install-plugin_MSHARED-695-WXNFDBWIFTYUDO42B6WX2QA7KRR2RELHUWDSVRN7HHIE2IPI3CEQ\windows-jdk9-m3.5.x_build\target\it\install-at-end-fail\build.log, f:\jenkins\jenkins-slave\workspace\-install-plugin_MSHARED-695-WXNFDBWIFTYUDO42B6WX2QA7KRR2RELHUWDSVRN7HHIE2IPI3CEQ\windows-jdk9-m3.5.x_build\target\it\install-at-end-pass\build.log, f:\jenkins\jenkins-slave\workspace\-install-plugin_MSHARED-695-WXNFDBWIFTYUDO42B6WX2QA7KRR2RELHUWDSVRN7HHIE2IPI3CEQ\windows-jdk9-m3.5.x_build\target\it\install-file-minstall-121-bundle\build.log, f:\jenkins\jenkins-slave\workspace\-install-plugin_MSHARED-695-WXNFDBWIFTYUDO42B6WX2QA7KRR2RELHUWDSVRN7HHIE2IPI3CEQ\windows-jdk9-m3.5.x_build\target\it\install-file-minstall-121-java-source\build.log, f:\jenkins\jenkins-slave\workspace\-install-plugin_MSHARED-695-WXNFDBWIFTYUDO42B6WX2QA7KRR2RELHUWDSVRN7HHIE2IPI3CEQ\windows-jdk9-m3.5.x_build\target\it\install-file-minstall-121-maven-archetype\build.log, f:\jenkins\jenkins-slave\workspace\-install-plugin_MSHARED-695-WXNFDBWIFTYUDO42B6WX2QA7KRR2RELHUWDSVRN7HHIE2IPI3CEQ\windows-jdk9-m3.5.x_build\target\it\install-file-minstall-121-war\build.log, f:\jenkins\jenkins-slave\workspace\-install-plugin_MSHARED-695-WXNFDBWIFTYUDO42B6WX2QA7KRR2RELHUWDSVRN7HHIE2IPI3CEQ\windows-jdk9-m3.5.x_build\target\it\install-file-minstall-121\build.log, f:\jenkins\jenkins-slave\workspace\-install-plugin_MSHARED-695-WXNFDBWIFTYUDO42B6WX2QA7KRR2RELHUWDSVRN7HHIE2IPI3CEQ\windows-jdk9-m3.5.x_build\target\it\jar-sources-javadoc\build.log, f:\jenkins\jenkins-slave\workspace\-install-plugin_MSHARED-695-WXNFDBWIFTYUDO42B6WX2QA7KRR2RELHUWDSVRN7HHIE2IPI3CEQ\windows-jdk9-m3.5.x_build\target\it\local-repo-override-with-checksum-generatePom\build.log, f:\jenkins\jenkins-slave\workspace\-install-plugin_MSHARED-695-WXNFDBWIFTYUDO42B6WX2QA7KRR2RELHUWDSVRN7HHIE2IPI3CEQ\windows-jdk9-m3.5.x_build\target\it\local-repo-override-with-checksum\build.log, f:\jenkins\jenkins-slave\workspace\-install-plugin_MSHARED-695-WXNFDBWIFTYUDO42B6WX2QA7KRR2RELHUWDSVRN7HHIE2IPI3CEQ\windows-jdk9-m3.5.x_build\target\it\local-repo-override\build.log, f:\jenkins\jenkins-slave\workspace\-install-plugin_MSHARED-695-WXNFDBWIFTYUDO42B6WX2QA7KRR2RELHUWDSVRN7HHIE2IPI3CEQ\windows-jdk9-m3.5.x_build\target\it\minstall-55\build.log, f:\jenkins\jenkins-slave\workspace\-install-plugin_MSHARED-695-WXNFDBWIFTYUDO42B6WX2QA7KRR2RELHUWDSVRN7HHIE2IPI3CEQ\windows-jdk9-m3.5.x_build\target\it\no-main-artifact-1\build.log, f:\jenkins\jenkins-slave\workspace\-install-plugin_MSHARED-695-WXNFDBWIFTYUDO42B6WX2QA7KRR2RELHUWDSVRN7HHIE2IPI3CEQ\windows-jdk9-m3.5.x_build\target\it\no-main-artifact-2\build.log, f:\jenkins\jenkins-slave\workspace\-install-plugin_MSHARED-695-WXNFDBWIFTYUDO42B6WX2QA7KRR2RELHUWDSVRN7HHIE2IPI3CEQ\windows-jdk9-m3.5.x_build\target\it\non-changed-artifact\build.log, f:\jenkins\jenkins-slave\workspace\-install-plugin_MSHARED-695-WXNFDBWIFTYUDO42B6WX2QA7KRR2RELHUWDSVRN7HHIE2IPI3CEQ\windows-jdk9-m3.5.x_build\target\it\pom-checksum\build.log, f:\jenkins\jenkins-slave\workspace\-install-plugin_MSHARED-695-WXNFDBWIFTYUDO42B6WX2QA7KRR2RELHUWDSVRN7HHIE2IPI3CEQ\windows-jdk9-m3.5.x_build\target\it\release-jar\build.log, f:\jenkins\jenkins-slave\workspace\-install-plugin_MSHARED-695-WXNFDBWIFTYUDO42B6WX2QA7KRR2RELHUWDSVRN7HHIE2IPI3CEQ\windows-jdk9-m3.5.x_build\target\it\release-pom\build.log, f:\jenkins\jenkins-slave\workspace\-install-plugin_MSHARED-695-WXNFDBWIFTYUDO42B6WX2QA7KRR2RELHUWDSVRN7HHIE2IPI3CEQ\windows-jdk9-m3.5.x_build\target\it\skip-install\build.log, f:\jenkins\jenkins-slave\workspace\-install-plugin_MSHARED-695-WXNFDBWIFTYUDO42B6WX2QA7KRR2RELHUWDSVRN7HHIE2IPI3CEQ\windows-jdk9-m3.5.x_build\target\it\snapshot-jar\build.log, f:\jenkins\jenkins-slave\workspace\-install-plugin_MSHARED-695-WXNFDBWIFTYUDO42B6WX2QA7KRR2RELHUWDSVRN7HHIE2IPI3CEQ\windows-jdk9-m3.5.x_build\target\it\snapshot-pom\build.log]
[windows-jdk9-m3.5.x_build] Finished parsing Maven Invoker results (found 30)
[windows-jdk9-m3.5.x_build] [withMaven] junitPublisher - Archive test results for Maven artifact org.apache.maven.plugins:maven-install-plugin:3.0.0-SNAPSHOT generated by maven-surefire-plugin:test (default-test): windows-jdk9-m3.5.x_build\target\surefire-reports\*.xml
[windows-jdk9-m3.5.x_build] Recording test results
[windows-jdk9-m3.5.x_build] [withMaven] openTasksPublisher - Scan Tasks for Maven artifact org.apache.maven.plugins:maven-install-plugin:3.0.0-SNAPSHOT in source directory windows-jdk9-m3.5.x_build\src\main\java
[windows-jdk9-m3.5.x_build] [TASKS] Scanning folder 'f:\jenkins\jenkins-slave\workspace\-install-plugin_MSHARED-695-WXNFDBWIFTYUDO42B6WX2QA7KRR2RELHUWDSVRN7HHIE2IPI3CEQ' for files matching the pattern 'windows-jdk9-m3.5.x_build\src\main\java\**\*' - excludes: null
[windows-jdk9-m3.5.x_build] [TASKS] Found 3 files to scan for tasks
[windows-jdk9-m3.5.x_build] [TASKS] Found 0 open tasks.
[windows-jdk9-m3.5.x_build] Skipping warnings blame since pipelines do not have an SCM link.%n
[windows-jdk9-m3.5.x_build] [TASKS] Computing warning deltas based on reference build #12
[Pipeline] [windows-jdk9-m3.5.x_build] // withMaven
[Pipeline] [windows-jdk9-m3.5.x_build] cleanWs
[windows-jdk9-m3.5.x_build] [WS-CLEANUP] Deleting project workspace...[WS-CLEANUP] done
[Pipeline] [windows-jdk9-m3.5.x_build] cleanWs
[windows-jdk9-m3.5.x_build] [WS-CLEANUP] Deleting project workspace...[WS-CLEANUP] done
[Pipeline] [windows-jdk9-m3.5.x_build] }
[Pipeline] [windows-jdk9-m3.5.x_build] // stage
[Pipeline] [windows-jdk9-m3.5.x_build] }
[Pipeline] [windows-jdk9-m3.5.x_build] // node
[Pipeline] [windows-jdk9-m3.5.x_build] }
[windows-jdk9-m3.5.x_build] Failed in branch windows-jdk9-m3.5.x_build
[Pipeline] // parallel
[Pipeline] stage
[Pipeline] { (Notifications)
[Pipeline] echo
Build result: FAILURE
[Pipeline] jiraIssueSelector
[Pipeline] emailext
Mime
  • Unnamed multipart/mixed (inline, None, 0 bytes)
View raw message