maven-notifications mailing list archives

Site index · List index
Message view « Date » · « Thread »
Top « Date » · « Thread »
From Apache Jenkins Server <jenk...@builds.apache.org>
Subject Build unstable in Jenkins: Maven TLP » maven-archetype » master #14
Date Sun, 05 Aug 2018 20:59:29 GMT
See https://builds.apache.org/job/maven-box/job/maven-archetype/job/master/14/

Changes:

* Upgrade maven-parent to 32
* Upgrade maven-parent to 32
* Upgrade maven-parent to 32
* Upgrade maven-parent to 32
* Upgrade maven-parent to 32
* Upgrade maven-parent to 32
* Upgrade maven-parent to 32
* Upgrade maven-parent to 32

28 tests failed.
FAILED:  org.apache.maven.archetype.creator.DefaultArchetypeCreatorIT.testIncludeFileWithNoExtension

Error Message:
Invoker process ended with result different than 0!

Stack Trace:
java.lang.Exception: Invoker process ended with result different than 0!
	at org.apache.maven.archetype.creator.DefaultArchetypeCreatorIT.createFilesetArchetype(DefaultArchetypeCreatorIT.java:136)
	at org.apache.maven.archetype.creator.DefaultArchetypeCreatorIT.testIncludeFileWithNoExtension(DefaultArchetypeCreatorIT.java:189)


FAILED:  org.apache.maven.archetype.creator.DefaultArchetypeCreatorIT.testSystemPropertiesAreIncluded

Error Message:
Invoker process ended with result different than 0!

Stack Trace:
java.lang.Exception: Invoker process ended with result different than 0!
	at org.apache.maven.archetype.creator.DefaultArchetypeCreatorIT.createFilesetArchetype(DefaultArchetypeCreatorIT.java:136)
	at org.apache.maven.archetype.creator.DefaultArchetypeCreatorIT.testSystemPropertiesAreIncluded(DefaultArchetypeCreatorIT.java:200)


FAILED:  org.apache.maven.archetype.creator.DefaultArchetypeCreatorIT.testCreateFilesetArchetype1

Error Message:
Invoker process ended with result different than 0!

Stack Trace:
java.lang.Exception: Invoker process ended with result different than 0!
	at org.apache.maven.archetype.creator.DefaultArchetypeCreatorIT.createFilesetArchetype(DefaultArchetypeCreatorIT.java:136)
	at org.apache.maven.archetype.creator.DefaultArchetypeCreatorIT.testCreateFilesetArchetype1(DefaultArchetypeCreatorIT.java:211)


FAILED:  org.apache.maven.archetype.creator.DefaultArchetypeCreatorIT.testCreateFilesetArchetype2

Error Message:
Invoker process ended with result different than 0!

Stack Trace:
java.lang.Exception: Invoker process ended with result different than 0!
	at org.apache.maven.archetype.creator.DefaultArchetypeCreatorIT.createFilesetArchetype(DefaultArchetypeCreatorIT.java:136)
	at org.apache.maven.archetype.creator.DefaultArchetypeCreatorIT.testCreateFilesetArchetype2(DefaultArchetypeCreatorIT.java:225)


FAILED:  org.apache.maven.archetype.creator.DefaultArchetypeCreatorIT.testCreateFilesetArchetype3

Error Message:
Invoker process ended with result different than 0!

Stack Trace:
java.lang.Exception: Invoker process ended with result different than 0!
	at org.apache.maven.archetype.creator.DefaultArchetypeCreatorIT.createFilesetArchetype(DefaultArchetypeCreatorIT.java:136)
	at org.apache.maven.archetype.creator.DefaultArchetypeCreatorIT.testCreateFilesetArchetype3(DefaultArchetypeCreatorIT.java:233)


FAILED:  org.apache.maven.archetype.creator.DefaultArchetypeCreatorIT.testCreateFilesetArchetype4

Error Message:
Invoker process ended with result different than 0!

Stack Trace:
java.lang.Exception: Invoker process ended with result different than 0!
	at org.apache.maven.archetype.creator.DefaultArchetypeCreatorIT.createFilesetArchetype(DefaultArchetypeCreatorIT.java:136)
	at org.apache.maven.archetype.creator.DefaultArchetypeCreatorIT.testCreateFilesetArchetype4(DefaultArchetypeCreatorIT.java:398)


FAILED:  org.apache.maven.archetype.creator.DefaultArchetypeCreatorIT.testCreateFilesetArchetype5

Error Message:
Invoker process ended with result different than 0!

Stack Trace:
java.lang.Exception: Invoker process ended with result different than 0!
	at org.apache.maven.archetype.creator.DefaultArchetypeCreatorIT.createFilesetArchetype(DefaultArchetypeCreatorIT.java:136)
	at org.apache.maven.archetype.creator.DefaultArchetypeCreatorIT.testCreateFilesetArchetype5(DefaultArchetypeCreatorIT.java:429)


FAILED:  org.apache.maven.archetype.creator.DefaultArchetypeCreatorIT.testCreateFilesetArchetype6

Error Message:
Invoker process ended with result different than 0!

Stack Trace:
java.lang.Exception: Invoker process ended with result different than 0!
	at org.apache.maven.archetype.creator.DefaultArchetypeCreatorIT.createFilesetArchetype(DefaultArchetypeCreatorIT.java:136)
	at org.apache.maven.archetype.creator.DefaultArchetypeCreatorIT.testCreateFilesetArchetype6(DefaultArchetypeCreatorIT.java:445)


FAILED:  org.apache.maven.archetype.creator.DefaultArchetypeCreatorIT.testExcludePatternsMustExcludeDirectory

Error Message:
Invoker process ended with result different than 0!

Stack Trace:
java.lang.Exception: Invoker process ended with result different than 0!
	at org.apache.maven.archetype.creator.DefaultArchetypeCreatorIT.createFilesetArchetype(DefaultArchetypeCreatorIT.java:136)
	at org.apache.maven.archetype.creator.DefaultArchetypeCreatorIT.testExcludePatternsMustExcludeDirectory(DefaultArchetypeCreatorIT.java:163)


FAILED:  org.apache.maven.archetype.creator.DefaultArchetypeCreatorIT.testExcludePatternsContainingFilesSameExtension

Error Message:
Invoker process ended with result different than 0!

Stack Trace:
java.lang.Exception: Invoker process ended with result different than 0!
	at org.apache.maven.archetype.creator.DefaultArchetypeCreatorIT.createFilesetArchetype(DefaultArchetypeCreatorIT.java:136)
	at org.apache.maven.archetype.creator.DefaultArchetypeCreatorIT.testExcludePatternsContainingFilesSameExtension(DefaultArchetypeCreatorIT.java:177)


FAILED:  org.apache.maven.archetype.creator.DefaultArchetypeCreatorIT.testChangeJavaFilenameWhenCustomPropertyEqualsClassName

Error Message:
Invoker process ended with result different than 0!

Stack Trace:
java.lang.Exception: Invoker process ended with result different than 0!
	at org.apache.maven.archetype.creator.DefaultArchetypeCreatorIT.createFilesetArchetype(DefaultArchetypeCreatorIT.java:136)
	at org.apache.maven.archetype.creator.DefaultArchetypeCreatorIT.testChangeJavaFilenameWhenCustomPropertyEqualsClassName(DefaultArchetypeCreatorIT.java:151)


FAILED:  org.apache.maven.archetype.creator.DefaultArchetypeCreatorIT.testIncludeFileWithNoExtension

Error Message:
Invoker process ended with result different than 0!

Stack Trace:
java.lang.Exception: Invoker process ended with result different than 0!
	at org.apache.maven.archetype.creator.DefaultArchetypeCreatorIT.createFilesetArchetype(DefaultArchetypeCreatorIT.java:136)
	at org.apache.maven.archetype.creator.DefaultArchetypeCreatorIT.testIncludeFileWithNoExtension(DefaultArchetypeCreatorIT.java:189)


FAILED:  org.apache.maven.archetype.creator.DefaultArchetypeCreatorIT.testSystemPropertiesAreIncluded

Error Message:
Invoker process ended with result different than 0!

Stack Trace:
java.lang.Exception: Invoker process ended with result different than 0!
	at org.apache.maven.archetype.creator.DefaultArchetypeCreatorIT.createFilesetArchetype(DefaultArchetypeCreatorIT.java:136)
	at org.apache.maven.archetype.creator.DefaultArchetypeCreatorIT.testSystemPropertiesAreIncluded(DefaultArchetypeCreatorIT.java:200)


FAILED:  org.apache.maven.archetype.creator.DefaultArchetypeCreatorIT.testCreateFilesetArchetype1

Error Message:
Invoker process ended with result different than 0!

Stack Trace:
java.lang.Exception: Invoker process ended with result different than 0!
	at org.apache.maven.archetype.creator.DefaultArchetypeCreatorIT.createFilesetArchetype(DefaultArchetypeCreatorIT.java:136)
	at org.apache.maven.archetype.creator.DefaultArchetypeCreatorIT.testCreateFilesetArchetype1(DefaultArchetypeCreatorIT.java:211)


FAILED:  org.apache.maven.archetype.creator.DefaultArchetypeCreatorIT.testCreateFilesetArchetype2

Error Message:
Invoker process ended with result different than 0!

Stack Trace:
java.lang.Exception: Invoker process ended with result different than 0!
	at org.apache.maven.archetype.creator.DefaultArchetypeCreatorIT.createFilesetArchetype(DefaultArchetypeCreatorIT.java:136)
	at org.apache.maven.archetype.creator.DefaultArchetypeCreatorIT.testCreateFilesetArchetype2(DefaultArchetypeCreatorIT.java:225)


FAILED:  org.apache.maven.archetype.creator.DefaultArchetypeCreatorIT.testCreateFilesetArchetype3

Error Message:
Invoker process ended with result different than 0!

Stack Trace:
java.lang.Exception: Invoker process ended with result different than 0!
	at org.apache.maven.archetype.creator.DefaultArchetypeCreatorIT.createFilesetArchetype(DefaultArchetypeCreatorIT.java:136)
	at org.apache.maven.archetype.creator.DefaultArchetypeCreatorIT.testCreateFilesetArchetype3(DefaultArchetypeCreatorIT.java:233)


FAILED:  org.apache.maven.archetype.creator.DefaultArchetypeCreatorIT.testCreateFilesetArchetype4

Error Message:
Invoker process ended with result different than 0!

Stack Trace:
java.lang.Exception: Invoker process ended with result different than 0!
	at org.apache.maven.archetype.creator.DefaultArchetypeCreatorIT.createFilesetArchetype(DefaultArchetypeCreatorIT.java:136)
	at org.apache.maven.archetype.creator.DefaultArchetypeCreatorIT.testCreateFilesetArchetype4(DefaultArchetypeCreatorIT.java:398)


FAILED:  org.apache.maven.archetype.creator.DefaultArchetypeCreatorIT.testCreateFilesetArchetype5

Error Message:
Invoker process ended with result different than 0!

Stack Trace:
java.lang.Exception: Invoker process ended with result different than 0!
	at org.apache.maven.archetype.creator.DefaultArchetypeCreatorIT.createFilesetArchetype(DefaultArchetypeCreatorIT.java:136)
	at org.apache.maven.archetype.creator.DefaultArchetypeCreatorIT.testCreateFilesetArchetype5(DefaultArchetypeCreatorIT.java:429)


FAILED:  org.apache.maven.archetype.creator.DefaultArchetypeCreatorIT.testCreateFilesetArchetype6

Error Message:
Invoker process ended with result different than 0!

Stack Trace:
java.lang.Exception: Invoker process ended with result different than 0!
	at org.apache.maven.archetype.creator.DefaultArchetypeCreatorIT.createFilesetArchetype(DefaultArchetypeCreatorIT.java:136)
	at org.apache.maven.archetype.creator.DefaultArchetypeCreatorIT.testCreateFilesetArchetype6(DefaultArchetypeCreatorIT.java:445)


FAILED:  org.apache.maven.archetype.creator.DefaultArchetypeCreatorIT.testExcludePatternsMustExcludeDirectory

Error Message:
Invoker process ended with result different than 0!

Stack Trace:
java.lang.Exception: Invoker process ended with result different than 0!
	at org.apache.maven.archetype.creator.DefaultArchetypeCreatorIT.createFilesetArchetype(DefaultArchetypeCreatorIT.java:136)
	at org.apache.maven.archetype.creator.DefaultArchetypeCreatorIT.testExcludePatternsMustExcludeDirectory(DefaultArchetypeCreatorIT.java:163)


FAILED:  org.apache.maven.archetype.creator.DefaultArchetypeCreatorIT.testExcludePatternsContainingFilesSameExtension

Error Message:
Invoker process ended with result different than 0!

Stack Trace:
java.lang.Exception: Invoker process ended with result different than 0!
	at org.apache.maven.archetype.creator.DefaultArchetypeCreatorIT.createFilesetArchetype(DefaultArchetypeCreatorIT.java:136)
	at org.apache.maven.archetype.creator.DefaultArchetypeCreatorIT.testExcludePatternsContainingFilesSameExtension(DefaultArchetypeCreatorIT.java:177)


FAILED:  org.apache.maven.archetype.creator.DefaultArchetypeCreatorIT.testChangeJavaFilenameWhenCustomPropertyEqualsClassName

Error Message:
Invoker process ended with result different than 0!

Stack Trace:
java.lang.Exception: Invoker process ended with result different than 0!
	at org.apache.maven.archetype.creator.DefaultArchetypeCreatorIT.createFilesetArchetype(DefaultArchetypeCreatorIT.java:136)
	at org.apache.maven.archetype.creator.DefaultArchetypeCreatorIT.testChangeJavaFilenameWhenCustomPropertyEqualsClassName(DefaultArchetypeCreatorIT.java:151)


FAILED:  org.apache.maven.archetype.test.ArchetyperRoundtripIT.testArchetyper

Error Message:
Invoker process ended with result different than 0!

Stack Trace:
java.lang.Exception: Invoker process ended with result different than 0!
	at org.apache.maven.archetype.test.ArchetyperRoundtripIT.testArchetyper(ArchetyperRoundtripIT.java:121)


FAILED:  org.apache.maven.archetype.test.ArchetyperRoundtripIT.testArchetyper

Error Message:
Invoker process ended with result different than 0!

Stack Trace:
java.lang.Exception: Invoker process ended with result different than 0!
	at org.apache.maven.archetype.test.ArchetyperRoundtripIT.testArchetyper(ArchetyperRoundtripIT.java:121)


FAILED:  org.apache.maven.archetype.test.ArchetyperRoundtripWithProxyIT.testArchetyper

Error Message:
Invoker process ended with result different than 0!

Stack Trace:
java.lang.Exception: Invoker process ended with result different than 0!
	at org.apache.maven.archetype.test.ArchetyperRoundtripWithProxyIT.testArchetyper(ArchetyperRoundtripWithProxyIT.java:126)


FAILED:  org.apache.maven.archetype.test.ArchetyperRoundtripWithProxyIT.testArchetyper

Error Message:
Invoker process ended with result different than 0!

Stack Trace:
java.lang.Exception: Invoker process ended with result different than 0!
	at org.apache.maven.archetype.test.ArchetyperRoundtripWithProxyIT.testArchetyper(ArchetyperRoundtripWithProxyIT.java:126)


FAILED:  org.apache.maven.archetype.test.RoundtripMultiModuleIT.testArchetyper

Error Message:
Invoker process ended with result different than 0!

Stack Trace:
java.lang.Exception: Invoker process ended with result different than 0!
	at org.apache.maven.archetype.test.RoundtripMultiModuleIT.testArchetyper(RoundtripMultiModuleIT.java:126)


FAILED:  org.apache.maven.archetype.test.RoundtripMultiModuleIT.testArchetyper

Error Message:
Invoker process ended with result different than 0!

Stack Trace:
java.lang.Exception: Invoker process ended with result different than 0!
	at org.apache.maven.archetype.test.RoundtripMultiModuleIT.testArchetyper(RoundtripMultiModuleIT.java:126)




Build log:
[...truncated 4.96 MB...]
[windows-jdk7] [ERROR] The build could not read 1 project -> [Help 1]
[windows-jdk7] [ERROR]   
[windows-jdk7] [ERROR]   The project org.codehaus.mojo.archetypes:maven-archetype-test:1.0
(F:\jenkins\jenkins-slave\workspace\-box_maven-archetype_master-7AVMJNUR3VZV7RPVUBCE43H65NYTRWAOYFWSDDPCNSCWDYBAGBVQ\m\archetype-testing\archetype-final\target\test-classes\projects\change-file-with-property\target\generated-sources\archetype\pom.xml)
has 2 errors
[windows-jdk7] [ERROR]     Unresolveable build extension: Plugin org.apache.maven.archetype:archetype-packaging:3.0.2-SNAPSHOT
or one of its dependencies could not be resolved: Could not transfer artifact org.codehaus.plexus:plexus-utils:jar:1.1
from/to central (https://repo.maven.apache.org/maven2): Received fatal alert: protocol_version
-> [Help 2]
[windows-jdk7] [ERROR]     Unknown packaging: maven-archetype @ line 8, column 14
[windows-jdk7] [ERROR] 
[windows-jdk7] [ERROR] To see the full stack trace of the errors, re-run Maven with the -e
switch.
[windows-jdk7] [ERROR] Re-run Maven using the -X switch to enable full debug logging.
[windows-jdk7] [ERROR] 
[windows-jdk7] [ERROR] For more information about the errors and possible solutions, please
read the following articles:
[windows-jdk7] [ERROR] [Help 1] http://cwiki.apache.org/confluence/display/MAVEN/ProjectBuildingException
[windows-jdk7] [ERROR] [Help 2] http://cwiki.apache.org/confluence/display/MAVEN/PluginManagerException
[windows-jdk7] Picked up JAVA_TOOL_OPTIONS: -Dmaven.ext.class.path="f:\jenkins\jenkins-slave\workspace\-box_maven-archetype_master-7AVMJNUR3VZV7RPVUBCE43H65NYTRWAOYFWSDDPCNSCWDYBAGBVQ@tmp\withMavenb9c75908\pipeline-maven-spy.jar"
-Dorg.jenkinsci.plugins.pipeline.maven.reportsFolder="f:\jenkins\jenkins-slave\workspace\-box_maven-archetype_master-7AVMJNUR3VZV7RPVUBCE43H65NYTRWAOYFWSDDPCNSCWDYBAGBVQ@tmp\withMavenb9c75908"

[windows-jdk7] Tests run: 11, Failures: 0, Errors: 11, Skipped: 0, Time elapsed: 67.169 sec
<<< FAILURE! - in org.apache.maven.archetype.creator.DefaultArchetypeCreatorIT
[windows-jdk7] testIncludeFileWithNoExtension(org.apache.maven.archetype.creator.DefaultArchetypeCreatorIT)
 Time elapsed: 8.389 sec  <<< ERROR!
[windows-jdk7] java.lang.Exception: Invoker process ended with result different than 0!
[windows-jdk7] 	at org.apache.maven.archetype.creator.DefaultArchetypeCreatorIT.createFilesetArchetype(DefaultArchetypeCreatorIT.java:136)
[windows-jdk7] 	at org.apache.maven.archetype.creator.DefaultArchetypeCreatorIT.testIncludeFileWithNoExtension(DefaultArchetypeCreatorIT.java:189)
[windows-jdk7] 
[windows-jdk7] testSystemPropertiesAreIncluded(org.apache.maven.archetype.creator.DefaultArchetypeCreatorIT)
 Time elapsed: 5.972 sec  <<< ERROR!
[windows-jdk7] java.lang.Exception: Invoker process ended with result different than 0!
[windows-jdk7] 	at org.apache.maven.archetype.creator.DefaultArchetypeCreatorIT.createFilesetArchetype(DefaultArchetypeCreatorIT.java:136)
[windows-jdk7] 	at org.apache.maven.archetype.creator.DefaultArchetypeCreatorIT.testSystemPropertiesAreIncluded(DefaultArchetypeCreatorIT.java:200)
[windows-jdk7] 
[windows-jdk7] testCreateFilesetArchetype1(org.apache.maven.archetype.creator.DefaultArchetypeCreatorIT)
 Time elapsed: 5.837 sec  <<< ERROR!
[windows-jdk7] java.lang.Exception: Invoker process ended with result different than 0!
[windows-jdk7] 	at org.apache.maven.archetype.creator.DefaultArchetypeCreatorIT.createFilesetArchetype(DefaultArchetypeCreatorIT.java:136)
[windows-jdk7] 	at org.apache.maven.archetype.creator.DefaultArchetypeCreatorIT.testCreateFilesetArchetype1(DefaultArchetypeCreatorIT.java:211)
[windows-jdk7] 
[windows-jdk7] testCreateFilesetArchetype2(org.apache.maven.archetype.creator.DefaultArchetypeCreatorIT)
 Time elapsed: 6.011 sec  <<< ERROR!
[windows-jdk7] java.lang.Exception: Invoker process ended with result different than 0!
[windows-jdk7] 	at org.apache.maven.archetype.creator.DefaultArchetypeCreatorIT.createFilesetArchetype(DefaultArchetypeCreatorIT.java:136)
[windows-jdk7] 	at org.apache.maven.archetype.creator.DefaultArchetypeCreatorIT.testCreateFilesetArchetype2(DefaultArchetypeCreatorIT.java:225)
[windows-jdk7] 
[windows-jdk7] testCreateFilesetArchetype3(org.apache.maven.archetype.creator.DefaultArchetypeCreatorIT)
 Time elapsed: 6.205 sec  <<< ERROR!
[windows-jdk7] java.lang.Exception: Invoker process ended with result different than 0!
[windows-jdk7] 	at org.apache.maven.archetype.creator.DefaultArchetypeCreatorIT.createFilesetArchetype(DefaultArchetypeCreatorIT.java:136)
[windows-jdk7] 	at org.apache.maven.archetype.creator.DefaultArchetypeCreatorIT.testCreateFilesetArchetype3(DefaultArchetypeCreatorIT.java:233)
[windows-jdk7] 
[windows-jdk7] testCreateFilesetArchetype4(org.apache.maven.archetype.creator.DefaultArchetypeCreatorIT)
 Time elapsed: 5.895 sec  <<< ERROR!
[windows-jdk7] java.lang.Exception: Invoker process ended with result different than 0!
[windows-jdk7] 	at org.apache.maven.archetype.creator.DefaultArchetypeCreatorIT.createFilesetArchetype(DefaultArchetypeCreatorIT.java:136)
[windows-jdk7] 	at org.apache.maven.archetype.creator.DefaultArchetypeCreatorIT.testCreateFilesetArchetype4(DefaultArchetypeCreatorIT.java:398)
[windows-jdk7] 
[windows-jdk7] testCreateFilesetArchetype5(org.apache.maven.archetype.creator.DefaultArchetypeCreatorIT)
 Time elapsed: 6.044 sec  <<< ERROR!
[windows-jdk7] java.lang.Exception: Invoker process ended with result different than 0!
[windows-jdk7] 	at org.apache.maven.archetype.creator.DefaultArchetypeCreatorIT.createFilesetArchetype(DefaultArchetypeCreatorIT.java:136)
[windows-jdk7] 	at org.apache.maven.archetype.creator.DefaultArchetypeCreatorIT.testCreateFilesetArchetype5(DefaultArchetypeCreatorIT.java:429)
[windows-jdk7] 
[windows-jdk7] testCreateFilesetArchetype6(org.apache.maven.archetype.creator.DefaultArchetypeCreatorIT)
 Time elapsed: 5.896 sec  <<< ERROR!
[windows-jdk7] java.lang.Exception: Invoker process ended with result different than 0!
[windows-jdk7] 	at org.apache.maven.archetype.creator.DefaultArchetypeCreatorIT.createFilesetArchetype(DefaultArchetypeCreatorIT.java:136)
[windows-jdk7] 	at org.apache.maven.archetype.creator.DefaultArchetypeCreatorIT.testCreateFilesetArchetype6(DefaultArchetypeCreatorIT.java:445)
[windows-jdk7] 
[windows-jdk7] testExcludePatternsMustExcludeDirectory(org.apache.maven.archetype.creator.DefaultArchetypeCreatorIT)
 Time elapsed: 5.367 sec  <<< ERROR!
[windows-jdk7] java.lang.Exception: Invoker process ended with result different than 0!
[windows-jdk7] 	at org.apache.maven.archetype.creator.DefaultArchetypeCreatorIT.createFilesetArchetype(DefaultArchetypeCreatorIT.java:136)
[windows-jdk7] 	at org.apache.maven.archetype.creator.DefaultArchetypeCreatorIT.testExcludePatternsMustExcludeDirectory(DefaultArchetypeCreatorIT.java:163)
[windows-jdk7] 
[windows-jdk7] testExcludePatternsContainingFilesSameExtension(org.apache.maven.archetype.creator.DefaultArchetypeCreatorIT)
 Time elapsed: 5.71 sec  <<< ERROR!
[windows-jdk7] java.lang.Exception: Invoker process ended with result different than 0!
[windows-jdk7] 	at org.apache.maven.archetype.creator.DefaultArchetypeCreatorIT.createFilesetArchetype(DefaultArchetypeCreatorIT.java:136)
[windows-jdk7] 	at org.apache.maven.archetype.creator.DefaultArchetypeCreatorIT.testExcludePatternsContainingFilesSameExtension(DefaultArchetypeCreatorIT.java:177)
[windows-jdk7] 
[windows-jdk7] testChangeJavaFilenameWhenCustomPropertyEqualsClassName(org.apache.maven.archetype.creator.DefaultArchetypeCreatorIT)
 Time elapsed: 5.738 sec  <<< ERROR!
[windows-jdk7] java.lang.Exception: Invoker process ended with result different than 0!
[windows-jdk7] 	at org.apache.maven.archetype.creator.DefaultArchetypeCreatorIT.createFilesetArchetype(DefaultArchetypeCreatorIT.java:136)
[windows-jdk7] 	at org.apache.maven.archetype.creator.DefaultArchetypeCreatorIT.testChangeJavaFilenameWhenCustomPropertyEqualsClassName(DefaultArchetypeCreatorIT.java:151)
[windows-jdk7] 
[windows-jdk7] Running org.apache.maven.archetype.test.ArchetyperRoundtripIT
[windows-jdk7] SLF4J: Failed to load class "org.slf4j.impl.StaticLoggerBinder".
[windows-jdk7] SLF4J: Defaulting to no-operation (NOP) logger implementation
[windows-jdk7] SLF4J: See http://www.slf4j.org/codes.html#StaticLoggerBinder for further details.
[windows-jdk7] [INFO] [jenkins-event-spy] Jenkins Maven Event Spy is disabled
[windows-jdk7] [INFO] Scanning for projects...
[windows-jdk7] [INFO] Downloading: https://repo.maven.apache.org/maven2/org/codehaus/plexus/plexus-utils/1.1/plexus-utils-1.1.jar
[windows-jdk7] [ERROR] [ERROR] Some problems were encountered while processing the POMs:
[windows-jdk7] [ERROR] Unresolveable build extension: Plugin org.apache.maven.archetype:archetype-packaging:3.0.2-SNAPSHOT
or one of its dependencies could not be resolved: Could not transfer artifact org.codehaus.plexus:plexus-utils:jar:1.1
from/to central (https://repo.maven.apache.org/maven2): Received fatal alert: protocol_version
@ 
[windows-jdk7] [ERROR] Unknown packaging: maven-archetype @ line 8, column 14
[windows-jdk7]  @ 
[windows-jdk7] [ERROR] The build could not read 1 project -> [Help 1]
[windows-jdk7] [ERROR]   
[windows-jdk7] [ERROR]   The project org.apache.maven.test:test-project-1:1.0 (F:\jenkins\jenkins-slave\workspace\-box_maven-archetype_master-7AVMJNUR3VZV7RPVUBCE43H65NYTRWAOYFWSDDPCNSCWDYBAGBVQ\m\archetype-testing\archetype-final\target\test-classes\projects\roundtrip-1-project\target\generated-sources\archetype\pom.xml)
has 2 errors
[windows-jdk7] [ERROR]     Unresolveable build extension: Plugin org.apache.maven.archetype:archetype-packaging:3.0.2-SNAPSHOT
or one of its dependencies could not be resolved: Could not transfer artifact org.codehaus.plexus:plexus-utils:jar:1.1
from/to central (https://repo.maven.apache.org/maven2): Received fatal alert: protocol_version
-> [Help 2]
[windows-jdk7] [ERROR]     Unknown packaging: maven-archetype @ line 8, column 14
[windows-jdk7] [ERROR] 
[windows-jdk7] [ERROR] To see the full stack trace of the errors, re-run Maven with the -e
switch.
[windows-jdk7] [ERROR] Re-run Maven using the -X switch to enable full debug logging.
[windows-jdk7] [ERROR] 
[windows-jdk7] [ERROR] For more information about the errors and possible solutions, please
read the following articles:
[windows-jdk7] [ERROR] [Help 1] http://cwiki.apache.org/confluence/display/MAVEN/ProjectBuildingException
[windows-jdk7] [ERROR] [Help 2] http://cwiki.apache.org/confluence/display/MAVEN/PluginManagerException
[windows-jdk7] Picked up JAVA_TOOL_OPTIONS: -Dmaven.ext.class.path="f:\jenkins\jenkins-slave\workspace\-box_maven-archetype_master-7AVMJNUR3VZV7RPVUBCE43H65NYTRWAOYFWSDDPCNSCWDYBAGBVQ@tmp\withMavenb9c75908\pipeline-maven-spy.jar"
-Dorg.jenkinsci.plugins.pipeline.maven.reportsFolder="f:\jenkins\jenkins-slave\workspace\-box_maven-archetype_master-7AVMJNUR3VZV7RPVUBCE43H65NYTRWAOYFWSDDPCNSCWDYBAGBVQ@tmp\withMavenb9c75908"

[windows-jdk7] Tests run: 1, Failures: 0, Errors: 1, Skipped: 0, Time elapsed: 6.732 sec <<<
FAILURE! - in org.apache.maven.archetype.test.ArchetyperRoundtripIT
[windows-jdk7] testArchetyper(org.apache.maven.archetype.test.ArchetyperRoundtripIT)  Time
elapsed: 6.732 sec  <<< ERROR!
[windows-jdk7] java.lang.Exception: Invoker process ended with result different than 0!
[windows-jdk7] 	at org.apache.maven.archetype.test.ArchetyperRoundtripIT.testArchetyper(ArchetyperRoundtripIT.java:121)
[windows-jdk7] 
[windows-jdk7] Running org.apache.maven.archetype.test.ArchetyperRoundtripWithProxyIT
[windows-jdk7] [INFO] [jenkins-event-spy] Jenkins Maven Event Spy is disabled
[windows-jdk7] [INFO] Scanning for projects...
[windows-jdk7] [INFO] Downloading: https://repo.maven.apache.org/maven2/org/codehaus/plexus/plexus-utils/1.1/plexus-utils-1.1.jar
[windows-jdk7] [ERROR] [ERROR] Some problems were encountered while processing the POMs:
[windows-jdk7] [ERROR] Unresolveable build extension: Plugin org.apache.maven.archetype:archetype-packaging:3.0.2-SNAPSHOT
or one of its dependencies could not be resolved: Could not transfer artifact org.codehaus.plexus:plexus-utils:jar:1.1
from/to central (https://repo.maven.apache.org/maven2): Received fatal alert: protocol_version
@ 
[windows-jdk7] [ERROR] Unknown packaging: maven-archetype @ line 8, column 14
[windows-jdk7]  @ 
[windows-jdk7] [ERROR] The build could not read 1 project -> [Help 1]
[windows-jdk7] [ERROR]   
[windows-jdk7] [ERROR]   The project org.apache.maven.test:test-project-2:1.0 (F:\jenkins\jenkins-slave\workspace\-box_maven-archetype_master-7AVMJNUR3VZV7RPVUBCE43H65NYTRWAOYFWSDDPCNSCWDYBAGBVQ\m\archetype-testing\archetype-final\target\test-classes\projects\roundtrip-2-project\target\generated-sources\archetype\pom.xml)
has 2 errors
[windows-jdk7] [ERROR]     Unresolveable build extension: Plugin org.apache.maven.archetype:archetype-packaging:3.0.2-SNAPSHOT
or one of its dependencies could not be resolved: Could not transfer artifact org.codehaus.plexus:plexus-utils:jar:1.1
from/to central (https://repo.maven.apache.org/maven2): Received fatal alert: protocol_version
-> [Help 2]
[windows-jdk7] [ERROR]     Unknown packaging: maven-archetype @ line 8, column 14
[windows-jdk7] [ERROR] 
[windows-jdk7] [ERROR] To see the full stack trace of the errors, re-run Maven with the -e
switch.
[windows-jdk7] [ERROR] Re-run Maven using the -X switch to enable full debug logging.
[windows-jdk7] [ERROR] 
[windows-jdk7] [ERROR] For more information about the errors and possible solutions, please
read the following articles:
[windows-jdk7] [ERROR] [Help 1] http://cwiki.apache.org/confluence/display/MAVEN/ProjectBuildingException
[windows-jdk7] [ERROR] [Help 2] http://cwiki.apache.org/confluence/display/MAVEN/PluginManagerException
[windows-jdk7] Picked up JAVA_TOOL_OPTIONS: -Dmaven.ext.class.path="f:\jenkins\jenkins-slave\workspace\-box_maven-archetype_master-7AVMJNUR3VZV7RPVUBCE43H65NYTRWAOYFWSDDPCNSCWDYBAGBVQ@tmp\withMavenb9c75908\pipeline-maven-spy.jar"
-Dorg.jenkinsci.plugins.pipeline.maven.reportsFolder="f:\jenkins\jenkins-slave\workspace\-box_maven-archetype_master-7AVMJNUR3VZV7RPVUBCE43H65NYTRWAOYFWSDDPCNSCWDYBAGBVQ@tmp\withMavenb9c75908"

[windows-jdk7] Tests run: 1, Failures: 0, Errors: 1, Skipped: 0, Time elapsed: 6.154 sec <<<
FAILURE! - in org.apache.maven.archetype.test.ArchetyperRoundtripWithProxyIT
[windows-jdk7] testArchetyper(org.apache.maven.archetype.test.ArchetyperRoundtripWithProxyIT)
 Time elapsed: 6.154 sec  <<< ERROR!
[windows-jdk7] java.lang.Exception: Invoker process ended with result different than 0!
[windows-jdk7] 	at org.apache.maven.archetype.test.ArchetyperRoundtripWithProxyIT.testArchetyper(ArchetyperRoundtripWithProxyIT.java:126)
[windows-jdk7] 
[windows-jdk7] Running org.apache.maven.archetype.test.RoundtripMultiModuleIT
[windows-jdk7] [INFO] [jenkins-event-spy] Jenkins Maven Event Spy is disabled
[windows-jdk7] [INFO] Scanning for projects...
[windows-jdk7] [INFO] Downloading: https://repo.maven.apache.org/maven2/org/codehaus/plexus/plexus-utils/1.1/plexus-utils-1.1.jar
[windows-jdk7] [ERROR] [ERROR] Some problems were encountered while processing the POMs:
[windows-jdk7] [ERROR] Unresolveable build extension: Plugin org.apache.maven.archetype:archetype-packaging:3.0.2-SNAPSHOT
or one of its dependencies could not be resolved: Could not transfer artifact org.codehaus.plexus:plexus-utils:jar:1.1
from/to central (https://repo.maven.apache.org/maven2): Received fatal alert: protocol_version
@ 
[windows-jdk7] [ERROR] Unknown packaging: maven-archetype @ line 8, column 14
[windows-jdk7]  @ 
[windows-jdk7] [ERROR] The build could not read 1 project -> [Help 1]
[windows-jdk7] [ERROR]   
[windows-jdk7] [ERROR]   The project com.company.proficio:proficio:1.0-SNAPSHOT (F:\jenkins\jenkins-slave\workspace\-box_maven-archetype_master-7AVMJNUR3VZV7RPVUBCE43H65NYTRWAOYFWSDDPCNSCWDYBAGBVQ\m\archetype-testing\archetype-final\target\test-classes\projects\roundtrip-multi\target\generated-sources\archetype\pom.xml)
has 2 errors
[windows-jdk7] [ERROR]     Unresolveable build extension: Plugin org.apache.maven.archetype:archetype-packaging:3.0.2-SNAPSHOT
or one of its dependencies could not be resolved: Could not transfer artifact org.codehaus.plexus:plexus-utils:jar:1.1
from/to central (https://repo.maven.apache.org/maven2): Received fatal alert: protocol_version
-> [Help 2]
[windows-jdk7] [ERROR]     Unknown packaging: maven-archetype @ line 8, column 14
[windows-jdk7] [ERROR] 
[windows-jdk7] [ERROR] To see the full stack trace of the errors, re-run Maven with the -e
switch.
[windows-jdk7] [ERROR] Re-run Maven using the -X switch to enable full debug logging.
[windows-jdk7] [ERROR] 
[windows-jdk7] [ERROR] For more information about the errors and possible solutions, please
read the following articles:
[windows-jdk7] [ERROR] [Help 1] http://cwiki.apache.org/confluence/display/MAVEN/ProjectBuildingException
[windows-jdk7] [ERROR] [Help 2] http://cwiki.apache.org/confluence/display/MAVEN/PluginManagerException
[windows-jdk7] Picked up JAVA_TOOL_OPTIONS: -Dmaven.ext.class.path="f:\jenkins\jenkins-slave\workspace\-box_maven-archetype_master-7AVMJNUR3VZV7RPVUBCE43H65NYTRWAOYFWSDDPCNSCWDYBAGBVQ@tmp\withMavenb9c75908\pipeline-maven-spy.jar"
-Dorg.jenkinsci.plugins.pipeline.maven.reportsFolder="f:\jenkins\jenkins-slave\workspace\-box_maven-archetype_master-7AVMJNUR3VZV7RPVUBCE43H65NYTRWAOYFWSDDPCNSCWDYBAGBVQ@tmp\withMavenb9c75908"

[windows-jdk7] Tests run: 1, Failures: 0, Errors: 1, Skipped: 0, Time elapsed: 7.526 sec <<<
FAILURE! - in org.apache.maven.archetype.test.RoundtripMultiModuleIT
[windows-jdk7] testArchetyper(org.apache.maven.archetype.test.RoundtripMultiModuleIT)  Time
elapsed: 7.526 sec  <<< ERROR!
[windows-jdk7] java.lang.Exception: Invoker process ended with result different than 0!
[windows-jdk7] 	at org.apache.maven.archetype.test.RoundtripMultiModuleIT.testArchetyper(RoundtripMultiModuleIT.java:126)
[windows-jdk7] 
[windows-jdk7] Picked up JAVA_TOOL_OPTIONS: -Dmaven.ext.class.path="f:\jenkins\jenkins-slave\workspace\-box_maven-archetype_master-7AVMJNUR3VZV7RPVUBCE43H65NYTRWAOYFWSDDPCNSCWDYBAGBVQ@tmp\withMavenb9c75908\pipeline-maven-spy.jar"
-Dorg.jenkinsci.plugins.pipeline.maven.reportsFolder="f:\jenkins\jenkins-slave\workspace\-box_maven-archetype_master-7AVMJNUR3VZV7RPVUBCE43H65NYTRWAOYFWSDDPCNSCWDYBAGBVQ@tmp\withMavenb9c75908"

[windows-jdk7] 
[windows-jdk7] Results :
[windows-jdk7] 
[windows-jdk7] Tests in error: 
[windows-jdk7]   DefaultArchetypeCreatorIT.testChangeJavaFilenameWhenCustomPropertyEqualsClassName:151->createFilesetArchetype:136
� 
[windows-jdk7]   DefaultArchetypeCreatorIT.testCreateFilesetArchetype1:211->createFilesetArchetype:136
� 
[windows-jdk7]   DefaultArchetypeCreatorIT.testCreateFilesetArchetype2:225->createFilesetArchetype:136
� 
[windows-jdk7]   DefaultArchetypeCreatorIT.testCreateFilesetArchetype3:233->createFilesetArchetype:136
� 
[windows-jdk7]   DefaultArchetypeCreatorIT.testCreateFilesetArchetype4:398->createFilesetArchetype:136
� 
[windows-jdk7]   DefaultArchetypeCreatorIT.testCreateFilesetArchetype5:429->createFilesetArchetype:136
� 
[windows-jdk7]   DefaultArchetypeCreatorIT.testCreateFilesetArchetype6:445->createFilesetArchetype:136
� 
[windows-jdk7]   DefaultArchetypeCreatorIT.testExcludePatternsContainingFilesSameExtension:177->createFilesetArchetype:136
� 
[windows-jdk7]   DefaultArchetypeCreatorIT.testExcludePatternsMustExcludeDirectory:163->createFilesetArchetype:136
� 
[windows-jdk7]   DefaultArchetypeCreatorIT.testIncludeFileWithNoExtension:189->createFilesetArchetype:136
� 
[windows-jdk7]   DefaultArchetypeCreatorIT.testSystemPropertiesAreIncluded:200->createFilesetArchetype:136
� 
[windows-jdk7]   ArchetyperRoundtripIT.testArchetyper:121 �  Invoker process ended with
result ...
[windows-jdk7]   ArchetyperRoundtripWithProxyIT.testArchetyper:126 �  Invoker process ended
wit...
[windows-jdk7]   RoundtripMultiModuleIT.testArchetyper:126 �  Invoker process ended with
result...
[windows-jdk7] 
[windows-jdk7] Tests run: 14, Failures: 0, Errors: 14, Skipped: 0
[windows-jdk7] 
[windows-jdk7] [INFO] 
[windows-jdk7] [INFO] --- maven-checkstyle-plugin:3.0.0:check (checkstyle-check) @ archetype-final
---
[windows-jdk7] [INFO] 
[windows-jdk7] [INFO] --- maven-failsafe-plugin:2.19.1:verify (default) @ archetype-final
---
[windows-jdk7] [ERROR] There are test failures.
[windows-jdk7] 
[windows-jdk7] Please refer to F:\jenkins\jenkins-slave\workspace\-box_maven-archetype_master-7AVMJNUR3VZV7RPVUBCE43H65NYTRWAOYFWSDDPCNSCWDYBAGBVQ\m\archetype-testing\archetype-final\target\failsafe-reports
for the individual test results.
[windows-jdk7] [INFO] ------------------------------------------------------------------------
[windows-jdk7] [INFO] Reactor Summary:
[windows-jdk7] [INFO] 
[windows-jdk7] [INFO] Maven Archetype .................................... SUCCESS [ 41.443
s]
[windows-jdk7] [INFO] Maven Archetype Models ............................. SUCCESS [  1.482
s]
[windows-jdk7] [INFO] Maven Archetype Catalog Model ...................... SUCCESS [ 11.350
s]
[windows-jdk7] [INFO] Maven Archetype Descriptor Model ................... SUCCESS [  2.477
s]
[windows-jdk7] [INFO] Maven Archetype Testing ............................ SUCCESS [  1.468
s]
[windows-jdk7] [INFO] Maven Archetype Webapp Repository .................. SUCCESS [  4.449
s]
[windows-jdk7] [INFO] Maven Archetype Webapp Proxy ....................... SUCCESS [  1.995
s]
[windows-jdk7] [INFO] Maven Archetype Common ............................. SUCCESS [ 38.638
s]
[windows-jdk7] [INFO] Maven Archetype Packaging .......................... SUCCESS [  1.601
s]
[windows-jdk7] [INFO] Maven Archetype Plugin ............................. SUCCESS [03:29
min]
[windows-jdk7] [INFO] Maven Archetype Testing Final ...................... SUCCESS [01:37
min]
[windows-jdk7] [INFO] ------------------------------------------------------------------------
[windows-jdk7] [INFO] BUILD SUCCESS
[windows-jdk7] [INFO] ------------------------------------------------------------------------
[windows-jdk7] [INFO] Total time: 06:53 min
[windows-jdk7] [INFO] Finished at: 2018-08-05T13:59:24-07:00
[windows-jdk7] [INFO] Final Memory: 65M/630M
[windows-jdk7] [INFO] ------------------------------------------------------------------------
[windows-jdk7] [INFO] [jenkins-event-spy] Generated F:\jenkins\jenkins-slave\workspace\-box_maven-archetype_master-7AVMJNUR3VZV7RPVUBCE43H65NYTRWAOYFWSDDPCNSCWDYBAGBVQ@tmp\withMavenb9c75908\maven-spy-20180805-135230-7552879241264179927070.log
[windows-jdk7] Picked up JAVA_TOOL_OPTIONS: -Dmaven.ext.class.path="f:\jenkins\jenkins-slave\workspace\-box_maven-archetype_master-7AVMJNUR3VZV7RPVUBCE43H65NYTRWAOYFWSDDPCNSCWDYBAGBVQ@tmp\withMavenb9c75908\pipeline-maven-spy.jar"
-Dorg.jenkinsci.plugins.pipeline.maven.reportsFolder="f:\jenkins\jenkins-slave\workspace\-box_maven-archetype_master-7AVMJNUR3VZV7RPVUBCE43H65NYTRWAOYFWSDDPCNSCWDYBAGBVQ@tmp\withMavenb9c75908"

[Pipeline] [windows-jdk7] }
[Pipeline] [windows-jdk7] // dir
[Pipeline] [windows-jdk7] }
[windows-jdk7] [withMaven] invokerPublisher - Archive invoker results for Maven artifact MavenArtifact{org.apache.maven.plugins:maven-archetype-plugin::3.0.2-SNAPSHOT(version:
3.0.2-SNAPSHOT, snapshot:false) } generated by PluginInvocation{org.apache.maven.plugins:maven-invoker-plugin:3.1.0@run
 integration-test}: m\maven-archetype-plugin\target\invoker-reports\*.xml
[windows-jdk7] performing MavenInvokerRecorder, reportsFilenamePattern:'**/m\maven-archetype-plugin\target\invoker-reports/BUILD*.xml',
invokerBuildDir:'**/m\maven-archetype-plugin\target\it\projects'
[windows-jdk7] Found reports:[f:\jenkins\jenkins-slave\workspace\-box_maven-archetype_master-7AVMJNUR3VZV7RPVUBCE43H65NYTRWAOYFWSDDPCNSCWDYBAGBVQ\m\maven-archetype-plugin\target\invoker-reports\BUILD-ARCHETYPE-241_filter-directory.xml,
f:\jenkins\jenkins-slave\workspace\-box_maven-archetype_master-7AVMJNUR3VZV7RPVUBCE43H65NYTRWAOYFWSDDPCNSCWDYBAGBVQ\m\maven-archetype-plugin\target\invoker-reports\BUILD-ARCHETYPE-517_failing-goals.xml,
f:\jenkins\jenkins-slave\workspace\-box_maven-archetype_master-7AVMJNUR3VZV7RPVUBCE43H65NYTRWAOYFWSDDPCNSCWDYBAGBVQ\m\maven-archetype-plugin\target\invoker-reports\BUILD-ARCHETYPE-520_mirror.xml,
f:\jenkins\jenkins-slave\workspace\-box_maven-archetype_master-7AVMJNUR3VZV7RPVUBCE43H65NYTRWAOYFWSDDPCNSCWDYBAGBVQ\m\maven-archetype-plugin\target\invoker-reports\BUILD-ARCHETYPE-521_archetype-repo.xml,
f:\jenkins\jenkins-slave\workspace\-box_maven-archetype_master-7AVMJNUR3VZV7RPVUBCE43H65NYTRWAOYFWSDDPCNSCWDYBAGBVQ\m\maven-archetype-plugin\target\invoker-reports\BUILD-build-archetype-and-run-its-with-existing-parent.xml,
f:\jenkins\jenkins-slave\workspace\-box_maven-archetype_master-7AVMJNUR3VZV7RPVUBCE43H65NYTRWAOYFWSDDPCNSCWDYBAGBVQ\m\maven-archetype-plugin\target\invoker-reports\BUILD-build-archetype-ignore-eol-encoding.xml,
f:\jenkins\jenkins-slave\workspace\-box_maven-archetype_master-7AVMJNUR3VZV7RPVUBCE43H65NYTRWAOYFWSDDPCNSCWDYBAGBVQ\m\maven-archetype-plugin\target\invoker-reports\BUILD-build-archetype.xml,
f:\jenkins\jenkins-slave\workspace\-box_maven-archetype_master-7AVMJNUR3VZV7RPVUBCE43H65NYTRWAOYFWSDDPCNSCWDYBAGBVQ\m\maven-archetype-plugin\target\invoker-reports\BUILD-create-from-project-exclude-patterns.xml,
f:\jenkins\jenkins-slave\workspace\-box_maven-archetype_master-7AVMJNUR3VZV7RPVUBCE43H65NYTRWAOYFWSDDPCNSCWDYBAGBVQ\m\maven-archetype-plugin\target\invoker-reports\BUILD-create-from-project.xml,
f:\jenkins\jenkins-slave\workspace\-box_maven-archetype_master-7AVMJNUR3VZV7RPVUBCE43H65NYTRWAOYFWSDDPCNSCWDYBAGBVQ\m\maven-archetype-plugin\target\invoker-reports\BUILD-generate-basic.xml,
f:\jenkins\jenkins-slave\workspace\-box_maven-archetype_master-7AVMJNUR3VZV7RPVUBCE43H65NYTRWAOYFWSDDPCNSCWDYBAGBVQ\m\maven-archetype-plugin\target\invoker-reports\BUILD-property-setting-cli.xml]
[windows-jdk7] Found logs:[f:\jenkins\jenkins-slave\workspace\-box_maven-archetype_master-7AVMJNUR3VZV7RPVUBCE43H65NYTRWAOYFWSDDPCNSCWDYBAGBVQ\m\maven-archetype-plugin\target\it\projects\ARCHETYPE-241_filter-directory\build.log,
f:\jenkins\jenkins-slave\workspace\-box_maven-archetype_master-7AVMJNUR3VZV7RPVUBCE43H65NYTRWAOYFWSDDPCNSCWDYBAGBVQ\m\maven-archetype-plugin\target\it\projects\ARCHETYPE-517_failing-goals\build.log,
f:\jenkins\jenkins-slave\workspace\-box_maven-archetype_master-7AVMJNUR3VZV7RPVUBCE43H65NYTRWAOYFWSDDPCNSCWDYBAGBVQ\m\maven-archetype-plugin\target\it\projects\ARCHETYPE-520_mirror\build.log,
f:\jenkins\jenkins-slave\workspace\-box_maven-archetype_master-7AVMJNUR3VZV7RPVUBCE43H65NYTRWAOYFWSDDPCNSCWDYBAGBVQ\m\maven-archetype-plugin\target\it\projects\ARCHETYPE-521_archetype-repo\build.log,
f:\jenkins\jenkins-slave\workspace\-box_maven-archetype_master-7AVMJNUR3VZV7RPVUBCE43H65NYTRWAOYFWSDDPCNSCWDYBAGBVQ\m\maven-archetype-plugin\target\it\projects\build-archetype-and-run-its-with-existing-parent\build.log,
f:\jenkins\jenkins-slave\workspace\-box_maven-archetype_master-7AVMJNUR3VZV7RPVUBCE43H65NYTRWAOYFWSDDPCNSCWDYBAGBVQ\m\maven-archetype-plugin\target\it\projects\build-archetype-and-run-its-with-existing-parent\target\test-classes\projects\basic\project\project\basic\build.log,
f:\jenkins\jenkins-slave\workspace\-box_maven-archetype_master-7AVMJNUR3VZV7RPVUBCE43H65NYTRWAOYFWSDDPCNSCWDYBAGBVQ\m\maven-archetype-plugin\target\it\projects\build-archetype-ignore-eol-encoding\build.log,
f:\jenkins\jenkins-slave\workspace\-box_maven-archetype_master-7AVMJNUR3VZV7RPVUBCE43H65NYTRWAOYFWSDDPCNSCWDYBAGBVQ\m\maven-archetype-plugin\target\it\projects\build-archetype-ignore-eol-encoding\target\test-classes\projects\basic\project\basic\build.log,
f:\jenkins\jenkins-slave\workspace\-box_maven-archetype_master-7AVMJNUR3VZV7RPVUBCE43H65NYTRWAOYFWSDDPCNSCWDYBAGBVQ\m\maven-archetype-plugin\target\it\projects\build-archetype\build.log,
f:\jenkins\jenkins-slave\workspace\-box_maven-archetype_master-7AVMJNUR3VZV7RPVUBCE43H65NYTRWAOYFWSDDPCNSCWDYBAGBVQ\m\maven-archetype-plugin\target\it\projects\build-archetype\target\test-classes\projects\basic\project\basic\build.log,
f:\jenkins\jenkins-slave\workspace\-box_maven-archetype_master-7AVMJNUR3VZV7RPVUBCE43H65NYTRWAOYFWSDDPCNSCWDYBAGBVQ\m\maven-archetype-plugin\target\it\projects\create-from-project-exclude-patterns\build.log,
f:\jenkins\jenkins-slave\workspace\-box_maven-archetype_master-7AVMJNUR3VZV7RPVUBCE43H65NYTRWAOYFWSDDPCNSCWDYBAGBVQ\m\maven-archetype-plugin\target\it\projects\create-from-project-exclude-patterns\target\generated-sources\archetype\src\main\resources\archetype-resources\build.log,
f:\jenkins\jenkins-slave\workspace\-box_maven-archetype_master-7AVMJNUR3VZV7RPVUBCE43H65NYTRWAOYFWSDDPCNSCWDYBAGBVQ\m\maven-archetype-plugin\target\it\projects\create-from-project-exclude-patterns\target\generated-sources\archetype\target\classes\archetype-resources\build.log,
f:\jenkins\jenkins-slave\workspace\-box_maven-archetype_master-7AVMJNUR3VZV7RPVUBCE43H65NYTRWAOYFWSDDPCNSCWDYBAGBVQ\m\maven-archetype-plugin\target\it\projects\create-from-project\build.log,
f:\jenkins\jenkins-slave\workspace\-box_maven-archetype_master-7AVMJNUR3VZV7RPVUBCE43H65NYTRWAOYFWSDDPCNSCWDYBAGBVQ\m\maven-archetype-plugin\target\it\projects\create-from-project\target\generated-sources\archetype\src\main\resources\archetype-resources\build.log,
f:\jenkins\jenkins-slave\workspace\-box_maven-archetype_master-7AVMJNUR3VZV7RPVUBCE43H65NYTRWAOYFWSDDPCNSCWDYBAGBVQ\m\maven-archetype-plugin\target\it\projects\create-from-project\target\generated-sources\archetype\target\classes\archetype-resources\build.log,
f:\jenkins\jenkins-slave\workspace\-box_maven-archetype_master-7AVMJNUR3VZV7RPVUBCE43H65NYTRWAOYFWSDDPCNSCWDYBAGBVQ\m\maven-archetype-plugin\target\it\projects\generate-basic\build.log,
f:\jenkins\jenkins-slave\workspace\-box_maven-archetype_master-7AVMJNUR3VZV7RPVUBCE43H65NYTRWAOYFWSDDPCNSCWDYBAGBVQ\m\maven-archetype-plugin\target\it\projects\property-setting-cli\build.log]
[windows-jdk7] Finished parsing Maven Invoker results (found 11)
[windows-jdk7] [withMaven] junitPublisher - Archive test results for Maven artifact org.apache.maven.archetype:archetype-catalog:3.0.2-SNAPSHOT
generated by maven-surefire-plugin:test (default-test): m\archetype-models\archetype-catalog\target\surefire-reports\*.xml
[windows-jdk7] Recording test results
[windows-jdk7] None of the test reports contained any result
[windows-jdk7] [withMaven] junitPublisher - Archive test results for Maven artifact org.apache.maven.archetype:archetype-descriptor:3.0.2-SNAPSHOT
generated by maven-surefire-plugin:test (default-test): m\archetype-models\archetype-descriptor\target\surefire-reports\*.xml
[windows-jdk7] Recording test results
[windows-jdk7] None of the test reports contained any result
[windows-jdk7] [withMaven] junitPublisher - Archive test results for Maven artifact org.apache.maven.archetype:archetype-repository:3.0.2-SNAPSHOT
generated by maven-surefire-plugin:test (default-test): m\archetype-testing\archetype-repository\target\surefire-reports\*.xml
[windows-jdk7] Recording test results
[windows-jdk7] None of the test reports contained any result
[windows-jdk7] [withMaven] junitPublisher - Archive test results for Maven artifact org.apache.maven.archetype:archetype-proxy:3.0.2-SNAPSHOT
generated by maven-surefire-plugin:test (default-test): m\archetype-testing\archetype-proxy\target\surefire-reports\*.xml
[windows-jdk7] Recording test results
[windows-jdk7] None of the test reports contained any result
[windows-jdk7] [withMaven] junitPublisher - Archive test results for Maven artifact org.apache.maven.archetype:archetype-common:3.0.2-SNAPSHOT
generated by maven-surefire-plugin:test (default-test): m\archetype-common\target\surefire-reports\*.xml
[windows-jdk7] Recording test results
[windows-jdk7] [withMaven] junitPublisher - Archive test results for Maven artifact org.apache.maven.archetype:archetype-packaging:3.0.2-SNAPSHOT
generated by maven-surefire-plugin:test (default-test): m\archetype-packaging\target\surefire-reports\*.xml
[windows-jdk7] Recording test results
[windows-jdk7] None of the test reports contained any result
[windows-jdk7] [withMaven] junitPublisher - Archive test results for Maven artifact org.apache.maven.plugins:maven-archetype-plugin:3.0.2-SNAPSHOT
generated by maven-surefire-plugin:test (default-test): m\maven-archetype-plugin\target\surefire-reports\*.xml
[windows-jdk7] Recording test results
[windows-jdk7] [withMaven] junitPublisher - Archive test results for Maven artifact org.apache.maven.archetype:archetype-final:3.0.2-SNAPSHOT
generated by maven-surefire-plugin:test (default-test): m\archetype-testing\archetype-final\target\surefire-reports\*.xml
[windows-jdk7] Recording test results
[windows-jdk7] None of the test reports contained any result
[windows-jdk7] [withMaven] junitPublisher - Archive test results for Maven artifact org.apache.maven.archetype:archetype-final:3.0.2-SNAPSHOT
generated by maven-failsafe-plugin:integration-test (default): m\archetype-testing\archetype-final\target\failsafe-reports\*.xml
[windows-jdk7] Recording test results
[Pipeline] [windows-jdk7] // withMaven
[Pipeline] [windows-jdk7] cleanWs
[windows-jdk7] [WS-CLEANUP] Deleting project workspace...[WS-CLEANUP] done
[Pipeline] [windows-jdk7] }
[Pipeline] [windows-jdk7] // stage
[Pipeline] [windows-jdk7] }
[Pipeline] [windows-jdk7] // node
[Pipeline] [windows-jdk7] }
[Pipeline] // parallel
[Pipeline] stage
[Pipeline] { (Notifications)
[Pipeline] echo
Build result: UNSTABLE
[Pipeline] jiraIssueSelector
[Pipeline] emailext
Mime
  • Unnamed multipart/mixed (inline, None, 0 bytes)
View raw message