maven-notifications mailing list archives

Site index · List index
Message view « Date » · « Thread »
Top « Date » · « Thread »
From Apache Jenkins Server <jenk...@builds.apache.org>
Subject Build failed in Jenkins: Maven TLP » maven » pre-reset-master #6
Date Sat, 04 Aug 2018 03:41:47 GMT
See https://builds.apache.org/job/maven-box/job/maven/job/pre-reset-master/6/

Changes:

* Get back ubuntu-eu2 and replaced it with windows-2016-1 which currently
* Exclude windows-2012-1
* [INFRA-16848] Nodes should be fixed
* H31 seemed to have issues.

No tests ran.

Build log:
[...truncated 11.21 KB...]
[FATAL] Non-resolvable parent POM for org.apache.maven:maven:3.4.0-SNAPSHOT: Could not transfer
artifact org.apache.maven:maven-parent:pom:30 from/to central (https://repo.maven.apache.org/maven2):
Received fatal alert: protocol_version and 'parent.relativePath' points at wrong local POM
@ line 25, column 11

    at org.apache.maven.project.DefaultProjectBuilder.build (DefaultProjectBuilder.java:382)
    at org.apache.maven.graph.DefaultGraphBuilder.collectProjects (DefaultGraphBuilder.java:400)
    at org.apache.maven.graph.DefaultGraphBuilder.getProjectsForMavenReactor (DefaultGraphBuilder.java:391)
    at org.apache.maven.graph.DefaultGraphBuilder.build (DefaultGraphBuilder.java:78)
    at org.apache.maven.DefaultMaven.buildGraph (DefaultMaven.java:511)
    at org.apache.maven.DefaultMaven.doExecute (DefaultMaven.java:221)
    at org.apache.maven.DefaultMaven.doExecute (DefaultMaven.java:194)
    at org.apache.maven.DefaultMaven.execute (DefaultMaven.java:107)
    at org.apache.maven.cli.MavenCli.execute (MavenCli.java:955)
    at org.apache.maven.cli.MavenCli.doMain (MavenCli.java:290)
    at org.apache.maven.cli.MavenCli.main (MavenCli.java:194)
    at sun.reflect.NativeMethodAccessorImpl.invoke0 (Native Method)
    at sun.reflect.NativeMethodAccessorImpl.invoke (NativeMethodAccessorImpl.java:57)
    at sun.reflect.DelegatingMethodAccessorImpl.invoke (DelegatingMethodAccessorImpl.java:43)
    at java.lang.reflect.Method.invoke (Method.java:606)
    at org.codehaus.plexus.classworlds.launcher.Launcher.launchEnhanced (Launcher.java:289)
    at org.codehaus.plexus.classworlds.launcher.Launcher.launch (Launcher.java:229)
    at org.codehaus.plexus.classworlds.launcher.Launcher.mainWithExitCode (Launcher.java:415)
    at org.codehaus.plexus.classworlds.launcher.Launcher.main (Launcher.java:356)
[ERROR]   
[ERROR]   The project org.apache.maven:maven:3.4.0-SNAPSHOT (/home/jenkins/jenkins-slave/workspace/-box_maven_pre-reset-master-AF72GWR2EBH4F7AYOLQPRDHKOEZISK7V6BEF33K5DPJKW2VE4ATA/build/pom.xml)
has 1 error
[ERROR]     Non-resolvable parent POM for org.apache.maven:maven:3.4.0-SNAPSHOT: Could not
transfer artifact org.apache.maven:maven-parent:pom:30 from/to central (https://repo.maven.apache.org/maven2):
Received fatal alert: protocol_version and 'parent.relativePath' points at wrong local POM
@ line 25, column 11 -> [Help 2]
org.apache.maven.model.resolution.UnresolvableModelException: Could not transfer artifact
org.apache.maven:maven-parent:pom:30 from/to central (https://repo.maven.apache.org/maven2):
Received fatal alert: protocol_version
    at org.apache.maven.project.ProjectModelResolver.resolveModel (ProjectModelResolver.java:197)
    at org.apache.maven.project.ProjectModelResolver.resolveModel (ProjectModelResolver.java:243)
    at org.apache.maven.model.building.DefaultModelBuilder.readParentExternally (DefaultModelBuilder.java:1051)
    at org.apache.maven.model.building.DefaultModelBuilder.readParent (DefaultModelBuilder.java:829)
    at org.apache.maven.model.building.DefaultModelBuilder.build (DefaultModelBuilder.java:331)
    at org.apache.maven.project.DefaultProjectBuilder.build (DefaultProjectBuilder.java:429)
    at org.apache.maven.project.DefaultProjectBuilder.build (DefaultProjectBuilder.java:398)
    at org.apache.maven.project.DefaultProjectBuilder.build (DefaultProjectBuilder.java:362)
    at org.apache.maven.graph.DefaultGraphBuilder.collectProjects (DefaultGraphBuilder.java:400)
    at org.apache.maven.graph.DefaultGraphBuilder.getProjectsForMavenReactor (DefaultGraphBuilder.java:391)
    at org.apache.maven.graph.DefaultGraphBuilder.build (DefaultGraphBuilder.java:78)
    at org.apache.maven.DefaultMaven.buildGraph (DefaultMaven.java:511)
    at org.apache.maven.DefaultMaven.doExecute (DefaultMaven.java:221)
    at org.apache.maven.DefaultMaven.doExecute (DefaultMaven.java:194)
    at org.apache.maven.DefaultMaven.execute (DefaultMaven.java:107)
    at org.apache.maven.cli.MavenCli.execute (MavenCli.java:955)
    at org.apache.maven.cli.MavenCli.doMain (MavenCli.java:290)
    at org.apache.maven.cli.MavenCli.main (MavenCli.java:194)
    at sun.reflect.NativeMethodAccessorImpl.invoke0 (Native Method)
    at sun.reflect.NativeMethodAccessorImpl.invoke (NativeMethodAccessorImpl.java:57)
    at sun.reflect.DelegatingMethodAccessorImpl.invoke (DelegatingMethodAccessorImpl.java:43)
    at java.lang.reflect.Method.invoke (Method.java:606)
    at org.codehaus.plexus.classworlds.launcher.Launcher.launchEnhanced (Launcher.java:289)
    at org.codehaus.plexus.classworlds.launcher.Launcher.launch (Launcher.java:229)
    at org.codehaus.plexus.classworlds.launcher.Launcher.mainWithExitCode (Launcher.java:415)
    at org.codehaus.plexus.classworlds.launcher.Launcher.main (Launcher.java:356)
Caused by: org.eclipse.aether.resolution.ArtifactResolutionException: Could not transfer artifact
org.apache.maven:maven-parent:pom:30 from/to central (https://repo.maven.apache.org/maven2):
Received fatal alert: protocol_version
    at org.eclipse.aether.internal.impl.DefaultArtifactResolver.resolve (DefaultArtifactResolver.java:422)
    at org.eclipse.aether.internal.impl.DefaultArtifactResolver.resolveArtifacts (DefaultArtifactResolver.java:224)
    at org.eclipse.aether.internal.impl.DefaultArtifactResolver.resolveArtifact (DefaultArtifactResolver.java:201)
    at org.eclipse.aether.internal.impl.DefaultRepositorySystem.resolveArtifact (DefaultRepositorySystem.java:260)
    at org.apache.maven.project.ProjectModelResolver.resolveModel (ProjectModelResolver.java:193)
    at org.apache.maven.project.ProjectModelResolver.resolveModel (ProjectModelResolver.java:243)
    at org.apache.maven.model.building.DefaultModelBuilder.readParentExternally (DefaultModelBuilder.java:1051)
    at org.apache.maven.model.building.DefaultModelBuilder.readParent (DefaultModelBuilder.java:829)
    at org.apache.maven.model.building.DefaultModelBuilder.build (DefaultModelBuilder.java:331)
    at org.apache.maven.project.DefaultProjectBuilder.build (DefaultProjectBuilder.java:429)
    at org.apache.maven.project.DefaultProjectBuilder.build (DefaultProjectBuilder.java:398)
    at org.apache.maven.project.DefaultProjectBuilder.build (DefaultProjectBuilder.java:362)
    at org.apache.maven.graph.DefaultGraphBuilder.collectProjects (DefaultGraphBuilder.java:400)
    at org.apache.maven.graph.DefaultGraphBuilder.getProjectsForMavenReactor (DefaultGraphBuilder.java:391)
    at org.apache.maven.graph.DefaultGraphBuilder.build (DefaultGraphBuilder.java:78)
    at org.apache.maven.DefaultMaven.buildGraph (DefaultMaven.java:511)
    at org.apache.maven.DefaultMaven.doExecute (DefaultMaven.java:221)
    at org.apache.maven.DefaultMaven.doExecute (DefaultMaven.java:194)
    at org.apache.maven.DefaultMaven.execute (DefaultMaven.java:107)
    at org.apache.maven.cli.MavenCli.execute (MavenCli.java:955)
    at org.apache.maven.cli.MavenCli.doMain (MavenCli.java:290)
    at org.apache.maven.cli.MavenCli.main (MavenCli.java:194)
    at sun.reflect.NativeMethodAccessorImpl.invoke0 (Native Method)
    at sun.reflect.NativeMethodAccessorImpl.invoke (NativeMethodAccessorImpl.java:57)
    at sun.reflect.DelegatingMethodAccessorImpl.invoke (DelegatingMethodAccessorImpl.java:43)
    at java.lang.reflect.Method.invoke (Method.java:606)
    at org.codehaus.plexus.classworlds.launcher.Launcher.launchEnhanced (Launcher.java:289)
    at org.codehaus.plexus.classworlds.launcher.Launcher.launch (Launcher.java:229)
    at org.codehaus.plexus.classworlds.launcher.Launcher.mainWithExitCode (Launcher.java:415)
    at org.codehaus.plexus.classworlds.launcher.Launcher.main (Launcher.java:356)
Caused by: org.eclipse.aether.transfer.ArtifactTransferException: Could not transfer artifact
org.apache.maven:maven-parent:pom:30 from/to central (https://repo.maven.apache.org/maven2):
Received fatal alert: protocol_version
    at org.eclipse.aether.connector.basic.ArtifactTransportListener.transferFailed (ArtifactTransportListener.java:52)
    at org.eclipse.aether.connector.basic.BasicRepositoryConnector$TaskRunner.run (BasicRepositoryConnector.java:365)
    at org.eclipse.aether.util.concurrency.RunnableErrorForwarder$1.run (RunnableErrorForwarder.java:75)
    at org.eclipse.aether.connector.basic.BasicRepositoryConnector$DirectExecutor.execute
(BasicRepositoryConnector.java:583)
    at org.eclipse.aether.connector.basic.BasicRepositoryConnector.get (BasicRepositoryConnector.java:259)
    at org.eclipse.aether.internal.impl.DefaultArtifactResolver.performDownloads (DefaultArtifactResolver.java:498)
    at org.eclipse.aether.internal.impl.DefaultArtifactResolver.resolve (DefaultArtifactResolver.java:399)
    at org.eclipse.aether.internal.impl.DefaultArtifactResolver.resolveArtifacts (DefaultArtifactResolver.java:224)
    at org.eclipse.aether.internal.impl.DefaultArtifactResolver.resolveArtifact (DefaultArtifactResolver.java:201)
    at org.eclipse.aether.internal.impl.DefaultRepositorySystem.resolveArtifact (DefaultRepositorySystem.java:260)
    at org.apache.maven.project.ProjectModelResolver.resolveModel (ProjectModelResolver.java:193)
    at org.apache.maven.project.ProjectModelResolver.resolveModel (ProjectModelResolver.java:243)
    at org.apache.maven.model.building.DefaultModelBuilder.readParentExternally (DefaultModelBuilder.java:1051)
    at org.apache.maven.model.building.DefaultModelBuilder.readParent (DefaultModelBuilder.java:829)
    at org.apache.maven.model.building.DefaultModelBuilder.build (DefaultModelBuilder.java:331)
    at org.apache.maven.project.DefaultProjectBuilder.build (DefaultProjectBuilder.java:429)
    at org.apache.maven.project.DefaultProjectBuilder.build (DefaultProjectBuilder.java:398)
    at org.apache.maven.project.DefaultProjectBuilder.build (DefaultProjectBuilder.java:362)
    at org.apache.maven.graph.DefaultGraphBuilder.collectProjects (DefaultGraphBuilder.java:400)
    at org.apache.maven.graph.DefaultGraphBuilder.getProjectsForMavenReactor (DefaultGraphBuilder.java:391)
    at org.apache.maven.graph.DefaultGraphBuilder.build (DefaultGraphBuilder.java:78)
    at org.apache.maven.DefaultMaven.buildGraph (DefaultMaven.java:511)
    at org.apache.maven.DefaultMaven.doExecute (DefaultMaven.java:221)
    at org.apache.maven.DefaultMaven.doExecute (DefaultMaven.java:194)
    at org.apache.maven.DefaultMaven.execute (DefaultMaven.java:107)
    at org.apache.maven.cli.MavenCli.execute (MavenCli.java:955)
    at org.apache.maven.cli.MavenCli.doMain (MavenCli.java:290)
    at org.apache.maven.cli.MavenCli.main (MavenCli.java:194)
    at sun.reflect.NativeMethodAccessorImpl.invoke0 (Native Method)
    at sun.reflect.NativeMethodAccessorImpl.invoke (NativeMethodAccessorImpl.java:57)
    at sun.reflect.DelegatingMethodAccessorImpl.invoke (DelegatingMethodAccessorImpl.java:43)
    at java.lang.reflect.Method.invoke (Method.java:606)
    at org.codehaus.plexus.classworlds.launcher.Launcher.launchEnhanced (Launcher.java:289)
    at org.codehaus.plexus.classworlds.launcher.Launcher.launch (Launcher.java:229)
    at org.codehaus.plexus.classworlds.launcher.Launcher.mainWithExitCode (Launcher.java:415)
    at org.codehaus.plexus.classworlds.launcher.Launcher.main (Launcher.java:356)
Caused by: org.apache.maven.wagon.TransferFailedException: Received fatal alert: protocol_version
    at org.apache.maven.wagon.providers.http.AbstractHttpClientWagon.fillInputData (AbstractHttpClientWagon.java:1068)
    at org.apache.maven.wagon.providers.http.AbstractHttpClientWagon.fillInputData (AbstractHttpClientWagon.java:962)
    at org.apache.maven.wagon.StreamWagon.getInputStream (StreamWagon.java:126)
    at org.apache.maven.wagon.StreamWagon.getIfNewer (StreamWagon.java:88)
    at org.apache.maven.wagon.StreamWagon.get (StreamWagon.java:61)
    at org.eclipse.aether.transport.wagon.WagonTransporter$GetTaskRunner.run (WagonTransporter.java:567)
    at org.eclipse.aether.transport.wagon.WagonTransporter.execute (WagonTransporter.java:435)
    at org.eclipse.aether.transport.wagon.WagonTransporter.get (WagonTransporter.java:412)
    at org.eclipse.aether.connector.basic.BasicRepositoryConnector$GetTaskRunner.runTask (BasicRepositoryConnector.java:453)
    at org.eclipse.aether.connector.basic.BasicRepositoryConnector$TaskRunner.run (BasicRepositoryConnector.java:360)
    at org.eclipse.aether.util.concurrency.RunnableErrorForwarder$1.run (RunnableErrorForwarder.java:75)
    at org.eclipse.aether.connector.basic.BasicRepositoryConnector$DirectExecutor.execute
(BasicRepositoryConnector.java:583)
    at org.eclipse.aether.connector.basic.BasicRepositoryConnector.get (BasicRepositoryConnector.java:259)
    at org.eclipse.aether.internal.impl.DefaultArtifactResolver.performDownloads (DefaultArtifactResolver.java:498)
    at org.eclipse.aether.internal.impl.DefaultArtifactResolver.resolve (DefaultArtifactResolver.java:399)
    at org.eclipse.aether.internal.impl.DefaultArtifactResolver.resolveArtifacts (DefaultArtifactResolver.java:224)
    at org.eclipse.aether.internal.impl.DefaultArtifactResolver.resolveArtifact (DefaultArtifactResolver.java:201)
    at org.eclipse.aether.internal.impl.DefaultRepositorySystem.resolveArtifact (DefaultRepositorySystem.java:260)
    at org.apache.maven.project.ProjectModelResolver.resolveModel (ProjectModelResolver.java:193)
    at org.apache.maven.project.ProjectModelResolver.resolveModel (ProjectModelResolver.java:243)
    at org.apache.maven.model.building.DefaultModelBuilder.readParentExternally (DefaultModelBuilder.java:1051)
    at org.apache.maven.model.building.DefaultModelBuilder.readParent (DefaultModelBuilder.java:829)
    at org.apache.maven.model.building.DefaultModelBuilder.build (DefaultModelBuilder.java:331)
    at org.apache.maven.project.DefaultProjectBuilder.build (DefaultProjectBuilder.java:429)
    at org.apache.maven.project.DefaultProjectBuilder.build (DefaultProjectBuilder.java:398)
    at org.apache.maven.project.DefaultProjectBuilder.build (DefaultProjectBuilder.java:362)
    at org.apache.maven.graph.DefaultGraphBuilder.collectProjects (DefaultGraphBuilder.java:400)
    at org.apache.maven.graph.DefaultGraphBuilder.getProjectsForMavenReactor (DefaultGraphBuilder.java:391)
    at org.apache.maven.graph.DefaultGraphBuilder.build (DefaultGraphBuilder.java:78)
    at org.apache.maven.DefaultMaven.buildGraph (DefaultMaven.java:511)
    at org.apache.maven.DefaultMaven.doExecute (DefaultMaven.java:221)
    at org.apache.maven.DefaultMaven.doExecute (DefaultMaven.java:194)
    at org.apache.maven.DefaultMaven.execute (DefaultMaven.java:107)
    at org.apache.maven.cli.MavenCli.execute (MavenCli.java:955)
    at org.apache.maven.cli.MavenCli.doMain (MavenCli.java:290)
    at org.apache.maven.cli.MavenCli.main (MavenCli.java:194)
    at sun.reflect.NativeMethodAccessorImpl.invoke0 (Native Method)
    at sun.reflect.NativeMethodAccessorImpl.invoke (NativeMethodAccessorImpl.java:57)
    at sun.reflect.DelegatingMethodAccessorImpl.invoke (DelegatingMethodAccessorImpl.java:43)
    at java.lang.reflect.Method.invoke (Method.java:606)
    at org.codehaus.plexus.classworlds.launcher.Launcher.launchEnhanced (Launcher.java:289)
    at org.codehaus.plexus.classworlds.launcher.Launcher.launch (Launcher.java:229)
    at org.codehaus.plexus.classworlds.launcher.Launcher.mainWithExitCode (Launcher.java:415)
    at org.codehaus.plexus.classworlds.launcher.Launcher.main (Launcher.java:356)
Caused by: javax.net.ssl.SSLException: Received fatal alert: protocol_version
    at sun.security.ssl.Alerts.getSSLException (Alerts.java:208)
    at sun.security.ssl.Alerts.getSSLException (Alerts.java:154)
    at sun.security.ssl.SSLSocketImpl.recvAlert (SSLSocketImpl.java:1979)
    at sun.security.ssl.SSLSocketImpl.readRecord (SSLSocketImpl.java:1086)
    at sun.security.ssl.SSLSocketImpl.performInitialHandshake (SSLSocketImpl.java:1332)
    at sun.security.ssl.SSLSocketImpl.startHandshake (SSLSocketImpl.java:1359)
    at sun.security.ssl.SSLSocketImpl.startHandshake (SSLSocketImpl.java:1343)
    at org.apache.maven.wagon.providers.http.httpclient.conn.ssl.SSLConnectionSocketFactory.createLayeredSocket
(SSLConnectionSocketFactory.java:394)
    at org.apache.maven.wagon.providers.http.httpclient.conn.ssl.SSLConnectionSocketFactory.connectSocket
(SSLConnectionSocketFactory.java:353)
    at org.apache.maven.wagon.providers.http.httpclient.impl.conn.DefaultHttpClientConnectionOperator.connect
(DefaultHttpClientConnectionOperator.java:141)
    at org.apache.maven.wagon.providers.http.httpclient.impl.conn.PoolingHttpClientConnectionManager.connect
(PoolingHttpClientConnectionManager.java:353)
    at org.apache.maven.wagon.providers.http.httpclient.impl.execchain.MainClientExec.establishRoute
(MainClientExec.java:380)
    at org.apache.maven.wagon.providers.http.httpclient.impl.execchain.MainClientExec.execute
(MainClientExec.java:236)
    at org.apache.maven.wagon.providers.http.httpclient.impl.execchain.ProtocolExec.execute
(ProtocolExec.java:184)
    at org.apache.maven.wagon.providers.http.httpclient.impl.execchain.RetryExec.execute (RetryExec.java:88)
    at org.apache.maven.wagon.providers.http.httpclient.impl.execchain.RedirectExec.execute
(RedirectExec.java:110)
    at org.apache.maven.wagon.providers.http.httpclient.impl.client.InternalHttpClient.doExecute
(InternalHttpClient.java:184)
    at org.apache.maven.wagon.providers.http.httpclient.impl.client.CloseableHttpClient.execute
(CloseableHttpClient.java:82)
    at org.apache.maven.wagon.providers.http.AbstractHttpClientWagon.execute (AbstractHttpClientWagon.java:834)
    at org.apache.maven.wagon.providers.http.AbstractHttpClientWagon.fillInputData (AbstractHttpClientWagon.java:985)
    at org.apache.maven.wagon.providers.http.AbstractHttpClientWagon.fillInputData (AbstractHttpClientWagon.java:962)
    at org.apache.maven.wagon.StreamWagon.getInputStream (StreamWagon.java:126)
    at org.apache.maven.wagon.StreamWagon.getIfNewer (StreamWagon.java:88)
    at org.apache.maven.wagon.StreamWagon.get (StreamWagon.java:61)
    at org.eclipse.aether.transport.wagon.WagonTransporter$GetTaskRunner.run (WagonTransporter.java:567)
    at org.eclipse.aether.transport.wagon.WagonTransporter.execute (WagonTransporter.java:435)
    at org.eclipse.aether.transport.wagon.WagonTransporter.get (WagonTransporter.java:412)
    at org.eclipse.aether.connector.basic.BasicRepositoryConnector$GetTaskRunner.runTask (BasicRepositoryConnector.java:453)
    at org.eclipse.aether.connector.basic.BasicRepositoryConnector$TaskRunner.run (BasicRepositoryConnector.java:360)
    at org.eclipse.aether.util.concurrency.RunnableErrorForwarder$1.run (RunnableErrorForwarder.java:75)
    at org.eclipse.aether.connector.basic.BasicRepositoryConnector$DirectExecutor.execute
(BasicRepositoryConnector.java:583)
    at org.eclipse.aether.connector.basic.BasicRepositoryConnector.get (BasicRepositoryConnector.java:259)
    at org.eclipse.aether.internal.impl.DefaultArtifactResolver.performDownloads (DefaultArtifactResolver.java:498)
    at org.eclipse.aether.internal.impl.DefaultArtifactResolver.resolve (DefaultArtifactResolver.java:399)
    at org.eclipse.aether.internal.impl.DefaultArtifactResolver.resolveArtifacts (DefaultArtifactResolver.java:224)
    at org.eclipse.aether.internal.impl.DefaultArtifactResolver.resolveArtifact (DefaultArtifactResolver.java:201)
    at org.eclipse.aether.internal.impl.DefaultRepositorySystem.resolveArtifact (DefaultRepositorySystem.java:260)
    at org.apache.maven.project.ProjectModelResolver.resolveModel (ProjectModelResolver.java:193)
    at org.apache.maven.project.ProjectModelResolver.resolveModel (ProjectModelResolver.java:243)
    at org.apache.maven.model.building.DefaultModelBuilder.readParentExternally (DefaultModelBuilder.java:1051)
    at org.apache.maven.model.building.DefaultModelBuilder.readParent (DefaultModelBuilder.java:829)
    at org.apache.maven.model.building.DefaultModelBuilder.build (DefaultModelBuilder.java:331)
    at org.apache.maven.project.DefaultProjectBuilder.build (DefaultProjectBuilder.java:429)
    at org.apache.maven.project.DefaultProjectBuilder.build (DefaultProjectBuilder.java:398)
    at org.apache.maven.project.DefaultProjectBuilder.build (DefaultProjectBuilder.java:362)
    at org.apache.maven.graph.DefaultGraphBuilder.collectProjects (DefaultGraphBuilder.java:400)
    at org.apache.maven.graph.DefaultGraphBuilder.getProjectsForMavenReactor (DefaultGraphBuilder.java:391)
    at org.apache.maven.graph.DefaultGraphBuilder.build (DefaultGraphBuilder.java:78)
    at org.apache.maven.DefaultMaven.buildGraph (DefaultMaven.java:511)
    at org.apache.maven.DefaultMaven.doExecute (DefaultMaven.java:221)
    at org.apache.maven.DefaultMaven.doExecute (DefaultMaven.java:194)
    at org.apache.maven.DefaultMaven.execute (DefaultMaven.java:107)
    at org.apache.maven.cli.MavenCli.execute (MavenCli.java:955)
    at org.apache.maven.cli.MavenCli.doMain (MavenCli.java:290)
    at org.apache.maven.cli.MavenCli.main (MavenCli.java:194)
    at sun.reflect.NativeMethodAccessorImpl.invoke0 (Native Method)
    at sun.reflect.NativeMethodAccessorImpl.invoke (NativeMethodAccessorImpl.java:57)
    at sun.reflect.DelegatingMethodAccessorImpl.invoke (DelegatingMethodAccessorImpl.java:43)
    at java.lang.reflect.Method.invoke (Method.java:606)
    at org.codehaus.plexus.classworlds.launcher.Launcher.launchEnhanced (Launcher.java:289)
    at org.codehaus.plexus.classworlds.launcher.Launcher.launch (Launcher.java:229)
    at org.codehaus.plexus.classworlds.launcher.Launcher.mainWithExitCode (Launcher.java:415)
    at org.codehaus.plexus.classworlds.launcher.Launcher.main (Launcher.java:356)
[ERROR] 
[ERROR] Re-run Maven using the -X switch to enable full debug logging.
[ERROR] 
[ERROR] For more information about the errors and possible solutions, please read the following
articles:
[ERROR] [Help 1] http://cwiki.apache.org/confluence/display/MAVEN/ProjectBuildingException
[ERROR] [Help 2] http://cwiki.apache.org/confluence/display/MAVEN/UnresolvableModelException
[Pipeline] }
[Fast Archiver] No prior successful build to compare, so performing full copy of artifacts
[Pipeline] // withMaven
[Pipeline] }
[Pipeline] // stage
[Pipeline] }
[Pipeline] // dir
[Pipeline] }
[Pipeline] // node
[Pipeline] stage
[Pipeline] { (Notifications)
[Pipeline] echo
Build result: FAILURE
[Pipeline] jiraIssueSelector
[Pipeline] emailext
Mime
  • Unnamed multipart/mixed (inline, None, 0 bytes)
View raw message