maven-notifications mailing list archives

Site index · List index
Message view « Date » · « Thread »
Top « Date » · « Thread »
From Apache Jenkins Server <jenk...@builds.apache.org>
Subject Build failed in Jenkins: Maven TLP » maven-enforcer » master #37
Date Fri, 17 Aug 2018 05:34:59 GMT
See https://builds.apache.org/job/maven-box/job/maven-enforcer/job/master/37/

Changes:

* Upgrade latest version of Maven
* [INFRA-16893] set Windows to windows-2016-1 node
* Back to Windows label
* Windows + M3.5.x = M3.5.2
* [INFRA-16893] Trying workaround
* Revert "[INFRA-16893] Trying workaround"
* Try to display PATH value

6 tests failed.
FAILED:  org.apache.maven.plugins.enforcer.TestRequireEnvironmentVariable.testRuleWithRegex

Error Message:
This should not throw an exception

Stack Trace:
junit.framework.AssertionFailedError: This should not throw an exception
	at org.apache.maven.plugins.enforcer.TestRequireEnvironmentVariable.testRuleWithRegex(TestRequireEnvironmentVariable.java:107)


FAILED:  org.apache.maven.plugins.enforcer.TestRequireEnvironmentVariable.testRuleWithRegex

Error Message:
This should not throw an exception

Stack Trace:
junit.framework.AssertionFailedError: This should not throw an exception
	at org.apache.maven.plugins.enforcer.TestRequireEnvironmentVariable.testRuleWithRegex(TestRequireEnvironmentVariable.java:107)


FAILED:  org.apache.maven.plugins.enforcer.TestRequireEnvironmentVariable.testRuleWithRegex

Error Message:
This should not throw an exception

Stack Trace:
junit.framework.AssertionFailedError: This should not throw an exception
	at org.apache.maven.plugins.enforcer.TestRequireEnvironmentVariable.testRuleWithRegex(TestRequireEnvironmentVariable.java:107)


FAILED:  org.apache.maven.plugins.enforcer.TestRequireEnvironmentVariable.testRuleWithRegex

Error Message:
This should not throw an exception

Stack Trace:
junit.framework.AssertionFailedError: This should not throw an exception
	at org.apache.maven.plugins.enforcer.TestRequireEnvironmentVariable.testRuleWithRegex(TestRequireEnvironmentVariable.java:107)


FAILED:  org.apache.maven.plugins.enforcer.TestRequireEnvironmentVariable.testRuleWithRegex

Error Message:
This should not throw an exception

Stack Trace:
junit.framework.AssertionFailedError: This should not throw an exception
	at org.apache.maven.plugins.enforcer.TestRequireEnvironmentVariable.testRuleWithRegex(TestRequireEnvironmentVariable.java:107)


FAILED:  org.apache.maven.plugins.enforcer.TestRequireEnvironmentVariable.testRuleWithRegex

Error Message:
This should not throw an exception

Stack Trace:
junit.framework.AssertionFailedError: This should not throw an exception
	at org.apache.maven.plugins.enforcer.TestRequireEnvironmentVariable.testRuleWithRegex(TestRequireEnvironmentVariable.java:107)




Build log:
[...truncated 6.21 MB...]
[windows-jdk10-m3.5.x_build] [INFO] ------------------------------------------------------------------------
[windows-jdk10-m3.5.x_build] [INFO] Total time: 05:13 min
[windows-jdk10-m3.5.x_build] [INFO] Finished at: 2018-08-17T05:32:48Z
[windows-jdk10-m3.5.x_build] [INFO] Final Memory: 51M/174M
[windows-jdk10-m3.5.x_build] [INFO] ------------------------------------------------------------------------
[windows-jdk10-m3.5.x_build] [INFO] [jenkins-event-spy] Generated F:\jenkins\jenkins-slave\workspace\n-box_maven-enforcer_master-KHI64AG3D4VZKUKLMNAYHKONI5AIQBLJ5ZKYGGSW7DAZVXCJBFHQ@tmp\withMaven59557bde\maven-spy-20180817-052734-95511385545007981754952.log
[windows-jdk7-m3.5.x_build] [INFO]           require-release-dependencies\pom.xml ............. SUCCESS (6.9 s)
[windows-jdk7-m3.5.x_build] [INFO] Building: require-release-dependencies-excludes\pom.xml
[Pipeline] [windows-jdk9-m3.5.x_build] }
[windows-jdk9-m3.5.x_build] [withMaven] artifactsPublisher - Archive artifact windows-jdk9-m3.5.x_build\pom.xml under org\apache\maven\enforcer\enforcer\3.0.0-SNAPSHOT\enforcer-3.0.0-SNAPSHOT.pom
[windows-jdk9-m3.5.x_build] [withMaven] artifactsPublisher - Archive artifact windows-jdk9-m3.5.x_build\target\enforcer-3.0.0-SNAPSHOT-site.xml under org\apache\maven\enforcer\enforcer\3.0.0-SNAPSHOT\enforcer-3.0.0-SNAPSHOT-site.xml
[windows-jdk9-m3.5.x_build] [withMaven] artifactsPublisher - Archive artifact windows-jdk9-m3.5.x_build\enforcer-api\pom.xml under org\apache\maven\enforcer\enforcer-api\3.0.0-SNAPSHOT\enforcer-api-3.0.0-SNAPSHOT.pom
[windows-jdk9-m3.5.x_build] [withMaven] artifactsPublisher - Archive artifact windows-jdk9-m3.5.x_build\enforcer-api\target\enforcer-api-3.0.0-SNAPSHOT.jar under org\apache\maven\enforcer\enforcer-api\3.0.0-SNAPSHOT\enforcer-api-3.0.0-SNAPSHOT.jar
[windows-jdk9-m3.5.x_build] [withMaven] artifactsPublisher - Archive artifact windows-jdk9-m3.5.x_build\enforcer-rules\pom.xml under org\apache\maven\enforcer\enforcer-rules\3.0.0-SNAPSHOT\enforcer-rules-3.0.0-SNAPSHOT.pom
[windows-jdk9-m3.5.x_build] [withMaven] artifactsPublisher - Archive artifact windows-jdk9-m3.5.x_build\enforcer-rules\target\enforcer-rules-3.0.0-SNAPSHOT.jar under org\apache\maven\enforcer\enforcer-rules\3.0.0-SNAPSHOT\enforcer-rules-3.0.0-SNAPSHOT.jar
[windows-jdk9-m3.5.x_build] [withMaven] artifactsPublisher - Archive artifact windows-jdk9-m3.5.x_build\enforcer-rules\target\enforcer-rules-3.0.0-SNAPSHOT-tests.jar under org\apache\maven\enforcer\enforcer-rules\3.0.0-SNAPSHOT\enforcer-rules-3.0.0-SNAPSHOT-tests.jar
[windows-jdk9-m3.5.x_build] [withMaven] artifactsPublisher - Archive artifact windows-jdk9-m3.5.x_build\maven-enforcer-plugin\pom.xml under org\apache\maven\plugins\maven-enforcer-plugin\3.0.0-SNAPSHOT\maven-enforcer-plugin-3.0.0-SNAPSHOT.pom
[windows-jdk9-m3.5.x_build] [withMaven] artifactsPublisher - Archive artifact windows-jdk9-m3.5.x_build\maven-enforcer-plugin\target\maven-enforcer-plugin-3.0.0-SNAPSHOT.jar under org\apache\maven\plugins\maven-enforcer-plugin\3.0.0-SNAPSHOT\maven-enforcer-plugin-3.0.0-SNAPSHOT.jar
[windows-jdk9-m3.5.x_build] [withMaven] invokerPublisher - Archive invoker results for Maven artifact MavenArtifact{org.apache.maven.plugins:maven-enforcer-plugin::3.0.0-SNAPSHOT(version: 3.0.0-SNAPSHOT, snapshot:false) } generated by PluginInvocation{org.apache.maven.plugins:maven-invoker-plugin:3.0.1@run  integration-test}: windows-jdk9-m3.5.x_build\maven-enforcer-plugin\target\invoker-reports\*.xml
[windows-jdk9-m3.5.x_build] performing MavenInvokerRecorder, reportsFilenamePattern:'**/windows-jdk9-m3.5.x_build\maven-enforcer-plugin\target\invoker-reports/BUILD*.xml', invokerBuildDir:'**/windows-jdk9-m3.5.x_build\maven-enforcer-plugin\target\it'
[windows-jdk9-m3.5.x_build] Found reports:[f:\jenkins\jenkins-slave\workspace\n-box_maven-enforcer_master-KHI64AG3D4VZKUKLMNAYHKONI5AIQBLJ5ZKYGGSW7DAZVXCJBFHQ@2\windows-jdk9-m3.5.x_build\maven-enforcer-plugin\target\invoker-reports\BUILD-always-fail-warn.xml, f:\jenkins\jenkins-slave\workspace\n-box_maven-enforcer_master-KHI64AG3D4VZKUKLMNAYHKONI5AIQBLJ5ZKYGGSW7DAZVXCJBFHQ@2\windows-jdk9-m3.5.x_build\maven-enforcer-plugin\target\invoker-reports\BUILD-always-fail.xml, f:\jenkins\jenkins-slave\workspace\n-box_maven-enforcer_master-KHI64AG3D4VZKUKLMNAYHKONI5AIQBLJ5ZKYGGSW7DAZVXCJBFHQ@2\windows-jdk9-m3.5.x_build\maven-enforcer-plugin\target\invoker-reports\BUILD-always-pass.xml, f:\jenkins\jenkins-slave\workspace\n-box_maven-enforcer_master-KHI64AG3D4VZKUKLMNAYHKONI5AIQBLJ5ZKYGGSW7DAZVXCJBFHQ@2\windows-jdk9-m3.5.x_build\maven-enforcer-plugin\target\invoker-reports\BUILD-ban-distribution-management-multi-module-build.xml, f:\jenkins\jenkins-slave\workspace\n-box_maven-enforcer_master-KHI64AG3D4VZKUKLMNAYHKONI5AIQBLJ5ZKYGGSW7DAZVXCJBFHQ@2\windows-jdk9-m3.5.x_build\maven-enforcer-plugin\target\invoker-reports\BUILD-ban-distribution-management-multi-module-except-site.xml, f:\jenkins\jenkins-slave\workspace\n-box_maven-enforcer_master-KHI64AG3D4VZKUKLMNAYHKONI5AIQBLJ5ZKYGGSW7DAZVXCJBFHQ@2\windows-jdk9-m3.5.x_build\maven-enforcer-plugin\target\invoker-reports\BUILD-ban-distribution-management.xml, f:\jenkins\jenkins-slave\workspace\n-box_maven-enforcer_master-KHI64AG3D4VZKUKLMNAYHKONI5AIQBLJ5ZKYGGSW7DAZVXCJBFHQ@2\windows-jdk9-m3.5.x_build\maven-enforcer-plugin\target\invoker-reports\BUILD-ban-pom-dependency-version.xml, f:\jenkins\jenkins-slave\workspace\n-box_maven-enforcer_master-KHI64AG3D4VZKUKLMNAYHKONI5AIQBLJ5ZKYGGSW7DAZVXCJBFHQ@2\windows-jdk9-m3.5.x_build\maven-enforcer-plugin\target\invoker-reports\BUILD-ban-transitive-dependencies-fail.xml, f:\jenkins\jenkins-slave\workspace\n-box_maven-enforcer_master-KHI64AG3D4VZKUKLMNAYHKONI5AIQBLJ5ZKYGGSW7DAZVXCJBFHQ@2\windows-jdk9-m3.5.x_build\maven-enforcer-plugin\target\invoker-reports\BUILD-ban-transitive-dependencies.xml, f:\jenkins\jenkins-slave\workspace\n-box_maven-enforcer_master-KHI64AG3D4VZKUKLMNAYHKONI5AIQBLJ5ZKYGGSW7DAZVXCJBFHQ@2\windows-jdk9-m3.5.x_build\maven-enforcer-plugin\target\invoker-reports\BUILD-banned-dependencies-versionrange-fail.xml, f:\jenkins\jenkins-slave\workspace\n-box_maven-enforcer_master-KHI64AG3D4VZKUKLMNAYHKONI5AIQBLJ5ZKYGGSW7DAZVXCJBFHQ@2\windows-jdk9-m3.5.x_build\maven-enforcer-plugin\target\invoker-reports\BUILD-banned-dependencies-versionrange.xml, f:\jenkins\jenkins-slave\workspace\n-box_maven-enforcer_master-KHI64AG3D4VZKUKLMNAYHKONI5AIQBLJ5ZKYGGSW7DAZVXCJBFHQ@2\windows-jdk9-m3.5.x_build\maven-enforcer-plugin\target\invoker-reports\BUILD-banned-dependencies-wildcards.xml, f:\jenkins\jenkins-slave\workspace\n-box_maven-enforcer_master-KHI64AG3D4VZKUKLMNAYHKONI5AIQBLJ5ZKYGGSW7DAZVXCJBFHQ@2\windows-jdk9-m3.5.x_build\maven-enforcer-plugin\target\invoker-reports\BUILD-banned-dependencies.xml, f:\jenkins\jenkins-slave\workspace\n-box_maven-enforcer_master-KHI64AG3D4VZKUKLMNAYHKONI5AIQBLJ5ZKYGGSW7DAZVXCJBFHQ@2\windows-jdk9-m3.5.x_build\maven-enforcer-plugin\target\invoker-reports\BUILD-banned-plugins.xml, f:\jenkins\jenkins-slave\workspace\n-box_maven-enforcer_master-KHI64AG3D4VZKUKLMNAYHKONI5AIQBLJ5ZKYGGSW7DAZVXCJBFHQ@2\windows-jdk9-m3.5.x_build\maven-enforcer-plugin\target\invoker-reports\BUILD-builds_a_pom_noop.xml, f:\jenkins\jenkins-slave\workspace\n-box_maven-enforcer_master-KHI64AG3D4VZKUKLMNAYHKONI5AIQBLJ5ZKYGGSW7DAZVXCJBFHQ@2\windows-jdk9-m3.5.x_build\maven-enforcer-plugin\target\invoker-reports\BUILD-cli-always-fail.xml, f:\jenkins\jenkins-slave\workspace\n-box_maven-enforcer_master-KHI64AG3D4VZKUKLMNAYHKONI5AIQBLJ5ZKYGGSW7DAZVXCJBFHQ@2\windows-jdk9-m3.5.x_build\maven-enforcer-plugin\target\invoker-reports\BUILD-cli-always-pass.xml, f:\jenkins\jenkins-slave\workspace\n-box_maven-enforcer_master-KHI64AG3D4VZKUKLMNAYHKONI5AIQBLJ5ZKYGGSW7DAZVXCJBFHQ@2\windows-jdk9-m3.5.x_build\maven-enforcer-plugin\target\invoker-reports\BUILD-dependencies_converge.xml, f:\jenkins\jenkins-slave\workspace\n-box_maven-enforcer_master-KHI64AG3D4VZKUKLMNAYHKONI5AIQBLJ5ZKYGGSW7DAZVXCJBFHQ@2\windows-jdk9-m3.5.x_build\maven-enforcer-plugin\target\invoker-reports\BUILD-dependencies_not_converging.xml, f:\jenkins\jenkins-slave\workspace\n-box_maven-enforcer_master-KHI64AG3D4VZKUKLMNAYHKONI5AIQBLJ5ZKYGGSW7DAZVXCJBFHQ@2\windows-jdk9-m3.5.x_build\maven-enforcer-plugin\target\invoker-reports\BUILD-dependencies_not_converging_test_scope.xml, f:\jenkins\jenkins-slave\workspace\n-box_maven-enforcer_master-KHI64AG3D4VZKUKLMNAYHKONI5AIQBLJ5ZKYGGSW7DAZVXCJBFHQ@2\windows-jdk9-m3.5.x_build\maven-enforcer-plugin\target\invoker-reports\BUILD-display-info.xml, f:\jenkins\jenkins-slave\workspace\n-box_maven-enforcer_master-KHI64AG3D4VZKUKLMNAYHKONI5AIQBLJ5ZKYGGSW7DAZVXCJBFHQ@2\windows-jdk9-m3.5.x_build\maven-enforcer-plugin\target\invoker-reports\BUILD-evaluate-beanshell.xml, f:\jenkins\jenkins-slave\workspace\n-box_maven-enforcer_master-KHI64AG3D4VZKUKLMNAYHKONI5AIQBLJ5ZKYGGSW7DAZVXCJBFHQ@2\windows-jdk9-m3.5.x_build\maven-enforcer-plugin\target\invoker-reports\BUILD-multimodule.xml, f:\jenkins\jenkins-slave\workspace\n-box_maven-enforcer_master-KHI64AG3D4VZKUKLMNAYHKONI5AIQBLJ5ZKYGGSW7DAZVXCJBFHQ@2\windows-jdk9-m3.5.x_build\maven-enforcer-plugin\target\invoker-reports\BUILD-require-active-profile-all.xml, f:\jenkins\jenkins-slave\workspace\n-box_maven-enforcer_master-KHI64AG3D4VZKUKLMNAYHKONI5AIQBLJ5ZKYGGSW7DAZVXCJBFHQ@2\windows-jdk9-m3.5.x_build\maven-enforcer-plugin\target\invoker-reports\BUILD-require-active-profile-from-settings.xml, f:\jenkins\jenkins-slave\workspace\n-box_maven-enforcer_master-KHI64AG3D4VZKUKLMNAYHKONI5AIQBLJ5ZKYGGSW7DAZVXCJBFHQ@2\windows-jdk9-m3.5.x_build\maven-enforcer-plugin\target\invoker-reports\BUILD-require-active-profile.xml, f:\jenkins\jenkins-slave\workspace\n-box_maven-enforcer_master-KHI64AG3D4VZKUKLMNAYHKONI5AIQBLJ5ZKYGGSW7DAZVXCJBFHQ@2\windows-jdk9-m3.5.x_build\maven-enforcer-plugin\target\invoker-reports\BUILD-require-file-checksum.xml, f:\jenkins\jenkins-slave\workspace\n-box_maven-enforcer_master-KHI64AG3D4VZKUKLMNAYHKONI5AIQBLJ5ZKYGGSW7DAZVXCJBFHQ@2\windows-jdk9-m3.5.x_build\maven-enforcer-plugin\target\invoker-reports\BUILD-require-files-dont-exist.xml, f:\jenkins\jenkins-slave\workspace\n-box_maven-enforcer_master-KHI64AG3D4VZKUKLMNAYHKONI5AIQBLJ5ZKYGGSW7DAZVXCJBFHQ@2\windows-jdk9-m3.5.x_build\maven-enforcer-plugin\target\invoker-reports\BUILD-require-files-exist.xml, f:\jenkins\jenkins-slave\workspace\n-box_maven-enforcer_master-KHI64AG3D4VZKUKLMNAYHKONI5AIQBLJ5ZKYGGSW7DAZVXCJBFHQ@2\windows-jdk9-m3.5.x_build\maven-enforcer-plugin\target\invoker-reports\BUILD-require-files-size.xml, f:\jenkins\jenkins-slave\workspace\n-box_maven-enforcer_master-KHI64AG3D4VZKUKLMNAYHKONI5AIQBLJ5ZKYGGSW7DAZVXCJBFHQ@2\windows-jdk9-m3.5.x_build\maven-enforcer-plugin\target\invoker-reports\BUILD-require-java-version.xml, f:\jenkins\jenkins-slave\workspace\n-box_maven-enforcer_master-KHI64AG3D4VZKUKLMNAYHKONI5AIQBLJ5ZKYGGSW7DAZVXCJBFHQ@2\windows-jdk9-m3.5.x_build\maven-enforcer-plugin\target\invoker-reports\BUILD-require-maven-version.xml, f:\jenkins\jenkins-slave\workspace\n-box_maven-enforcer_master-KHI64AG3D4VZKUKLMNAYHKONI5AIQBLJ5ZKYGGSW7DAZVXCJBFHQ@2\windows-jdk9-m3.5.x_build\maven-enforcer-plugin\target\invoker-reports\BUILD-require-no-repositories-allow-plugin-repo.xml, f:\jenkins\jenkins-slave\workspace\n-box_maven-enforcer_master-KHI64AG3D4VZKUKLMNAYHKONI5AIQBLJ5ZKYGGSW7DAZVXCJBFHQ@2\windows-jdk9-m3.5.x_build\maven-enforcer-plugin\target\invoker-reports\BUILD-require-no-repositories-allow-repo.xml, f:\jenkins\jenkins-slave\workspace\n-box_maven-enforcer_master-KHI64AG3D4VZKUKLMNAYHKONI5AIQBLJ5ZKYGGSW7DAZVXCJBFHQ@2\windows-jdk9-m3.5.x_build\maven-enforcer-plugin\target\invoker-reports\BUILD-require-no-repositories.xml, f:\jenkins\jenkins-slave\workspace\n-box_maven-enforcer_master-KHI64AG3D4VZKUKLMNAYHKONI5AIQBLJ5ZKYGGSW7DAZVXCJBFHQ@2\windows-jdk9-m3.5.x_build\maven-enforcer-plugin\target\invoker-reports\BUILD-require-no-repositories_failure.xml, f:\jenkins\jenkins-slave\workspace\n-box_maven-enforcer_master-KHI64AG3D4VZKUKLMNAYHKONI5AIQBLJ5ZKYGGSW7DAZVXCJBFHQ@2\windows-jdk9-m3.5.x_build\maven-enforcer-plugin\target\invoker-reports\BUILD-require-no-repositories_failure_allowed-plugin-repo.xml, f:\jenkins\jenkins-slave\workspace\n-box_maven-enforcer_master-KHI64AG3D4VZKUKLMNAYHKONI5AIQBLJ5ZKYGGSW7DAZVXCJBFHQ@2\windows-jdk9-m3.5.x_build\maven-enforcer-plugin\target\invoker-reports\BUILD-require-no-repositories_failure_plugin-repositories.xml, f:\jenkins\jenkins-slave\workspace\n-box_maven-enforcer_master-KHI64AG3D4VZKUKLMNAYHKONI5AIQBLJ5ZKYGGSW7DAZVXCJBFHQ@2\windows-jdk9-m3.5.x_build\maven-enforcer-plugin\target\invoker-reports\BUILD-require-no-repositories_failure_repositories.xml, f:\jenkins\jenkins-slave\workspace\n-box_maven-enforcer_master-KHI64AG3D4VZKUKLMNAYHKONI5AIQBLJ5ZKYGGSW7DAZVXCJBFHQ@2\windows-jdk9-m3.5.x_build\maven-enforcer-plugin\target\invoker-reports\BUILD-require-no-repositories_mm.xml, f:\jenkins\jenkins-slave\workspace\n-box_maven-enforcer_master-KHI64AG3D4VZKUKLMNAYHKONI5AIQBLJ5ZKYGGSW7DAZVXCJBFHQ@2\windows-jdk9-m3.5.x_build\maven-enforcer-plugin\target\invoker-reports\BUILD-require-no-repositories_mm_ci.xml, f:\jenkins\jenkins-slave\workspace\n-box_maven-enforcer_master-KHI64AG3D4VZKUKLMNAYHKONI5AIQBLJ5ZKYGGSW7DAZVXCJBFHQ@2\windows-jdk9-m3.5.x_build\maven-enforcer-plugin\target\invoker-reports\BUILD-require-plugin-versions-ci.xml, f:\jenkins\jenkins-slave\workspace\n-box_maven-enforcer_master-KHI64AG3D4VZKUKLMNAYHKONI5AIQBLJ5ZKYGGSW7DAZVXCJBFHQ@2\windows-jdk9-m3.5.x_build\maven-enforcer-plugin\target\invoker-reports\BUILD-require-plugin-versions-custom-packaging.xml, f:\jenkins\jenkins-slave\workspace\n-box_maven-enforcer_master-KHI64AG3D4VZKUKLMNAYHKONI5AIQBLJ5ZKYGGSW7DAZVXCJBFHQ@2\windows-jdk9-m3.5.x_build\maven-enforcer-plugin\target\invoker-reports\BUILD-require-plugin-versions-expressions.xml, f:\jenkins\jenkins-slave\workspace\n-box_maven-enforcer_master-KHI64AG3D4VZKUKLMNAYHKONI5AIQBLJ5ZKYGGSW7DAZVXCJBFHQ@2\windows-jdk9-m3.5.x_build\maven-enforcer-plugin\target\invoker-reports\BUILD-require-plugin-versions-mm-ci-friendly.xml, f:\jenkins\jenkins-slave\workspace\n-box_maven-enforcer_master-KHI64AG3D4VZKUKLMNAYHKONI5AIQBLJ5ZKYGGSW7DAZVXCJBFHQ@2\windows-jdk9-m3.5.x_build\maven-enforcer-plugin\target\invoker-reports\BUILD-require-plugin-versions-plugin-with-extensions.xml, f:\jenkins\jenkins-slave\workspace\n-box_maven-enforcer_master-KHI64AG3D4VZKUKLMNAYHKONI5AIQBLJ5ZKYGGSW7DAZVXCJBFHQ@2\windows-jdk9-m3.5.x_build\maven-enforcer-plugin\target\invoker-reports\BUILD-require-plugin-versions-plugin-with-integration-test-lifecycle.xml, f:\jenkins\jenkins-slave\workspace\n-box_maven-enforcer_master-KHI64AG3D4VZKUKLMNAYHKONI5AIQBLJ5ZKYGGSW7DAZVXCJBFHQ@2\windows-jdk9-m3.5.x_build\maven-enforcer-plugin\target\invoker-reports\BUILD-require-plugin-versions-projectGAVexpressions.xml, f:\jenkins\jenkins-slave\workspace\n-box_maven-enforcer_master-KHI64AG3D4VZKUKLMNAYHKONI5AIQBLJ5ZKYGGSW7DAZVXCJBFHQ@2\windows-jdk9-m3.5.x_build\maven-enforcer-plugin\target\invoker-reports\BUILD-require-plugin-versions.xml, f:\jenkins\jenkins-slave\workspace\n-box_maven-enforcer_master-KHI64AG3D4VZKUKLMNAYHKONI5AIQBLJ5ZKYGGSW7DAZVXCJBFHQ@2\windows-jdk9-m3.5.x_build\maven-enforcer-plugin\target\invoker-reports\BUILD-require-profile-ids-exist_failure.xml, f:\jenkins\jenkins-slave\workspace\n-box_maven-enforcer_master-KHI64AG3D4VZKUKLMNAYHKONI5AIQBLJ5ZKYGGSW7DAZVXCJBFHQ@2\windows-jdk9-m3.5.x_build\maven-enforcer-plugin\target\invoker-reports\BUILD-require-profile-ids-exist_success.xml, f:\jenkins\jenkins-slave\workspace\n-box_maven-enforcer_master-KHI64AG3D4VZKUKLMNAYHKONI5AIQBLJ5ZKYGGSW7DAZVXCJBFHQ@2\windows-jdk9-m3.5.x_build\maven-enforcer-plugin\target\invoker-reports\BUILD-require-property.xml, f:\jenkins\jenkins-slave\workspace\n-box_maven-enforcer_master-KHI64AG3D4VZKUKLMNAYHKONI5AIQBLJ5ZKYGGSW7DAZVXCJBFHQ@2\windows-jdk9-m3.5.x_build\maven-enforcer-plugin\target\invoker-reports\BUILD-require-release-dependencies-excludes.xml, f:\jenkins\jenkins-slave\workspace\n-box_maven-enforcer_master-KHI64AG3D4VZKUKLMNAYHKONI5AIQBLJ5ZKYGGSW7DAZVXCJBFHQ@2\windows-jdk9-m3.5.x_build\maven-enforcer-plugin\target\invoker-reports\BUILD-require-release-dependencies-excludes_failure.xml, f:\jenkins\jenkins-slave\workspace\n-box_maven-enforcer_master-KHI64AG3D4VZKUKLMNAYHKONI5AIQBLJ5ZKYGGSW7DAZVXCJBFHQ@2\windows-jdk9-m3.5.x_build\maven-enforcer-plugin\target\invoker-reports\BUILD-require-release-dependencies.xml, f:\jenkins\jenkins-slave\workspace\n-box_maven-enforcer_master-KHI64AG3D4VZKUKLMNAYHKONI5AIQBLJ5ZKYGGSW7DAZVXCJBFHQ@2\windows-jdk9-m3.5.x_build\maven-enforcer-plugin\target\invoker-reports\BUILD-require-release-version.xml, f:\jenkins\jenkins-slave\workspace\n-box_maven-enforcer_master-KHI64AG3D4VZKUKLMNAYHKONI5AIQBLJ5ZKYGGSW7DAZVXCJBFHQ@2\windows-jdk9-m3.5.x_build\maven-enforcer-plugin\target\invoker-reports\BUILD-require-same-versions_failure.xml, f:\jenkins\jenkins-slave\workspace\n-box_maven-enforcer_master-KHI64AG3D4VZKUKLMNAYHKONI5AIQBLJ5ZKYGGSW7DAZVXCJBFHQ@2\windows-jdk9-m3.5.x_build\maven-enforcer-plugin\target\invoker-reports\BUILD-require-same-versions_success.xml, f:\jenkins\jenkins-slave\workspace\n-box_maven-enforcer_master-KHI64AG3D4VZKUKLMNAYHKONI5AIQBLJ5ZKYGGSW7DAZVXCJBFHQ@2\windows-jdk9-m3.5.x_build\maven-enforcer-plugin\target\invoker-reports\BUILD-require-snapshot-version_failure.xml, f:\jenkins\jenkins-slave\workspace\n-box_maven-enforcer_master-KHI64AG3D4VZKUKLMNAYHKONI5AIQBLJ5ZKYGGSW7DAZVXCJBFHQ@2\windows-jdk9-m3.5.x_build\maven-enforcer-plugin\target\invoker-reports\BUILD-require-snapshot-version_success.xml, f:\jenkins\jenkins-slave\workspace\n-box_maven-enforcer_master-KHI64AG3D4VZKUKLMNAYHKONI5AIQBLJ5ZKYGGSW7DAZVXCJBFHQ@2\windows-jdk9-m3.5.x_build\maven-enforcer-plugin\target\invoker-reports\BUILD-require-upper-bound-dependencies-managed_failure.xml, f:\jenkins\jenkins-slave\workspace\n-box_maven-enforcer_master-KHI64AG3D4VZKUKLMNAYHKONI5AIQBLJ5ZKYGGSW7DAZVXCJBFHQ@2\windows-jdk9-m3.5.x_build\maven-enforcer-plugin\target\invoker-reports\BUILD-require-upper-bound-dependencies-managed_success.xml, f:\jenkins\jenkins-slave\workspace\n-box_maven-enforcer_master-KHI64AG3D4VZKUKLMNAYHKONI5AIQBLJ5ZKYGGSW7DAZVXCJBFHQ@2\windows-jdk9-m3.5.x_build\maven-enforcer-plugin\target\invoker-reports\BUILD-require-upper-bound-dependencies-unique_failure.xml, f:\jenkins\jenkins-slave\workspace\n-box_maven-enforcer_master-KHI64AG3D4VZKUKLMNAYHKONI5AIQBLJ5ZKYGGSW7DAZVXCJBFHQ@2\windows-jdk9-m3.5.x_build\maven-enforcer-plugin\target\invoker-reports\BUILD-require-upper-bound-dependencies-unique_success.xml, f:\jenkins\jenkins-slave\workspace\n-box_maven-enforcer_master-KHI64AG3D4VZKUKLMNAYHKONI5AIQBLJ5ZKYGGSW7DAZVXCJBFHQ@2\windows-jdk9-m3.5.x_build\maven-enforcer-plugin\target\invoker-reports\BUILD-require-upper-bound-deps_failure.xml, f:\jenkins\jenkins-slave\workspace\n-box_maven-enforcer_master-KHI64AG3D4VZKUKLMNAYHKONI5AIQBLJ5ZKYGGSW7DAZVXCJBFHQ@2\windows-jdk9-m3.5.x_build\maven-enforcer-plugin\target\invoker-reports\BUILD-require-upper-bound-deps_ignored.xml, f:\jenkins\jenkins-slave\workspace\n-box_maven-enforcer_master-KHI64AG3D4VZKUKLMNAYHKONI5AIQBLJ5ZKYGGSW7DAZVXCJBFHQ@2\windows-jdk9-m3.5.x_build\maven-enforcer-plugin\target\invoker-reports\BUILD-require-upper-bound-deps_success.xml, f:\jenkins\jenkins-slave\workspace\n-box_maven-enforcer_master-KHI64AG3D4VZKUKLMNAYHKONI5AIQBLJ5ZKYGGSW7DAZVXCJBFHQ@2\windows-jdk9-m3.5.x_build\maven-enforcer-plugin\target\invoker-reports\BUILD-resolve_collect_dependencies.xml]
[windows-jdk9-m3.5.x_build] Found logs:[f:\jenkins\jenkins-slave\workspace\n-box_maven-enforcer_master-KHI64AG3D4VZKUKLMNAYHKONI5AIQBLJ5ZKYGGSW7DAZVXCJBFHQ@2\windows-jdk9-m3.5.x_build\maven-enforcer-plugin\target\it\always-fail-warn\build.log, f:\jenkins\jenkins-slave\workspace\n-box_maven-enforcer_master-KHI64AG3D4VZKUKLMNAYHKONI5AIQBLJ5ZKYGGSW7DAZVXCJBFHQ@2\windows-jdk9-m3.5.x_build\maven-enforcer-plugin\target\it\always-fail\build.log, f:\jenkins\jenkins-slave\workspace\n-box_maven-enforcer_master-KHI64AG3D4VZKUKLMNAYHKONI5AIQBLJ5ZKYGGSW7DAZVXCJBFHQ@2\windows-jdk9-m3.5.x_build\maven-enforcer-plugin\target\it\always-pass\build.log, f:\jenkins\jenkins-slave\workspace\n-box_maven-enforcer_master-KHI64AG3D4VZKUKLMNAYHKONI5AIQBLJ5ZKYGGSW7DAZVXCJBFHQ@2\windows-jdk9-m3.5.x_build\maven-enforcer-plugin\target\it\ban-distribution-management-multi-module-build\build.log, f:\jenkins\jenkins-slave\workspace\n-box_maven-enforcer_master-KHI64AG3D4VZKUKLMNAYHKONI5AIQBLJ5ZKYGGSW7DAZVXCJBFHQ@2\windows-jdk9-m3.5.x_build\maven-enforcer-plugin\target\it\ban-distribution-management-multi-module-except-site\build.log, f:\jenkins\jenkins-slave\workspace\n-box_maven-enforcer_master-KHI64AG3D4VZKUKLMNAYHKONI5AIQBLJ5ZKYGGSW7DAZVXCJBFHQ@2\windows-jdk9-m3.5.x_build\maven-enforcer-plugin\target\it\ban-distribution-management\build.log, f:\jenkins\jenkins-slave\workspace\n-box_maven-enforcer_master-KHI64AG3D4VZKUKLMNAYHKONI5AIQBLJ5ZKYGGSW7DAZVXCJBFHQ@2\windows-jdk9-m3.5.x_build\maven-enforcer-plugin\target\it\ban-pom-dependency-version\build.log, f:\jenkins\jenkins-slave\workspace\n-box_maven-enforcer_master-KHI64AG3D4VZKUKLMNAYHKONI5AIQBLJ5ZKYGGSW7DAZVXCJBFHQ@2\windows-jdk9-m3.5.x_build\maven-enforcer-plugin\target\it\ban-transitive-dependencies-fail\build.log, f:\jenkins\jenkins-slave\workspace\n-box_maven-enforcer_master-KHI64AG3D4VZKUKLMNAYHKONI5AIQBLJ5ZKYGGSW7DAZVXCJBFHQ@2\windows-jdk9-m3.5.x_build\maven-enforcer-plugin\target\it\ban-transitive-dependencies\build.log, f:\jenkins\jenkins-slave\workspace\n-box_maven-enforcer_master-KHI64AG3D4VZKUKLMNAYHKONI5AIQBLJ5ZKYGGSW7DAZVXCJBFHQ@2\windows-jdk9-m3.5.x_build\maven-enforcer-plugin\target\it\banned-dependencies-versionrange-fail\build.log, f:\jenkins\jenkins-slave\workspace\n-box_maven-enforcer_master-KHI64AG3D4VZKUKLMNAYHKONI5AIQBLJ5ZKYGGSW7DAZVXCJBFHQ@2\windows-jdk9-m3.5.x_build\maven-enforcer-plugin\target\it\banned-dependencies-versionrange\build.log, f:\jenkins\jenkins-slave\workspace\n-box_maven-enforcer_master-KHI64AG3D4VZKUKLMNAYHKONI5AIQBLJ5ZKYGGSW7DAZVXCJBFHQ@2\windows-jdk9-m3.5.x_build\maven-enforcer-plugin\target\it\banned-dependencies-wildcards\build.log, f:\jenkins\jenkins-slave\workspace\n-box_maven-enforcer_master-KHI64AG3D4VZKUKLMNAYHKONI5AIQBLJ5ZKYGGSW7DAZVXCJBFHQ@2\windows-jdk9-m3.5.x_build\maven-enforcer-plugin\target\it\banned-dependencies\build.log, f:\jenkins\jenkins-slave\workspace\n-box_maven-enforcer_master-KHI64AG3D4VZKUKLMNAYHKONI5AIQBLJ5ZKYGGSW7DAZVXCJBFHQ@2\windows-jdk9-m3.5.x_build\maven-enforcer-plugin\target\it\banned-plugins\build.log, f:\jenkins\jenkins-slave\workspace\n-box_maven-enforcer_master-KHI64AG3D4VZKUKLMNAYHKONI5AIQBLJ5ZKYGGSW7DAZVXCJBFHQ@2\windows-jdk9-m3.5.x_build\maven-enforcer-plugin\target\it\builds_a_pom_noop\build.log, f:\jenkins\jenkins-slave\workspace\n-box_maven-enforcer_master-KHI64AG3D4VZKUKLMNAYHKONI5AIQBLJ5ZKYGGSW7DAZVXCJBFHQ@2\windows-jdk9-m3.5.x_build\maven-enforcer-plugin\target\it\cli-always-fail\build.log, f:\jenkins\jenkins-slave\workspace\n-box_maven-enforcer_master-KHI64AG3D4VZKUKLMNAYHKONI5AIQBLJ5ZKYGGSW7DAZVXCJBFHQ@2\windows-jdk9-m3.5.x_build\maven-enforcer-plugin\target\it\cli-always-pass\build.log, f:\jenkins\jenkins-slave\workspace\n-box_maven-enforcer_master-KHI64AG3D4VZKUKLMNAYHKONI5AIQBLJ5ZKYGGSW7DAZVXCJBFHQ@2\windows-jdk9-m3.5.x_build\maven-enforcer-plugin\target\it\dependencies_converge\build.log, f:\jenkins\jenkins-slave\workspace\n-box_maven-enforcer_master-KHI64AG3D4VZKUKLMNAYHKONI5AIQBLJ5ZKYGGSW7DAZVXCJBFHQ@2\windows-jdk9-m3.5.x_build\maven-enforcer-plugin\target\it\dependencies_not_converging\build.log, f:\jenkins\jenkins-slave\workspace\n-box_maven-enforcer_master-KHI64AG3D4VZKUKLMNAYHKONI5AIQBLJ5ZKYGGSW7DAZVXCJBFHQ@2\windows-jdk9-m3.5.x_build\maven-enforcer-plugin\target\it\dependencies_not_converging_test_scope\build.log, f:\jenkins\jenkins-slave\workspace\n-box_maven-enforcer_master-KHI64AG3D4VZKUKLMNAYHKONI5AIQBLJ5ZKYGGSW7DAZVXCJBFHQ@2\windows-jdk9-m3.5.x_build\maven-enforcer-plugin\target\it\display-info\build.log, f:\jenkins\jenkins-slave\workspace\n-box_maven-enforcer_master-KHI64AG3D4VZKUKLMNAYHKONI5AIQBLJ5ZKYGGSW7DAZVXCJBFHQ@2\windows-jdk9-m3.5.x_build\maven-enforcer-plugin\target\it\evaluate-beanshell\build.log, f:\jenkins\jenkins-slave\workspace\n-box_maven-enforcer_master-KHI64AG3D4VZKUKLMNAYHKONI5AIQBLJ5ZKYGGSW7DAZVXCJBFHQ@2\windows-jdk9-m3.5.x_build\maven-enforcer-plugin\target\it\multimodule\build.log, f:\jenkins\jenkins-slave\workspace\n-box_maven-enforcer_master-KHI64AG3D4VZKUKLMNAYHKONI5AIQBLJ5ZKYGGSW7DAZVXCJBFHQ@2\windows-jdk9-m3.5.x_build\maven-enforcer-plugin\target\it\require-active-profile-all\build.log, f:\jenkins\jenkins-slave\workspace\n-box_maven-enforcer_master-KHI64AG3D4VZKUKLMNAYHKONI5AIQBLJ5ZKYGGSW7DAZVXCJBFHQ@2\windows-jdk9-m3.5.x_build\maven-enforcer-plugin\target\it\require-active-profile-from-settings\build.log, f:\jenkins\jenkins-slave\workspace\n-box_maven-enforcer_master-KHI64AG3D4VZKUKLMNAYHKONI5AIQBLJ5ZKYGGSW7DAZVXCJBFHQ@2\windows-jdk9-m3.5.x_build\maven-enforcer-plugin\target\it\require-active-profile\build.log, f:\jenkins\jenkins-slave\workspace\n-box_maven-enforcer_master-KHI64AG3D4VZKUKLMNAYHKONI5AIQBLJ5ZKYGGSW7DAZVXCJBFHQ@2\windows-jdk9-m3.5.x_build\maven-enforcer-plugin\target\it\require-file-checksum\build.log, f:\jenkins\jenkins-slave\workspace\n-box_maven-enforcer_master-KHI64AG3D4VZKUKLMNAYHKONI5AIQBLJ5ZKYGGSW7DAZVXCJBFHQ@2\windows-jdk9-m3.5.x_build\maven-enforcer-plugin\target\it\require-files-dont-exist\build.log, f:\jenkins\jenkins-slave\workspace\n-box_maven-enforcer_master-KHI64AG3D4VZKUKLMNAYHKONI5AIQBLJ5ZKYGGSW7DAZVXCJBFHQ@2\windows-jdk9-m3.5.x_build\maven-enforcer-plugin\target\it\require-files-exist\build.log, f:\jenkins\jenkins-slave\workspace\n-box_maven-enforcer_master-KHI64AG3D4VZKUKLMNAYHKONI5AIQBLJ5ZKYGGSW7DAZVXCJBFHQ@2\windows-jdk9-m3.5.x_build\maven-enforcer-plugin\target\it\require-files-size\build.log, f:\jenkins\jenkins-slave\workspace\n-box_maven-enforcer_master-KHI64AG3D4VZKUKLMNAYHKONI5AIQBLJ5ZKYGGSW7DAZVXCJBFHQ@2\windows-jdk9-m3.5.x_build\maven-enforcer-plugin\target\it\require-java-version\build.log, f:\jenkins\jenkins-slave\workspace\n-box_maven-enforcer_master-KHI64AG3D4VZKUKLMNAYHKONI5AIQBLJ5ZKYGGSW7DAZVXCJBFHQ@2\windows-jdk9-m3.5.x_build\maven-enforcer-plugin\target\it\require-maven-version\build.log, f:\jenkins\jenkins-slave\workspace\n-box_maven-enforcer_master-KHI64AG3D4VZKUKLMNAYHKONI5AIQBLJ5ZKYGGSW7DAZVXCJBFHQ@2\windows-jdk9-m3.5.x_build\maven-enforcer-plugin\target\it\require-no-repositories-allow-plugin-repo\build.log, f:\jenkins\jenkins-slave\workspace\n-box_maven-enforcer_master-KHI64AG3D4VZKUKLMNAYHKONI5AIQBLJ5ZKYGGSW7DAZVXCJBFHQ@2\windows-jdk9-m3.5.x_build\maven-enforcer-plugin\target\it\require-no-repositories-allow-repo\build.log, f:\jenkins\jenkins-slave\workspace\n-box_maven-enforcer_master-KHI64AG3D4VZKUKLMNAYHKONI5AIQBLJ5ZKYGGSW7DAZVXCJBFHQ@2\windows-jdk9-m3.5.x_build\maven-enforcer-plugin\target\it\require-no-repositories\build.log, f:\jenkins\jenkins-slave\workspace\n-box_maven-enforcer_master-KHI64AG3D4VZKUKLMNAYHKONI5AIQBLJ5ZKYGGSW7DAZVXCJBFHQ@2\windows-jdk9-m3.5.x_build\maven-enforcer-plugin\target\it\require-no-repositories_failure\build.log, f:\jenkins\jenkins-slave\workspace\n-box_maven-enforcer_master-KHI64AG3D4VZKUKLMNAYHKONI5AIQBLJ5ZKYGGSW7DAZVXCJBFHQ@2\windows-jdk9-m3.5.x_build\maven-enforcer-plugin\target\it\require-no-repositories_failure_allowed-plugin-repo\build.log, f:\jenkins\jenkins-slave\workspace\n-box_maven-enforcer_master-KHI64AG3D4VZKUKLMNAYHKONI5AIQBLJ5ZKYGGSW7DAZVXCJBFHQ@2\windows-jdk9-m3.5.x_build\maven-enforcer-plugin\target\it\require-no-repositories_failure_plugin-repositories\build.log, f:\jenkins\jenkins-slave\workspace\n-box_maven-enforcer_master-KHI64AG3D4VZKUKLMNAYHKONI5AIQBLJ5ZKYGGSW7DAZVXCJBFHQ@2\windows-jdk9-m3.5.x_build\maven-enforcer-plugin\target\it\require-no-repositories_failure_repositories\build.log, f:\jenkins\jenkins-slave\workspace\n-box_maven-enforcer_master-KHI64AG3D4VZKUKLMNAYHKONI5AIQBLJ5ZKYGGSW7DAZVXCJBFHQ@2\windows-jdk9-m3.5.x_build\maven-enforcer-plugin\target\it\require-no-repositories_mm\build.log, f:\jenkins\jenkins-slave\workspace\n-box_maven-enforcer_master-KHI64AG3D4VZKUKLMNAYHKONI5AIQBLJ5ZKYGGSW7DAZVXCJBFHQ@2\windows-jdk9-m3.5.x_build\maven-enforcer-plugin\target\it\require-no-repositories_mm_ci\build.log, f:\jenkins\jenkins-slave\workspace\n-box_maven-enforcer_master-KHI64AG3D4VZKUKLMNAYHKONI5AIQBLJ5ZKYGGSW7DAZVXCJBFHQ@2\windows-jdk9-m3.5.x_build\maven-enforcer-plugin\target\it\require-plugin-versions-ci\build.log, f:\jenkins\jenkins-slave\workspace\n-box_maven-enforcer_master-KHI64AG3D4VZKUKLMNAYHKONI5AIQBLJ5ZKYGGSW7DAZVXCJBFHQ@2\windows-jdk9-m3.5.x_build\maven-enforcer-plugin\target\it\require-plugin-versions-custom-packaging\build.log, f:\jenkins\jenkins-slave\workspace\n-box_maven-enforcer_master-KHI64AG3D4VZKUKLMNAYHKONI5AIQBLJ5ZKYGGSW7DAZVXCJBFHQ@2\windows-jdk9-m3.5.x_build\maven-enforcer-plugin\target\it\require-plugin-versions-expressions\build.log, f:\jenkins\jenkins-slave\workspace\n-box_maven-enforcer_master-KHI64AG3D4VZKUKLMNAYHKONI5AIQBLJ5ZKYGGSW7DAZVXCJBFHQ@2\windows-jdk9-m3.5.x_build\maven-enforcer-plugin\target\it\require-plugin-versions-mm-ci-friendly\build.log, f:\jenkins\jenkins-slave\workspace\n-box_maven-enforcer_master-KHI64AG3D4VZKUKLMNAYHKONI5AIQBLJ5ZKYGGSW7DAZVXCJBFHQ@2\windows-jdk9-m3.5.x_build\maven-enforcer-plugin\target\it\require-plugin-versions-plugin-with-extensions\build.log, f:\jenkins\jenkins-slave\workspace\n-box_maven-enforcer_master-KHI64AG3D4VZKUKLMNAYHKONI5AIQBLJ5ZKYGGSW7DAZVXCJBFHQ@2\windows-jdk9-m3.5.x_build\maven-enforcer-plugin\target\it\require-plugin-versions-plugin-with-integration-test-lifecycle\build.log, f:\jenkins\jenkins-slave\workspace\n-box_maven-enforcer_master-KHI64AG3D4VZKUKLMNAYHKONI5AIQBLJ5ZKYGGSW7DAZVXCJBFHQ@2\windows-jdk9-m3.5.x_build\maven-enforcer-plugin\target\it\require-plugin-versions-projectGAVexpressions\build.log, f:\jenkins\jenkins-slave\workspace\n-box_maven-enforcer_master-KHI64AG3D4VZKUKLMNAYHKONI5AIQBLJ5ZKYGGSW7DAZVXCJBFHQ@2\windows-jdk9-m3.5.x_build\maven-enforcer-plugin\target\it\require-plugin-versions\build.log, f:\jenkins\jenkins-slave\workspace\n-box_maven-enforcer_master-KHI64AG3D4VZKUKLMNAYHKONI5AIQBLJ5ZKYGGSW7DAZVXCJBFHQ@2\windows-jdk9-m3.5.x_build\maven-enforcer-plugin\target\it\require-profile-ids-exist_failure\build.log, f:\jenkins\jenkins-slave\workspace\n-box_maven-enforcer_master-KHI64AG3D4VZKUKLMNAYHKONI5AIQBLJ5ZKYGGSW7DAZVXCJBFHQ@2\windows-jdk9-m3.5.x_build\maven-enforcer-plugin\target\it\require-profile-ids-exist_success\build.log, f:\jenkins\jenkins-slave\workspace\n-box_maven-enforcer_master-KHI64AG3D4VZKUKLMNAYHKONI5AIQBLJ5ZKYGGSW7DAZVXCJBFHQ@2\windows-jdk9-m3.5.x_build\maven-enforcer-plugin\target\it\require-property\build.log, f:\jenkins\jenkins-slave\workspace\n-box_maven-enforcer_master-KHI64AG3D4VZKUKLMNAYHKONI5AIQBLJ5ZKYGGSW7DAZVXCJBFHQ@2\windows-jdk9-m3.5.x_build\maven-enforcer-plugin\target\it\require-release-dependencies-excludes\build.log, f:\jenkins\jenkins-slave\workspace\n-box_maven-enforcer_master-KHI64AG3D4VZKUKLMNAYHKONI5AIQBLJ5ZKYGGSW7DAZVXCJBFHQ@2\windows-jdk9-m3.5.x_build\maven-enforcer-plugin\target\it\require-release-dependencies-excludes_failure\build.log, f:\jenkins\jenkins-slave\workspace\n-box_maven-enforcer_master-KHI64AG3D4VZKUKLMNAYHKONI5AIQBLJ5ZKYGGSW7DAZVXCJBFHQ@2\windows-jdk9-m3.5.x_build\maven-enforcer-plugin\target\it\require-release-dependencies\build.log, f:\jenkins\jenkins-slave\workspace\n-box_maven-enforcer_master-KHI64AG3D4VZKUKLMNAYHKONI5AIQBLJ5ZKYGGSW7DAZVXCJBFHQ@2\windows-jdk9-m3.5.x_build\maven-enforcer-plugin\target\it\require-release-version\build.log, f:\jenkins\jenkins-slave\workspace\n-box_maven-enforcer_master-KHI64AG3D4VZKUKLMNAYHKONI5AIQBLJ5ZKYGGSW7DAZVXCJBFHQ@2\windows-jdk9-m3.5.x_build\maven-enforcer-plugin\target\it\require-same-versions_failure\build.log, f:\jenkins\jenkins-slave\workspace\n-box_maven-enforcer_master-KHI64AG3D4VZKUKLMNAYHKONI5AIQBLJ5ZKYGGSW7DAZVXCJBFHQ@2\windows-jdk9-m3.5.x_build\maven-enforcer-plugin\target\it\require-same-versions_success\build.log, f:\jenkins\jenkins-slave\workspace\n-box_maven-enforcer_master-KHI64AG3D4VZKUKLMNAYHKONI5AIQBLJ5ZKYGGSW7DAZVXCJBFHQ@2\windows-jdk9-m3.5.x_build\maven-enforcer-plugin\target\it\require-snapshot-version_failure\build.log, f:\jenkins\jenkins-slave\workspace\n-box_maven-enforcer_master-KHI64AG3D4VZKUKLMNAYHKONI5AIQBLJ5ZKYGGSW7DAZVXCJBFHQ@2\windows-jdk9-m3.5.x_build\maven-enforcer-plugin\target\it\require-snapshot-version_success\build.log, f:\jenkins\jenkins-slave\workspace\n-box_maven-enforcer_master-KHI64AG3D4VZKUKLMNAYHKONI5AIQBLJ5ZKYGGSW7DAZVXCJBFHQ@2\windows-jdk9-m3.5.x_build\maven-enforcer-plugin\target\it\require-upper-bound-dependencies-managed_failure\build.log, f:\jenkins\jenkins-slave\workspace\n-box_maven-enforcer_master-KHI64AG3D4VZKUKLMNAYHKONI5AIQBLJ5ZKYGGSW7DAZVXCJBFHQ@2\windows-jdk9-m3.5.x_build\maven-enforcer-plugin\target\it\require-upper-bound-dependencies-managed_success\build.log, f:\jenkins\jenkins-slave\workspace\n-box_maven-enforcer_master-KHI64AG3D4VZKUKLMNAYHKONI5AIQBLJ5ZKYGGSW7DAZVXCJBFHQ@2\windows-jdk9-m3.5.x_build\maven-enforcer-plugin\target\it\require-upper-bound-dependencies-unique_failure\build.log, f:\jenkins\jenkins-slave\workspace\n-box_maven-enforcer_master-KHI64AG3D4VZKUKLMNAYHKONI5AIQBLJ5ZKYGGSW7DAZVXCJBFHQ@2\windows-jdk9-m3.5.x_build\maven-enforcer-plugin\target\it\require-upper-bound-dependencies-unique_success\build.log, f:\jenkins\jenkins-slave\workspace\n-box_maven-enforcer_master-KHI64AG3D4VZKUKLMNAYHKONI5AIQBLJ5ZKYGGSW7DAZVXCJBFHQ@2\windows-jdk9-m3.5.x_build\maven-enforcer-plugin\target\it\require-upper-bound-deps_failure\build.log, f:\jenkins\jenkins-slave\workspace\n-box_maven-enforcer_master-KHI64AG3D4VZKUKLMNAYHKONI5AIQBLJ5ZKYGGSW7DAZVXCJBFHQ@2\windows-jdk9-m3.5.x_build\maven-enforcer-plugin\target\it\require-upper-bound-deps_ignored\build.log, f:\jenkins\jenkins-slave\workspace\n-box_maven-enforcer_master-KHI64AG3D4VZKUKLMNAYHKONI5AIQBLJ5ZKYGGSW7DAZVXCJBFHQ@2\windows-jdk9-m3.5.x_build\maven-enforcer-plugin\target\it\require-upper-bound-deps_success\build.log, f:\jenkins\jenkins-slave\workspace\n-box_maven-enforcer_master-KHI64AG3D4VZKUKLMNAYHKONI5AIQBLJ5ZKYGGSW7DAZVXCJBFHQ@2\windows-jdk9-m3.5.x_build\maven-enforcer-plugin\target\it\resolve_collect_dependencies\build.log]
[windows-jdk9-m3.5.x_build] Finished parsing Maven Invoker results (found 68)
[windows-jdk9-m3.5.x_build] [withMaven] junitPublisher - Archive test results for Maven artifact org.apache.maven.enforcer:enforcer-api:3.0.0-SNAPSHOT generated by maven-surefire-plugin:test (default-test): windows-jdk9-m3.5.x_build\enforcer-api\target\surefire-reports\*.xml
[windows-jdk9-m3.5.x_build] Recording test results
[windows-jdk9-m3.5.x_build] None of the test reports contained any result
[windows-jdk9-m3.5.x_build] [withMaven] junitPublisher - Archive test results for Maven artifact org.apache.maven.enforcer:enforcer-rules:3.0.0-SNAPSHOT generated by maven-surefire-plugin:test (default-test): windows-jdk9-m3.5.x_build\enforcer-rules\target\surefire-reports\*.xml
[windows-jdk9-m3.5.x_build] Recording test results
[windows-jdk9-m3.5.x_build] [withMaven] junitPublisher - Archive test results for Maven artifact org.apache.maven.plugins:maven-enforcer-plugin:3.0.0-SNAPSHOT generated by maven-surefire-plugin:test (default-test): windows-jdk9-m3.5.x_build\maven-enforcer-plugin\target\surefire-reports\*.xml
[windows-jdk9-m3.5.x_build] Recording test results
[windows-jdk9-m3.5.x_build] [withMaven] openTasksPublisher - Scan Tasks for Maven artifact org.apache.maven.enforcer:enforcer-api:3.0.0-SNAPSHOT in source directory windows-jdk9-m3.5.x_build\enforcer-api\src\main\java
[windows-jdk9-m3.5.x_build] [withMaven] openTasksPublisher - Scan Tasks for Maven artifact org.apache.maven.enforcer:enforcer-rules:3.0.0-SNAPSHOT in source directory windows-jdk9-m3.5.x_build\enforcer-rules\src\main\java
[windows-jdk9-m3.5.x_build] [withMaven] openTasksPublisher - Scan Tasks for Maven artifact org.apache.maven.plugins:maven-enforcer-plugin:3.0.0-SNAPSHOT in source directory windows-jdk9-m3.5.x_build\maven-enforcer-plugin\src\main\java
[windows-jdk9-m3.5.x_build] [TASKS] Scanning folder 'f:\jenkins\jenkins-slave\workspace\n-box_maven-enforcer_master-KHI64AG3D4VZKUKLMNAYHKONI5AIQBLJ5ZKYGGSW7DAZVXCJBFHQ@2' for files matching the pattern 'windows-jdk9-m3.5.x_build\enforcer-api\src\main\java\**\*,windows-jdk9-m3.5.x_build\enforcer-rules\src\main\java\**\*,windows-jdk9-m3.5.x_build\maven-enforcer-plugin\src\main\java\**\*' - excludes: null
[windows-jdk9-m3.5.x_build] [TASKS] Found 51 files to scan for tasks
[windows-jdk9-m3.5.x_build] [TASKS] Found 5 open tasks.
[windows-jdk9-m3.5.x_build] Skipping warnings blame since pipelines do not have an SCM link.%n
[windows-jdk9-m3.5.x_build] [TASKS] Computing warning deltas based on reference build #31
[Pipeline] [windows-jdk9-m3.5.x_build] // withMaven
[Pipeline] [windows-jdk9-m3.5.x_build] cleanWs
[Pipeline] [windows-jdk8-m3.5.x_build] }
[Pipeline] [windows-jdk10-m3.5.x_build] }
[Pipeline] [windows-jdk8-m3.5.x_build] // dir
[Pipeline] [windows-jdk10-m3.5.x_build] // dir
[windows-jdk9-m3.5.x_build] [WS-CLEANUP] Deleting project workspace...[WS-CLEANUP] done
[windows-jdk7-m3.5.x_build] [INFO] snapshot org.apache.maven.plugins.enforcer.its:menforcer85_api:1.0-SNAPSHOT: checking for updates from apache-snapshots
[windows-jdk7-m3.5.x_build] [INFO] snapshot org.apache.maven.plugins.enforcer.its:menforcer85_api:1.0-SNAPSHOT: checking for updates from Nexus
[windows-jdk7-m3.5.x_build] [INFO] artifact org.apache.maven.plugins.enforcer.its.menforcer85_api:1.0-SNAPSHOT: checking for updates from central
[windows-jdk7-m3.5.x_build] [INFO] org.apache.maven.plugins.enforcer.its.menforcer85_api.1.0-SNAPSHOT: checking for updates from central
[windows-jdk7-m3.5.x_build] [INFO]           require-release-dependencies-excludes\pom.xml .... SUCCESS (8.1 s)
[windows-jdk7-m3.5.x_build] [INFO] Building: require-release-dependencies-excludes_failure\pom.xml
[windows-jdk7-m3.5.x_build] [INFO]           require-release-dependencies-excludes_failure\pom.xml SUCCESS (7.4 s)
[windows-jdk7-m3.5.x_build] [INFO] Building: require-release-version\pom.xml
[windows-jdk7-m3.5.x_build] [INFO]           require-release-version\pom.xml .................. SUCCESS (7.4 s)
[windows-jdk7-m3.5.x_build] [INFO] Building: require-same-versions_failure\pom.xml
[windows-jdk7-m3.5.x_build] [INFO]           require-same-versions_failure\pom.xml ............ SUCCESS (7.5 s)
[windows-jdk7-m3.5.x_build] [INFO] Building: require-same-versions_success\pom.xml
[windows-jdk7-m3.5.x_build] [INFO]           require-same-versions_success\pom.xml ............ SUCCESS (7.8 s)
[windows-jdk7-m3.5.x_build] [INFO] Building: require-snapshot-version_failure\pom.xml
[Pipeline] [windows-jdk8-m3.5.x_build] }
[windows-jdk8-m3.5.x_build] [withMaven] artifactsPublisher - Archive artifact windows-jdk8-m3.5.x_build\pom.xml under org\apache\maven\enforcer\enforcer\3.0.0-SNAPSHOT\enforcer-3.0.0-SNAPSHOT.pom
[windows-jdk8-m3.5.x_build] [withMaven] artifactsPublisher - Archive artifact windows-jdk8-m3.5.x_build\target\enforcer-3.0.0-SNAPSHOT-site.xml under org\apache\maven\enforcer\enforcer\3.0.0-SNAPSHOT\enforcer-3.0.0-SNAPSHOT-site.xml
[windows-jdk8-m3.5.x_build] [withMaven] artifactsPublisher - Archive artifact windows-jdk8-m3.5.x_build\enforcer-api\pom.xml under org\apache\maven\enforcer\enforcer-api\3.0.0-SNAPSHOT\enforcer-api-3.0.0-SNAPSHOT.pom
[windows-jdk8-m3.5.x_build] [withMaven] artifactsPublisher - Archive artifact windows-jdk8-m3.5.x_build\enforcer-api\target\enforcer-api-3.0.0-SNAPSHOT.jar under org\apache\maven\enforcer\enforcer-api\3.0.0-SNAPSHOT\enforcer-api-3.0.0-SNAPSHOT.jar
[windows-jdk8-m3.5.x_build] [withMaven] artifactsPublisher - Archive artifact windows-jdk8-m3.5.x_build\enforcer-rules\pom.xml under org\apache\maven\enforcer\enforcer-rules\3.0.0-SNAPSHOT\enforcer-rules-3.0.0-SNAPSHOT.pom
[windows-jdk8-m3.5.x_build] [withMaven] artifactsPublisher - Archive artifact windows-jdk8-m3.5.x_build\enforcer-rules\target\enforcer-rules-3.0.0-SNAPSHOT.jar under org\apache\maven\enforcer\enforcer-rules\3.0.0-SNAPSHOT\enforcer-rules-3.0.0-SNAPSHOT.jar
[windows-jdk8-m3.5.x_build] [withMaven] artifactsPublisher - Archive artifact windows-jdk8-m3.5.x_build\enforcer-rules\target\enforcer-rules-3.0.0-SNAPSHOT-tests.jar under org\apache\maven\enforcer\enforcer-rules\3.0.0-SNAPSHOT\enforcer-rules-3.0.0-SNAPSHOT-tests.jar
[windows-jdk8-m3.5.x_build] [withMaven] artifactsPublisher - Archive artifact windows-jdk8-m3.5.x_build\maven-enforcer-plugin\pom.xml under org\apache\maven\plugins\maven-enforcer-plugin\3.0.0-SNAPSHOT\maven-enforcer-plugin-3.0.0-SNAPSHOT.pom
[windows-jdk8-m3.5.x_build] [withMaven] artifactsPublisher - Archive artifact windows-jdk8-m3.5.x_build\maven-enforcer-plugin\target\maven-enforcer-plugin-3.0.0-SNAPSHOT.jar under org\apache\maven\plugins\maven-enforcer-plugin\3.0.0-SNAPSHOT\maven-enforcer-plugin-3.0.0-SNAPSHOT.jar
[windows-jdk8-m3.5.x_build] [withMaven] invokerPublisher - Archive invoker results for Maven artifact MavenArtifact{org.apache.maven.plugins:maven-enforcer-plugin::3.0.0-SNAPSHOT(version: 3.0.0-SNAPSHOT, snapshot:false) } generated by PluginInvocation{org.apache.maven.plugins:maven-invoker-plugin:3.0.1@run  integration-test}: windows-jdk8-m3.5.x_build\maven-enforcer-plugin\target\invoker-reports\*.xml
[windows-jdk8-m3.5.x_build] performing MavenInvokerRecorder, reportsFilenamePattern:'**/windows-jdk8-m3.5.x_build\maven-enforcer-plugin\target\invoker-reports/BUILD*.xml', invokerBuildDir:'**/windows-jdk8-m3.5.x_build\maven-enforcer-plugin\target\it'
[windows-jdk8-m3.5.x_build] Found reports:[f:\jenkins\jenkins-slave\workspace\n-box_maven-enforcer_master-KHI64AG3D4VZKUKLMNAYHKONI5AIQBLJ5ZKYGGSW7DAZVXCJBFHQ\windows-jdk8-m3.5.x_build\maven-enforcer-plugin\target\invoker-reports\BUILD-always-fail-warn.xml, f:\jenkins\jenkins-slave\workspace\n-box_maven-enforcer_master-KHI64AG3D4VZKUKLMNAYHKONI5AIQBLJ5ZKYGGSW7DAZVXCJBFHQ\windows-jdk8-m3.5.x_build\maven-enforcer-plugin\target\invoker-reports\BUILD-always-fail.xml, f:\jenkins\jenkins-slave\workspace\n-box_maven-enforcer_master-KHI64AG3D4VZKUKLMNAYHKONI5AIQBLJ5ZKYGGSW7DAZVXCJBFHQ\windows-jdk8-m3.5.x_build\maven-enforcer-plugin\target\invoker-reports\BUILD-always-pass.xml, f:\jenkins\jenkins-slave\workspace\n-box_maven-enforcer_master-KHI64AG3D4VZKUKLMNAYHKONI5AIQBLJ5ZKYGGSW7DAZVXCJBFHQ\windows-jdk8-m3.5.x_build\maven-enforcer-plugin\target\invoker-reports\BUILD-ban-distribution-management-multi-module-build.xml, f:\jenkins\jenkins-slave\workspace\n-box_maven-enforcer_master-KHI64AG3D4VZKUKLMNAYHKONI5AIQBLJ5ZKYGGSW7DAZVXCJBFHQ\windows-jdk8-m3.5.x_build\maven-enforcer-plugin\target\invoker-reports\BUILD-ban-distribution-management-multi-module-except-site.xml, f:\jenkins\jenkins-slave\workspace\n-box_maven-enforcer_master-KHI64AG3D4VZKUKLMNAYHKONI5AIQBLJ5ZKYGGSW7DAZVXCJBFHQ\windows-jdk8-m3.5.x_build\maven-enforcer-plugin\target\invoker-reports\BUILD-ban-distribution-management.xml, f:\jenkins\jenkins-slave\workspace\n-box_maven-enforcer_master-KHI64AG3D4VZKUKLMNAYHKONI5AIQBLJ5ZKYGGSW7DAZVXCJBFHQ\windows-jdk8-m3.5.x_build\maven-enforcer-plugin\target\invoker-reports\BUILD-ban-pom-dependency-version.xml, f:\jenkins\jenkins-slave\workspace\n-box_maven-enforcer_master-KHI64AG3D4VZKUKLMNAYHKONI5AIQBLJ5ZKYGGSW7DAZVXCJBFHQ\windows-jdk8-m3.5.x_build\maven-enforcer-plugin\target\invoker-reports\BUILD-ban-transitive-dependencies-fail.xml, f:\jenkins\jenkins-slave\workspace\n-box_maven-enforcer_master-KHI64AG3D4VZKUKLMNAYHKONI5AIQBLJ5ZKYGGSW7DAZVXCJBFHQ\windows-jdk8-m3.5.x_build\maven-enforcer-plugin\target\invoker-reports\BUILD-ban-transitive-dependencies.xml, f:\jenkins\jenkins-slave\workspace\n-box_maven-enforcer_master-KHI64AG3D4VZKUKLMNAYHKONI5AIQBLJ5ZKYGGSW7DAZVXCJBFHQ\windows-jdk8-m3.5.x_build\maven-enforcer-plugin\target\invoker-reports\BUILD-banned-dependencies-versionrange-fail.xml, f:\jenkins\jenkins-slave\workspace\n-box_maven-enforcer_master-KHI64AG3D4VZKUKLMNAYHKONI5AIQBLJ5ZKYGGSW7DAZVXCJBFHQ\windows-jdk8-m3.5.x_build\maven-enforcer-plugin\target\invoker-reports\BUILD-banned-dependencies-versionrange.xml, f:\jenkins\jenkins-slave\workspace\n-box_maven-enforcer_master-KHI64AG3D4VZKUKLMNAYHKONI5AIQBLJ5ZKYGGSW7DAZVXCJBFHQ\windows-jdk8-m3.5.x_build\maven-enforcer-plugin\target\invoker-reports\BUILD-banned-dependencies-wildcards.xml, f:\jenkins\jenkins-slave\workspace\n-box_maven-enforcer_master-KHI64AG3D4VZKUKLMNAYHKONI5AIQBLJ5ZKYGGSW7DAZVXCJBFHQ\windows-jdk8-m3.5.x_build\maven-enforcer-plugin\target\invoker-reports\BUILD-banned-dependencies.xml, f:\jenkins\jenkins-slave\workspace\n-box_maven-enforcer_master-KHI64AG3D4VZKUKLMNAYHKONI5AIQBLJ5ZKYGGSW7DAZVXCJBFHQ\windows-jdk8-m3.5.x_build\maven-enforcer-plugin\target\invoker-reports\BUILD-banned-plugins.xml, f:\jenkins\jenkins-slave\workspace\n-box_maven-enforcer_master-KHI64AG3D4VZKUKLMNAYHKONI5AIQBLJ5ZKYGGSW7DAZVXCJBFHQ\windows-jdk8-m3.5.x_build\maven-enforcer-plugin\target\invoker-reports\BUILD-builds_a_pom_noop.xml, f:\jenkins\jenkins-slave\workspace\n-box_maven-enforcer_master-KHI64AG3D4VZKUKLMNAYHKONI5AIQBLJ5ZKYGGSW7DAZVXCJBFHQ\windows-jdk8-m3.5.x_build\maven-enforcer-plugin\target\invoker-reports\BUILD-cli-always-fail.xml, f:\jenkins\jenkins-slave\workspace\n-box_maven-enforcer_master-KHI64AG3D4VZKUKLMNAYHKONI5AIQBLJ5ZKYGGSW7DAZVXCJBFHQ\windows-jdk8-m3.5.x_build\maven-enforcer-plugin\target\invoker-reports\BUILD-cli-always-pass.xml, f:\jenkins\jenkins-slave\workspace\n-box_maven-enforcer_master-KHI64AG3D4VZKUKLMNAYHKONI5AIQBLJ5ZKYGGSW7DAZVXCJBFHQ\windows-jdk8-m3.5.x_build\maven-enforcer-plugin\target\invoker-reports\BUILD-dependencies_converge.xml, f:\jenkins\jenkins-slave\workspace\n-box_maven-enforcer_master-KHI64AG3D4VZKUKLMNAYHKONI5AIQBLJ5ZKYGGSW7DAZVXCJBFHQ\windows-jdk8-m3.5.x_build\maven-enforcer-plugin\target\invoker-reports\BUILD-dependencies_not_converging.xml, f:\jenkins\jenkins-slave\workspace\n-box_maven-enforcer_master-KHI64AG3D4VZKUKLMNAYHKONI5AIQBLJ5ZKYGGSW7DAZVXCJBFHQ\windows-jdk8-m3.5.x_build\maven-enforcer-plugin\target\invoker-reports\BUILD-dependencies_not_converging_test_scope.xml, f:\jenkins\jenkins-slave\workspace\n-box_maven-enforcer_master-KHI64AG3D4VZKUKLMNAYHKONI5AIQBLJ5ZKYGGSW7DAZVXCJBFHQ\windows-jdk8-m3.5.x_build\maven-enforcer-plugin\target\invoker-reports\BUILD-display-info.xml, f:\jenkins\jenkins-slave\workspace\n-box_maven-enforcer_master-KHI64AG3D4VZKUKLMNAYHKONI5AIQBLJ5ZKYGGSW7DAZVXCJBFHQ\windows-jdk8-m3.5.x_build\maven-enforcer-plugin\target\invoker-reports\BUILD-evaluate-beanshell.xml, f:\jenkins\jenkins-slave\workspace\n-box_maven-enforcer_master-KHI64AG3D4VZKUKLMNAYHKONI5AIQBLJ5ZKYGGSW7DAZVXCJBFHQ\windows-jdk8-m3.5.x_build\maven-enforcer-plugin\target\invoker-reports\BUILD-multimodule.xml, f:\jenkins\jenkins-slave\workspace\n-box_maven-enforcer_master-KHI64AG3D4VZKUKLMNAYHKONI5AIQBLJ5ZKYGGSW7DAZVXCJBFHQ\windows-jdk8-m3.5.x_build\maven-enforcer-plugin\target\invoker-reports\BUILD-require-active-profile-all.xml, f:\jenkins\jenkins-slave\workspace\n-box_maven-enforcer_master-KHI64AG3D4VZKUKLMNAYHKONI5AIQBLJ5ZKYGGSW7DAZVXCJBFHQ\windows-jdk8-m3.5.x_build\maven-enforcer-plugin\target\invoker-reports\BUILD-require-active-profile-from-settings.xml, f:\jenkins\jenkins-slave\workspace\n-box_maven-enforcer_master-KHI64AG3D4VZKUKLMNAYHKONI5AIQBLJ5ZKYGGSW7DAZVXCJBFHQ\windows-jdk8-m3.5.x_build\maven-enforcer-plugin\target\invoker-reports\BUILD-require-active-profile.xml, f:\jenkins\jenkins-slave\workspace\n-box_maven-enforcer_master-KHI64AG3D4VZKUKLMNAYHKONI5AIQBLJ5ZKYGGSW7DAZVXCJBFHQ\windows-jdk8-m3.5.x_build\maven-enforcer-plugin\target\invoker-reports\BUILD-require-file-checksum.xml, f:\jenkins\jenkins-slave\workspace\n-box_maven-enforcer_master-KHI64AG3D4VZKUKLMNAYHKONI5AIQBLJ5ZKYGGSW7DAZVXCJBFHQ\windows-jdk8-m3.5.x_build\maven-enforcer-plugin\target\invoker-reports\BUILD-require-files-dont-exist.xml, f:\jenkins\jenkins-slave\workspace\n-box_maven-enforcer_master-KHI64AG3D4VZKUKLMNAYHKONI5AIQBLJ5ZKYGGSW7DAZVXCJBFHQ\windows-jdk8-m3.5.x_build\maven-enforcer-plugin\target\invoker-reports\BUILD-require-files-exist.xml, f:\jenkins\jenkins-slave\workspace\n-box_maven-enforcer_master-KHI64AG3D4VZKUKLMNAYHKONI5AIQBLJ5ZKYGGSW7DAZVXCJBFHQ\windows-jdk8-m3.5.x_build\maven-enforcer-plugin\target\invoker-reports\BUILD-require-files-size.xml, f:\jenkins\jenkins-slave\workspace\n-box_maven-enforcer_master-KHI64AG3D4VZKUKLMNAYHKONI5AIQBLJ5ZKYGGSW7DAZVXCJBFHQ\windows-jdk8-m3.5.x_build\maven-enforcer-plugin\target\invoker-reports\BUILD-require-java-version.xml, f:\jenkins\jenkins-slave\workspace\n-box_maven-enforcer_master-KHI64AG3D4VZKUKLMNAYHKONI5AIQBLJ5ZKYGGSW7DAZVXCJBFHQ\windows-jdk8-m3.5.x_build\maven-enforcer-plugin\target\invoker-reports\BUILD-require-maven-version.xml, f:\jenkins\jenkins-slave\workspace\n-box_maven-enforcer_master-KHI64AG3D4VZKUKLMNAYHKONI5AIQBLJ5ZKYGGSW7DAZVXCJBFHQ\windows-jdk8-m3.5.x_build\maven-enforcer-plugin\target\invoker-reports\BUILD-require-no-repositories-allow-plugin-repo.xml, f:\jenkins\jenkins-slave\workspace\n-box_maven-enforcer_master-KHI64AG3D4VZKUKLMNAYHKONI5AIQBLJ5ZKYGGSW7DAZVXCJBFHQ\windows-jdk8-m3.5.x_build\maven-enforcer-plugin\target\invoker-reports\BUILD-require-no-repositories-allow-repo.xml, f:\jenkins\jenkins-slave\workspace\n-box_maven-enforcer_master-KHI64AG3D4VZKUKLMNAYHKONI5AIQBLJ5ZKYGGSW7DAZVXCJBFHQ\windows-jdk8-m3.5.x_build\maven-enforcer-plugin\target\invoker-reports\BUILD-require-no-repositories.xml, f:\jenkins\jenkins-slave\workspace\n-box_maven-enforcer_master-KHI64AG3D4VZKUKLMNAYHKONI5AIQBLJ5ZKYGGSW7DAZVXCJBFHQ\windows-jdk8-m3.5.x_build\maven-enforcer-plugin\target\invoker-reports\BUILD-require-no-repositories_failure.xml, f:\jenkins\jenkins-slave\workspace\n-box_maven-enforcer_master-KHI64AG3D4VZKUKLMNAYHKONI5AIQBLJ5ZKYGGSW7DAZVXCJBFHQ\windows-jdk8-m3.5.x_build\maven-enforcer-plugin\target\invoker-reports\BUILD-require-no-repositories_failure_allowed-plugin-repo.xml, f:\jenkins\jenkins-slave\workspace\n-box_maven-enforcer_master-KHI64AG3D4VZKUKLMNAYHKONI5AIQBLJ5ZKYGGSW7DAZVXCJBFHQ\windows-jdk8-m3.5.x_build\maven-enforcer-plugin\target\invoker-reports\BUILD-require-no-repositories_failure_plugin-repositories.xml, f:\jenkins\jenkins-slave\workspace\n-box_maven-enforcer_master-KHI64AG3D4VZKUKLMNAYHKONI5AIQBLJ5ZKYGGSW7DAZVXCJBFHQ\windows-jdk8-m3.5.x_build\maven-enforcer-plugin\target\invoker-reports\BUILD-require-no-repositories_failure_repositories.xml, f:\jenkins\jenkins-slave\workspace\n-box_maven-enforcer_master-KHI64AG3D4VZKUKLMNAYHKONI5AIQBLJ5ZKYGGSW7DAZVXCJBFHQ\windows-jdk8-m3.5.x_build\maven-enforcer-plugin\target\invoker-reports\BUILD-require-no-repositories_mm.xml, f:\jenkins\jenkins-slave\workspace\n-box_maven-enforcer_master-KHI64AG3D4VZKUKLMNAYHKONI5AIQBLJ5ZKYGGSW7DAZVXCJBFHQ\windows-jdk8-m3.5.x_build\maven-enforcer-plugin\target\invoker-reports\BUILD-require-no-repositories_mm_ci.xml, f:\jenkins\jenkins-slave\workspace\n-box_maven-enforcer_master-KHI64AG3D4VZKUKLMNAYHKONI5AIQBLJ5ZKYGGSW7DAZVXCJBFHQ\windows-jdk8-m3.5.x_build\maven-enforcer-plugin\target\invoker-reports\BUILD-require-plugin-versions-ci.xml, f:\jenkins\jenkins-slave\workspace\n-box_maven-enforcer_master-KHI64AG3D4VZKUKLMNAYHKONI5AIQBLJ5ZKYGGSW7DAZVXCJBFHQ\windows-jdk8-m3.5.x_build\maven-enforcer-plugin\target\invoker-reports\BUILD-require-plugin-versions-custom-packaging.xml, f:\jenkins\jenkins-slave\workspace\n-box_maven-enforcer_master-KHI64AG3D4VZKUKLMNAYHKONI5AIQBLJ5ZKYGGSW7DAZVXCJBFHQ\windows-jdk8-m3.5.x_build\maven-enforcer-plugin\target\invoker-reports\BUILD-require-plugin-versions-expressions.xml, f:\jenkins\jenkins-slave\workspace\n-box_maven-enforcer_master-KHI64AG3D4VZKUKLMNAYHKONI5AIQBLJ5ZKYGGSW7DAZVXCJBFHQ\windows-jdk8-m3.5.x_build\maven-enforcer-plugin\target\invoker-reports\BUILD-require-plugin-versions-mm-ci-friendly.xml, f:\jenkins\jenkins-slave\workspace\n-box_maven-enforcer_master-KHI64AG3D4VZKUKLMNAYHKONI5AIQBLJ5ZKYGGSW7DAZVXCJBFHQ\windows-jdk8-m3.5.x_build\maven-enforcer-plugin\target\invoker-reports\BUILD-require-plugin-versions-plugin-with-extensions.xml, f:\jenkins\jenkins-slave\workspace\n-box_maven-enforcer_master-KHI64AG3D4VZKUKLMNAYHKONI5AIQBLJ5ZKYGGSW7DAZVXCJBFHQ\windows-jdk8-m3.5.x_build\maven-enforcer-plugin\target\invoker-reports\BUILD-require-plugin-versions-plugin-with-integration-test-lifecycle.xml, f:\jenkins\jenkins-slave\workspace\n-box_maven-enforcer_master-KHI64AG3D4VZKUKLMNAYHKONI5AIQBLJ5ZKYGGSW7DAZVXCJBFHQ\windows-jdk8-m3.5.x_build\maven-enforcer-plugin\target\invoker-reports\BUILD-require-plugin-versions-projectGAVexpressions.xml, f:\jenkins\jenkins-slave\workspace\n-box_maven-enforcer_master-KHI64AG3D4VZKUKLMNAYHKONI5AIQBLJ5ZKYGGSW7DAZVXCJBFHQ\windows-jdk8-m3.5.x_build\maven-enforcer-plugin\target\invoker-reports\BUILD-require-plugin-versions.xml, f:\jenkins\jenkins-slave\workspace\n-box_maven-enforcer_master-KHI64AG3D4VZKUKLMNAYHKONI5AIQBLJ5ZKYGGSW7DAZVXCJBFHQ\windows-jdk8-m3.5.x_build\maven-enforcer-plugin\target\invoker-reports\BUILD-require-profile-ids-exist_failure.xml, f:\jenkins\jenkins-slave\workspace\n-box_maven-enforcer_master-KHI64AG3D4VZKUKLMNAYHKONI5AIQBLJ5ZKYGGSW7DAZVXCJBFHQ\windows-jdk8-m3.5.x_build\maven-enforcer-plugin\target\invoker-reports\BUILD-require-profile-ids-exist_success.xml, f:\jenkins\jenkins-slave\workspace\n-box_maven-enforcer_master-KHI64AG3D4VZKUKLMNAYHKONI5AIQBLJ5ZKYGGSW7DAZVXCJBFHQ\windows-jdk8-m3.5.x_build\maven-enforcer-plugin\target\invoker-reports\BUILD-require-property.xml, f:\jenkins\jenkins-slave\workspace\n-box_maven-enforcer_master-KHI64AG3D4VZKUKLMNAYHKONI5AIQBLJ5ZKYGGSW7DAZVXCJBFHQ\windows-jdk8-m3.5.x_build\maven-enforcer-plugin\target\invoker-reports\BUILD-require-release-dependencies-excludes.xml, f:\jenkins\jenkins-slave\workspace\n-box_maven-enforcer_master-KHI64AG3D4VZKUKLMNAYHKONI5AIQBLJ5ZKYGGSW7DAZVXCJBFHQ\windows-jdk8-m3.5.x_build\maven-enforcer-plugin\target\invoker-reports\BUILD-require-release-dependencies-excludes_failure.xml, f:\jenkins\jenkins-slave\workspace\n-box_maven-enforcer_master-KHI64AG3D4VZKUKLMNAYHKONI5AIQBLJ5ZKYGGSW7DAZVXCJBFHQ\windows-jdk8-m3.5.x_build\maven-enforcer-plugin\target\invoker-reports\BUILD-require-release-dependencies.xml, f:\jenkins\jenkins-slave\workspace\n-box_maven-enforcer_master-KHI64AG3D4VZKUKLMNAYHKONI5AIQBLJ5ZKYGGSW7DAZVXCJBFHQ\windows-jdk8-m3.5.x_build\maven-enforcer-plugin\target\invoker-reports\BUILD-require-release-version.xml, f:\jenkins\jenkins-slave\workspace\n-box_maven-enforcer_master-KHI64AG3D4VZKUKLMNAYHKONI5AIQBLJ5ZKYGGSW7DAZVXCJBFHQ\windows-jdk8-m3.5.x_build\maven-enforcer-plugin\target\invoker-reports\BUILD-require-same-versions_failure.xml, f:\jenkins\jenkins-slave\workspace\n-box_maven-enforcer_master-KHI64AG3D4VZKUKLMNAYHKONI5AIQBLJ5ZKYGGSW7DAZVXCJBFHQ\windows-jdk8-m3.5.x_build\maven-enforcer-plugin\target\invoker-reports\BUILD-require-same-versions_success.xml, f:\jenkins\jenkins-slave\workspace\n-box_maven-enforcer_master-KHI64AG3D4VZKUKLMNAYHKONI5AIQBLJ5ZKYGGSW7DAZVXCJBFHQ\windows-jdk8-m3.5.x_build\maven-enforcer-plugin\target\invoker-reports\BUILD-require-snapshot-version_failure.xml, f:\jenkins\jenkins-slave\workspace\n-box_maven-enforcer_master-KHI64AG3D4VZKUKLMNAYHKONI5AIQBLJ5ZKYGGSW7DAZVXCJBFHQ\windows-jdk8-m3.5.x_build\maven-enforcer-plugin\target\invoker-reports\BUILD-require-snapshot-version_success.xml, f:\jenkins\jenkins-slave\workspace\n-box_maven-enforcer_master-KHI64AG3D4VZKUKLMNAYHKONI5AIQBLJ5ZKYGGSW7DAZVXCJBFHQ\windows-jdk8-m3.5.x_build\maven-enforcer-plugin\target\invoker-reports\BUILD-require-upper-bound-dependencies-managed_failure.xml, f:\jenkins\jenkins-slave\workspace\n-box_maven-enforcer_master-KHI64AG3D4VZKUKLMNAYHKONI5AIQBLJ5ZKYGGSW7DAZVXCJBFHQ\windows-jdk8-m3.5.x_build\maven-enforcer-plugin\target\invoker-reports\BUILD-require-upper-bound-dependencies-managed_success.xml, f:\jenkins\jenkins-slave\workspace\n-box_maven-enforcer_master-KHI64AG3D4VZKUKLMNAYHKONI5AIQBLJ5ZKYGGSW7DAZVXCJBFHQ\windows-jdk8-m3.5.x_build\maven-enforcer-plugin\target\invoker-reports\BUILD-require-upper-bound-dependencies-unique_failure.xml, f:\jenkins\jenkins-slave\workspace\n-box_maven-enforcer_master-KHI64AG3D4VZKUKLMNAYHKONI5AIQBLJ5ZKYGGSW7DAZVXCJBFHQ\windows-jdk8-m3.5.x_build\maven-enforcer-plugin\target\invoker-reports\BUILD-require-upper-bound-dependencies-unique_success.xml, f:\jenkins\jenkins-slave\workspace\n-box_maven-enforcer_master-KHI64AG3D4VZKUKLMNAYHKONI5AIQBLJ5ZKYGGSW7DAZVXCJBFHQ\windows-jdk8-m3.5.x_build\maven-enforcer-plugin\target\invoker-reports\BUILD-require-upper-bound-deps_failure.xml, f:\jenkins\jenkins-slave\workspace\n-box_maven-enforcer_master-KHI64AG3D4VZKUKLMNAYHKONI5AIQBLJ5ZKYGGSW7DAZVXCJBFHQ\windows-jdk8-m3.5.x_build\maven-enforcer-plugin\target\invoker-reports\BUILD-require-upper-bound-deps_ignored.xml, f:\jenkins\jenkins-slave\workspace\n-box_maven-enforcer_master-KHI64AG3D4VZKUKLMNAYHKONI5AIQBLJ5ZKYGGSW7DAZVXCJBFHQ\windows-jdk8-m3.5.x_build\maven-enforcer-plugin\target\invoker-reports\BUILD-require-upper-bound-deps_success.xml, f:\jenkins\jenkins-slave\workspace\n-box_maven-enforcer_master-KHI64AG3D4VZKUKLMNAYHKONI5AIQBLJ5ZKYGGSW7DAZVXCJBFHQ\windows-jdk8-m3.5.x_build\maven-enforcer-plugin\target\invoker-reports\BUILD-resolve_collect_dependencies.xml]
[windows-jdk8-m3.5.x_build] Found logs:[f:\jenkins\jenkins-slave\workspace\n-box_maven-enforcer_master-KHI64AG3D4VZKUKLMNAYHKONI5AIQBLJ5ZKYGGSW7DAZVXCJBFHQ\windows-jdk8-m3.5.x_build\maven-enforcer-plugin\target\it\always-fail-warn\build.log, f:\jenkins\jenkins-slave\workspace\n-box_maven-enforcer_master-KHI64AG3D4VZKUKLMNAYHKONI5AIQBLJ5ZKYGGSW7DAZVXCJBFHQ\windows-jdk8-m3.5.x_build\maven-enforcer-plugin\target\it\always-fail\build.log, f:\jenkins\jenkins-slave\workspace\n-box_maven-enforcer_master-KHI64AG3D4VZKUKLMNAYHKONI5AIQBLJ5ZKYGGSW7DAZVXCJBFHQ\windows-jdk8-m3.5.x_build\maven-enforcer-plugin\target\it\always-pass\build.log, f:\jenkins\jenkins-slave\workspace\n-box_maven-enforcer_master-KHI64AG3D4VZKUKLMNAYHKONI5AIQBLJ5ZKYGGSW7DAZVXCJBFHQ\windows-jdk8-m3.5.x_build\maven-enforcer-plugin\target\it\ban-distribution-management-multi-module-build\build.log, f:\jenkins\jenkins-slave\workspace\n-box_maven-enforcer_master-KHI64AG3D4VZKUKLMNAYHKONI5AIQBLJ5ZKYGGSW7DAZVXCJBFHQ\windows-jdk8-m3.5.x_build\maven-enforcer-plugin\target\it\ban-distribution-management-multi-module-except-site\build.log, f:\jenkins\jenkins-slave\workspace\n-box_maven-enforcer_master-KHI64AG3D4VZKUKLMNAYHKONI5AIQBLJ5ZKYGGSW7DAZVXCJBFHQ\windows-jdk8-m3.5.x_build\maven-enforcer-plugin\target\it\ban-distribution-management\build.log, f:\jenkins\jenkins-slave\workspace\n-box_maven-enforcer_master-KHI64AG3D4VZKUKLMNAYHKONI5AIQBLJ5ZKYGGSW7DAZVXCJBFHQ\windows-jdk8-m3.5.x_build\maven-enforcer-plugin\target\it\ban-pom-dependency-version\build.log, f:\jenkins\jenkins-slave\workspace\n-box_maven-enforcer_master-KHI64AG3D4VZKUKLMNAYHKONI5AIQBLJ5ZKYGGSW7DAZVXCJBFHQ\windows-jdk8-m3.5.x_build\maven-enforcer-plugin\target\it\ban-transitive-dependencies-fail\build.log, f:\jenkins\jenkins-slave\workspace\n-box_maven-enforcer_master-KHI64AG3D4VZKUKLMNAYHKONI5AIQBLJ5ZKYGGSW7DAZVXCJBFHQ\windows-jdk8-m3.5.x_build\maven-enforcer-plugin\target\it\ban-transitive-dependencies\build.log, f:\jenkins\jenkins-slave\workspace\n-box_maven-enforcer_master-KHI64AG3D4VZKUKLMNAYHKONI5AIQBLJ5ZKYGGSW7DAZVXCJBFHQ\windows-jdk8-m3.5.x_build\maven-enforcer-plugin\target\it\banned-dependencies-versionrange-fail\build.log, f:\jenkins\jenkins-slave\workspace\n-box_maven-enforcer_master-KHI64AG3D4VZKUKLMNAYHKONI5AIQBLJ5ZKYGGSW7DAZVXCJBFHQ\windows-jdk8-m3.5.x_build\maven-enforcer-plugin\target\it\banned-dependencies-versionrange\build.log, f:\jenkins\jenkins-slave\workspace\n-box_maven-enforcer_master-KHI64AG3D4VZKUKLMNAYHKONI5AIQBLJ5ZKYGGSW7DAZVXCJBFHQ\windows-jdk8-m3.5.x_build\maven-enforcer-plugin\target\it\banned-dependencies-wildcards\build.log, f:\jenkins\jenkins-slave\workspace\n-box_maven-enforcer_master-KHI64AG3D4VZKUKLMNAYHKONI5AIQBLJ5ZKYGGSW7DAZVXCJBFHQ\windows-jdk8-m3.5.x_build\maven-enforcer-plugin\target\it\banned-dependencies\build.log, f:\jenkins\jenkins-slave\workspace\n-box_maven-enforcer_master-KHI64AG3D4VZKUKLMNAYHKONI5AIQBLJ5ZKYGGSW7DAZVXCJBFHQ\windows-jdk8-m3.5.x_build\maven-enforcer-plugin\target\it\banned-plugins\build.log, f:\jenkins\jenkins-slave\workspace\n-box_maven-enforcer_master-KHI64AG3D4VZKUKLMNAYHKONI5AIQBLJ5ZKYGGSW7DAZVXCJBFHQ\windows-jdk8-m3.5.x_build\maven-enforcer-plugin\target\it\builds_a_pom_noop\build.log, f:\jenkins\jenkins-slave\workspace\n-box_maven-enforcer_master-KHI64AG3D4VZKUKLMNAYHKONI5AIQBLJ5ZKYGGSW7DAZVXCJBFHQ\windows-jdk8-m3.5.x_build\maven-enforcer-plugin\target\it\cli-always-fail\build.log, f:\jenkins\jenkins-slave\workspace\n-box_maven-enforcer_master-KHI64AG3D4VZKUKLMNAYHKONI5AIQBLJ5ZKYGGSW7DAZVXCJBFHQ\windows-jdk8-m3.5.x_build\maven-enforcer-plugin\target\it\cli-always-pass\build.log, f:\jenkins\jenkins-slave\workspace\n-box_maven-enforcer_master-KHI64AG3D4VZKUKLMNAYHKONI5AIQBLJ5ZKYGGSW7DAZVXCJBFHQ\windows-jdk8-m3.5.x_build\maven-enforcer-plugin\target\it\dependencies_converge\build.log, f:\jenkins\jenkins-slave\workspace\n-box_maven-enforcer_master-KHI64AG3D4VZKUKLMNAYHKONI5AIQBLJ5ZKYGGSW7DAZVXCJBFHQ\windows-jdk8-m3.5.x_build\maven-enforcer-plugin\target\it\dependencies_not_converging\build.log, f:\jenkins\jenkins-slave\workspace\n-box_maven-enforcer_master-KHI64AG3D4VZKUKLMNAYHKONI5AIQBLJ5ZKYGGSW7DAZVXCJBFHQ\windows-jdk8-m3.5.x_build\maven-enforcer-plugin\target\it\dependencies_not_converging_test_scope\build.log, f:\jenkins\jenkins-slave\workspace\n-box_maven-enforcer_master-KHI64AG3D4VZKUKLMNAYHKONI5AIQBLJ5ZKYGGSW7DAZVXCJBFHQ\windows-jdk8-m3.5.x_build\maven-enforcer-plugin\target\it\display-info\build.log, f:\jenkins\jenkins-slave\workspace\n-box_maven-enforcer_master-KHI64AG3D4VZKUKLMNAYHKONI5AIQBLJ5ZKYGGSW7DAZVXCJBFHQ\windows-jdk8-m3.5.x_build\maven-enforcer-plugin\target\it\evaluate-beanshell\build.log, f:\jenkins\jenkins-slave\workspace\n-box_maven-enforcer_master-KHI64AG3D4VZKUKLMNAYHKONI5AIQBLJ5ZKYGGSW7DAZVXCJBFHQ\windows-jdk8-m3.5.x_build\maven-enforcer-plugin\target\it\multimodule\build.log, f:\jenkins\jenkins-slave\workspace\n-box_maven-enforcer_master-KHI64AG3D4VZKUKLMNAYHKONI5AIQBLJ5ZKYGGSW7DAZVXCJBFHQ\windows-jdk8-m3.5.x_build\maven-enforcer-plugin\target\it\require-active-profile-all\build.log, f:\jenkins\jenkins-slave\workspace\n-box_maven-enforcer_master-KHI64AG3D4VZKUKLMNAYHKONI5AIQBLJ5ZKYGGSW7DAZVXCJBFHQ\windows-jdk8-m3.5.x_build\maven-enforcer-plugin\target\it\require-active-profile-from-settings\build.log, f:\jenkins\jenkins-slave\workspace\n-box_maven-enforcer_master-KHI64AG3D4VZKUKLMNAYHKONI5AIQBLJ5ZKYGGSW7DAZVXCJBFHQ\windows-jdk8-m3.5.x_build\maven-enforcer-plugin\target\it\require-active-profile\build.log, f:\jenkins\jenkins-slave\workspace\n-box_maven-enforcer_master-KHI64AG3D4VZKUKLMNAYHKONI5AIQBLJ5ZKYGGSW7DAZVXCJBFHQ\windows-jdk8-m3.5.x_build\maven-enforcer-plugin\target\it\require-file-checksum\build.log, f:\jenkins\jenkins-slave\workspace\n-box_maven-enforcer_master-KHI64AG3D4VZKUKLMNAYHKONI5AIQBLJ5ZKYGGSW7DAZVXCJBFHQ\windows-jdk8-m3.5.x_build\maven-enforcer-plugin\target\it\require-files-dont-exist\build.log, f:\jenkins\jenkins-slave\workspace\n-box_maven-enforcer_master-KHI64AG3D4VZKUKLMNAYHKONI5AIQBLJ5ZKYGGSW7DAZVXCJBFHQ\windows-jdk8-m3.5.x_build\maven-enforcer-plugin\target\it\require-files-exist\build.log, f:\jenkins\jenkins-slave\workspace\n-box_maven-enforcer_master-KHI64AG3D4VZKUKLMNAYHKONI5AIQBLJ5ZKYGGSW7DAZVXCJBFHQ\windows-jdk8-m3.5.x_build\maven-enforcer-plugin\target\it\require-files-size\build.log, f:\jenkins\jenkins-slave\workspace\n-box_maven-enforcer_master-KHI64AG3D4VZKUKLMNAYHKONI5AIQBLJ5ZKYGGSW7DAZVXCJBFHQ\windows-jdk8-m3.5.x_build\maven-enforcer-plugin\target\it\require-java-version\build.log, f:\jenkins\jenkins-slave\workspace\n-box_maven-enforcer_master-KHI64AG3D4VZKUKLMNAYHKONI5AIQBLJ5ZKYGGSW7DAZVXCJBFHQ\windows-jdk8-m3.5.x_build\maven-enforcer-plugin\target\it\require-maven-version\build.log, f:\jenkins\jenkins-slave\workspace\n-box_maven-enforcer_master-KHI64AG3D4VZKUKLMNAYHKONI5AIQBLJ5ZKYGGSW7DAZVXCJBFHQ\windows-jdk8-m3.5.x_build\maven-enforcer-plugin\target\it\require-no-repositories-allow-plugin-repo\build.log, f:\jenkins\jenkins-slave\workspace\n-box_maven-enforcer_master-KHI64AG3D4VZKUKLMNAYHKONI5AIQBLJ5ZKYGGSW7DAZVXCJBFHQ\windows-jdk8-m3.5.x_build\maven-enforcer-plugin\target\it\require-no-repositories-allow-repo\build.log, f:\jenkins\jenkins-slave\workspace\n-box_maven-enforcer_master-KHI64AG3D4VZKUKLMNAYHKONI5AIQBLJ5ZKYGGSW7DAZVXCJBFHQ\windows-jdk8-m3.5.x_build\maven-enforcer-plugin\target\it\require-no-repositories\build.log, f:\jenkins\jenkins-slave\workspace\n-box_maven-enforcer_master-KHI64AG3D4VZKUKLMNAYHKONI5AIQBLJ5ZKYGGSW7DAZVXCJBFHQ\windows-jdk8-m3.5.x_build\maven-enforcer-plugin\target\it\require-no-repositories_failure\build.log, f:\jenkins\jenkins-slave\workspace\n-box_maven-enforcer_master-KHI64AG3D4VZKUKLMNAYHKONI5AIQBLJ5ZKYGGSW7DAZVXCJBFHQ\windows-jdk8-m3.5.x_build\maven-enforcer-plugin\target\it\require-no-repositories_failure_allowed-plugin-repo\build.log, f:\jenkins\jenkins-slave\workspace\n-box_maven-enforcer_master-KHI64AG3D4VZKUKLMNAYHKONI5AIQBLJ5ZKYGGSW7DAZVXCJBFHQ\windows-jdk8-m3.5.x_build\maven-enforcer-plugin\target\it\require-no-repositories_failure_plugin-repositories\build.log, f:\jenkins\jenkins-slave\workspace\n-box_maven-enforcer_master-KHI64AG3D4VZKUKLMNAYHKONI5AIQBLJ5ZKYGGSW7DAZVXCJBFHQ\windows-jdk8-m3.5.x_build\maven-enforcer-plugin\target\it\require-no-repositories_failure_repositories\build.log, f:\jenkins\jenkins-slave\workspace\n-box_maven-enforcer_master-KHI64AG3D4VZKUKLMNAYHKONI5AIQBLJ5ZKYGGSW7DAZVXCJBFHQ\windows-jdk8-m3.5.x_build\maven-enforcer-plugin\target\it\require-no-repositories_mm\build.log, f:\jenkins\jenkins-slave\workspace\n-box_maven-enforcer_master-KHI64AG3D4VZKUKLMNAYHKONI5AIQBLJ5ZKYGGSW7DAZVXCJBFHQ\windows-jdk8-m3.5.x_build\maven-enforcer-plugin\target\it\require-no-repositories_mm_ci\build.log, f:\jenkins\jenkins-slave\workspace\n-box_maven-enforcer_master-KHI64AG3D4VZKUKLMNAYHKONI5AIQBLJ5ZKYGGSW7DAZVXCJBFHQ\windows-jdk8-m3.5.x_build\maven-enforcer-plugin\target\it\require-plugin-versions-ci\build.log, f:\jenkins\jenkins-slave\workspace\n-box_maven-enforcer_master-KHI64AG3D4VZKUKLMNAYHKONI5AIQBLJ5ZKYGGSW7DAZVXCJBFHQ\windows-jdk8-m3.5.x_build\maven-enforcer-plugin\target\it\require-plugin-versions-custom-packaging\build.log, f:\jenkins\jenkins-slave\workspace\n-box_maven-enforcer_master-KHI64AG3D4VZKUKLMNAYHKONI5AIQBLJ5ZKYGGSW7DAZVXCJBFHQ\windows-jdk8-m3.5.x_build\maven-enforcer-plugin\target\it\require-plugin-versions-expressions\build.log, f:\jenkins\jenkins-slave\workspace\n-box_maven-enforcer_master-KHI64AG3D4VZKUKLMNAYHKONI5AIQBLJ5ZKYGGSW7DAZVXCJBFHQ\windows-jdk8-m3.5.x_build\maven-enforcer-plugin\target\it\require-plugin-versions-mm-ci-friendly\build.log, f:\jenkins\jenkins-slave\workspace\n-box_maven-enforcer_master-KHI64AG3D4VZKUKLMNAYHKONI5AIQBLJ5ZKYGGSW7DAZVXCJBFHQ\windows-jdk8-m3.5.x_build\maven-enforcer-plugin\target\it\require-plugin-versions-plugin-with-extensions\build.log, f:\jenkins\jenkins-slave\workspace\n-box_maven-enforcer_master-KHI64AG3D4VZKUKLMNAYHKONI5AIQBLJ5ZKYGGSW7DAZVXCJBFHQ\windows-jdk8-m3.5.x_build\maven-enforcer-plugin\target\it\require-plugin-versions-plugin-with-integration-test-lifecycle\build.log, f:\jenkins\jenkins-slave\workspace\n-box_maven-enforcer_master-KHI64AG3D4VZKUKLMNAYHKONI5AIQBLJ5ZKYGGSW7DAZVXCJBFHQ\windows-jdk8-m3.5.x_build\maven-enforcer-plugin\target\it\require-plugin-versions-projectGAVexpressions\build.log, f:\jenkins\jenkins-slave\workspace\n-box_maven-enforcer_master-KHI64AG3D4VZKUKLMNAYHKONI5AIQBLJ5ZKYGGSW7DAZVXCJBFHQ\windows-jdk8-m3.5.x_build\maven-enforcer-plugin\target\it\require-plugin-versions\build.log, f:\jenkins\jenkins-slave\workspace\n-box_maven-enforcer_master-KHI64AG3D4VZKUKLMNAYHKONI5AIQBLJ5ZKYGGSW7DAZVXCJBFHQ\windows-jdk8-m3.5.x_build\maven-enforcer-plugin\target\it\require-profile-ids-exist_failure\build.log, f:\jenkins\jenkins-slave\workspace\n-box_maven-enforcer_master-KHI64AG3D4VZKUKLMNAYHKONI5AIQBLJ5ZKYGGSW7DAZVXCJBFHQ\windows-jdk8-m3.5.x_build\maven-enforcer-plugin\target\it\require-profile-ids-exist_success\build.log, f:\jenkins\jenkins-slave\workspace\n-box_maven-enforcer_master-KHI64AG3D4VZKUKLMNAYHKONI5AIQBLJ5ZKYGGSW7DAZVXCJBFHQ\windows-jdk8-m3.5.x_build\maven-enforcer-plugin\target\it\require-property\build.log, f:\jenkins\jenkins-slave\workspace\n-box_maven-enforcer_master-KHI64AG3D4VZKUKLMNAYHKONI5AIQBLJ5ZKYGGSW7DAZVXCJBFHQ\windows-jdk8-m3.5.x_build\maven-enforcer-plugin\target\it\require-release-dependencies-excludes\build.log, f:\jenkins\jenkins-slave\workspace\n-box_maven-enforcer_master-KHI64AG3D4VZKUKLMNAYHKONI5AIQBLJ5ZKYGGSW7DAZVXCJBFHQ\windows-jdk8-m3.5.x_build\maven-enforcer-plugin\target\it\require-release-dependencies-excludes_failure\build.log, f:\jenkins\jenkins-slave\workspace\n-box_maven-enforcer_master-KHI64AG3D4VZKUKLMNAYHKONI5AIQBLJ5ZKYGGSW7DAZVXCJBFHQ\windows-jdk8-m3.5.x_build\maven-enforcer-plugin\target\it\require-release-dependencies\build.log, f:\jenkins\jenkins-slave\workspace\n-box_maven-enforcer_master-KHI64AG3D4VZKUKLMNAYHKONI5AIQBLJ5ZKYGGSW7DAZVXCJBFHQ\windows-jdk8-m3.5.x_build\maven-enforcer-plugin\target\it\require-release-version\build.log, f:\jenkins\jenkins-slave\workspace\n-box_maven-enforcer_master-KHI64AG3D4VZKUKLMNAYHKONI5AIQBLJ5ZKYGGSW7DAZVXCJBFHQ\windows-jdk8-m3.5.x_build\maven-enforcer-plugin\target\it\require-same-versions_failure\build.log, f:\jenkins\jenkins-slave\workspace\n-box_maven-enforcer_master-KHI64AG3D4VZKUKLMNAYHKONI5AIQBLJ5ZKYGGSW7DAZVXCJBFHQ\windows-jdk8-m3.5.x_build\maven-enforcer-plugin\target\it\require-same-versions_success\build.log, f:\jenkins\jenkins-slave\workspace\n-box_maven-enforcer_master-KHI64AG3D4VZKUKLMNAYHKONI5AIQBLJ5ZKYGGSW7DAZVXCJBFHQ\windows-jdk8-m3.5.x_build\maven-enforcer-plugin\target\it\require-snapshot-version_failure\build.log, f:\jenkins\jenkins-slave\workspace\n-box_maven-enforcer_master-KHI64AG3D4VZKUKLMNAYHKONI5AIQBLJ5ZKYGGSW7DAZVXCJBFHQ\windows-jdk8-m3.5.x_build\maven-enforcer-plugin\target\it\require-snapshot-version_success\build.log, f:\jenkins\jenkins-slave\workspace\n-box_maven-enforcer_master-KHI64AG3D4VZKUKLMNAYHKONI5AIQBLJ5ZKYGGSW7DAZVXCJBFHQ\windows-jdk8-m3.5.x_build\maven-enforcer-plugin\target\it\require-upper-bound-dependencies-managed_failure\build.log, f:\jenkins\jenkins-slave\workspace\n-box_maven-enforcer_master-KHI64AG3D4VZKUKLMNAYHKONI5AIQBLJ5ZKYGGSW7DAZVXCJBFHQ\windows-jdk8-m3.5.x_build\maven-enforcer-plugin\target\it\require-upper-bound-dependencies-managed_success\build.log, f:\jenkins\jenkins-slave\workspace\n-box_maven-enforcer_master-KHI64AG3D4VZKUKLMNAYHKONI5AIQBLJ5ZKYGGSW7DAZVXCJBFHQ\windows-jdk8-m3.5.x_build\maven-enforcer-plugin\target\it\require-upper-bound-dependencies-unique_failure\build.log, f:\jenkins\jenkins-slave\workspace\n-box_maven-enforcer_master-KHI64AG3D4VZKUKLMNAYHKONI5AIQBLJ5ZKYGGSW7DAZVXCJBFHQ\windows-jdk8-m3.5.x_build\maven-enforcer-plugin\target\it\require-upper-bound-dependencies-unique_success\build.log, f:\jenkins\jenkins-slave\workspace\n-box_maven-enforcer_master-KHI64AG3D4VZKUKLMNAYHKONI5AIQBLJ5ZKYGGSW7DAZVXCJBFHQ\windows-jdk8-m3.5.x_build\maven-enforcer-plugin\target\it\require-upper-bound-deps_failure\build.log, f:\jenkins\jenkins-slave\workspace\n-box_maven-enforcer_master-KHI64AG3D4VZKUKLMNAYHKONI5AIQBLJ5ZKYGGSW7DAZVXCJBFHQ\windows-jdk8-m3.5.x_build\maven-enforcer-plugin\target\it\require-upper-bound-deps_ignored\build.log, f:\jenkins\jenkins-slave\workspace\n-box_maven-enforcer_master-KHI64AG3D4VZKUKLMNAYHKONI5AIQBLJ5ZKYGGSW7DAZVXCJBFHQ\windows-jdk8-m3.5.x_build\maven-enforcer-plugin\target\it\require-upper-bound-deps_success\build.log, f:\jenkins\jenkins-slave\workspace\n-box_maven-enforcer_master-KHI64AG3D4VZKUKLMNAYHKONI5AIQBLJ5ZKYGGSW7DAZVXCJBFHQ\windows-jdk8-m3.5.x_build\maven-enforcer-plugin\target\it\resolve_collect_dependencies\build.log]
[windows-jdk8-m3.5.x_build] Finished parsing Maven Invoker results (found 68)
[windows-jdk8-m3.5.x_build] [withMaven] junitPublisher - Archive test results for Maven artifact org.apache.maven.enforcer:enforcer-api:3.0.0-SNAPSHOT generated by maven-surefire-plugin:test (default-test): windows-jdk8-m3.5.x_build\enforcer-api\target\surefire-reports\*.xml
[windows-jdk8-m3.5.x_build] Recording test results
[windows-jdk8-m3.5.x_build] None of the test reports contained any result
[windows-jdk8-m3.5.x_build] [withMaven] junitPublisher - Archive test results for Maven artifact org.apache.maven.enforcer:enforcer-rules:3.0.0-SNAPSHOT generated by maven-surefire-plugin:test (default-test): windows-jdk8-m3.5.x_build\enforcer-rules\target\surefire-reports\*.xml
[windows-jdk8-m3.5.x_build] Recording test results
[windows-jdk8-m3.5.x_build] [withMaven] junitPublisher - Archive test results for Maven artifact org.apache.maven.plugins:maven-enforcer-plugin:3.0.0-SNAPSHOT generated by maven-surefire-plugin:test (default-test): windows-jdk8-m3.5.x_build\maven-enforcer-plugin\target\surefire-reports\*.xml
[windows-jdk8-m3.5.x_build] Recording test results
[windows-jdk8-m3.5.x_build] [withMaven] openTasksPublisher - Scan Tasks for Maven artifact org.apache.maven.enforcer:enforcer-api:3.0.0-SNAPSHOT in source directory windows-jdk8-m3.5.x_build\enforcer-api\src\main\java
[windows-jdk8-m3.5.x_build] [withMaven] openTasksPublisher - Scan Tasks for Maven artifact org.apache.maven.enforcer:enforcer-rules:3.0.0-SNAPSHOT in source directory windows-jdk8-m3.5.x_build\enforcer-rules\src\main\java
[windows-jdk8-m3.5.x_build] [withMaven] openTasksPublisher - Scan Tasks for Maven artifact org.apache.maven.plugins:maven-enforcer-plugin:3.0.0-SNAPSHOT in source directory windows-jdk8-m3.5.x_build\maven-enforcer-plugin\src\main\java
[windows-jdk8-m3.5.x_build] [TASKS] Scanning folder 'f:\jenkins\jenkins-slave\workspace\n-box_maven-enforcer_master-KHI64AG3D4VZKUKLMNAYHKONI5AIQBLJ5ZKYGGSW7DAZVXCJBFHQ' for files matching the pattern 'windows-jdk8-m3.5.x_build\enforcer-api\src\main\java\**\*,windows-jdk8-m3.5.x_build\enforcer-rules\src\main\java\**\*,windows-jdk8-m3.5.x_build\maven-enforcer-plugin\src\main\java\**\*' - excludes: null
[windows-jdk8-m3.5.x_build] [TASKS] Found 51 files to scan for tasks
[windows-jdk8-m3.5.x_build] [TASKS] Found 5 open tasks.
[windows-jdk8-m3.5.x_build] Skipping warnings blame since pipelines do not have an SCM link.%n
[windows-jdk8-m3.5.x_build] [TASKS] Computing warning deltas based on reference build #31
[Pipeline] [windows-jdk10-m3.5.x_build] }
[windows-jdk10-m3.5.x_build] [withMaven] artifactsPublisher - Archive artifact windows-jdk10-m3.5.x_build\pom.xml under org\apache\maven\enforcer\enforcer\3.0.0-SNAPSHOT\enforcer-3.0.0-SNAPSHOT.pom
[windows-jdk10-m3.5.x_build] [withMaven] artifactsPublisher - Archive artifact windows-jdk10-m3.5.x_build\target\enforcer-3.0.0-SNAPSHOT-site.xml under org\apache\maven\enforcer\enforcer\3.0.0-SNAPSHOT\enforcer-3.0.0-SNAPSHOT-site.xml
[windows-jdk10-m3.5.x_build] [withMaven] artifactsPublisher - Archive artifact windows-jdk10-m3.5.x_build\enforcer-api\pom.xml under org\apache\maven\enforcer\enforcer-api\3.0.0-SNAPSHOT\enforcer-api-3.0.0-SNAPSHOT.pom
[windows-jdk10-m3.5.x_build] [withMaven] artifactsPublisher - Archive artifact windows-jdk10-m3.5.x_build\enforcer-api\target\enforcer-api-3.0.0-SNAPSHOT.jar under org\apache\maven\enforcer\enforcer-api\3.0.0-SNAPSHOT\enforcer-api-3.0.0-SNAPSHOT.jar
[windows-jdk10-m3.5.x_build] [withMaven] artifactsPublisher - Archive artifact windows-jdk10-m3.5.x_build\enforcer-rules\pom.xml under org\apache\maven\enforcer\enforcer-rules\3.0.0-SNAPSHOT\enforcer-rules-3.0.0-SNAPSHOT.pom
[windows-jdk10-m3.5.x_build] [withMaven] artifactsPublisher - Archive artifact windows-jdk10-m3.5.x_build\enforcer-rules\target\enforcer-rules-3.0.0-SNAPSHOT.jar under org\apache\maven\enforcer\enforcer-rules\3.0.0-SNAPSHOT\enforcer-rules-3.0.0-SNAPSHOT.jar
[windows-jdk10-m3.5.x_build] [withMaven] artifactsPublisher - Archive artifact windows-jdk10-m3.5.x_build\enforcer-rules\target\enforcer-rules-3.0.0-SNAPSHOT-tests.jar under org\apache\maven\enforcer\enforcer-rules\3.0.0-SNAPSHOT\enforcer-rules-3.0.0-SNAPSHOT-tests.jar
[windows-jdk10-m3.5.x_build] [withMaven] artifactsPublisher - Archive artifact windows-jdk10-m3.5.x_build\maven-enforcer-plugin\pom.xml under org\apache\maven\plugins\maven-enforcer-plugin\3.0.0-SNAPSHOT\maven-enforcer-plugin-3.0.0-SNAPSHOT.pom
[windows-jdk10-m3.5.x_build] [withMaven] artifactsPublisher - Archive artifact windows-jdk10-m3.5.x_build\maven-enforcer-plugin\target\maven-enforcer-plugin-3.0.0-SNAPSHOT.jar under org\apache\maven\plugins\maven-enforcer-plugin\3.0.0-SNAPSHOT\maven-enforcer-plugin-3.0.0-SNAPSHOT.jar
[windows-jdk10-m3.5.x_build] [withMaven] invokerPublisher - Archive invoker results for Maven artifact MavenArtifact{org.apache.maven.plugins:maven-enforcer-plugin::3.0.0-SNAPSHOT(version: 3.0.0-SNAPSHOT, snapshot:false) } generated by PluginInvocation{org.apache.maven.plugins:maven-invoker-plugin:3.0.1@run  integration-test}: windows-jdk10-m3.5.x_build\maven-enforcer-plugin\target\invoker-reports\*.xml
[windows-jdk10-m3.5.x_build] performing MavenInvokerRecorder, reportsFilenamePattern:'**/windows-jdk10-m3.5.x_build\maven-enforcer-plugin\target\invoker-reports/BUILD*.xml', invokerBuildDir:'**/windows-jdk10-m3.5.x_build\maven-enforcer-plugin\target\it'
[windows-jdk10-m3.5.x_build] Found reports:[f:\jenkins\jenkins-slave\workspace\n-box_maven-enforcer_master-KHI64AG3D4VZKUKLMNAYHKONI5AIQBLJ5ZKYGGSW7DAZVXCJBFHQ\windows-jdk10-m3.5.x_build\maven-enforcer-plugin\target\invoker-reports\BUILD-always-fail-warn.xml, f:\jenkins\jenkins-slave\workspace\n-box_maven-enforcer_master-KHI64AG3D4VZKUKLMNAYHKONI5AIQBLJ5ZKYGGSW7DAZVXCJBFHQ\windows-jdk10-m3.5.x_build\maven-enforcer-plugin\target\invoker-reports\BUILD-always-fail.xml, f:\jenkins\jenkins-slave\workspace\n-box_maven-enforcer_master-KHI64AG3D4VZKUKLMNAYHKONI5AIQBLJ5ZKYGGSW7DAZVXCJBFHQ\windows-jdk10-m3.5.x_build\maven-enforcer-plugin\target\invoker-reports\BUILD-always-pass.xml, f:\jenkins\jenkins-slave\workspace\n-box_maven-enforcer_master-KHI64AG3D4VZKUKLMNAYHKONI5AIQBLJ5ZKYGGSW7DAZVXCJBFHQ\windows-jdk10-m3.5.x_build\maven-enforcer-plugin\target\invoker-reports\BUILD-ban-distribution-management-multi-module-build.xml, f:\jenkins\jenkins-slave\workspace\n-box_maven-enforcer_master-KHI64AG3D4VZKUKLMNAYHKONI5AIQBLJ5ZKYGGSW7DAZVXCJBFHQ\windows-jdk10-m3.5.x_build\maven-enforcer-plugin\target\invoker-reports\BUILD-ban-distribution-management-multi-module-except-site.xml, f:\jenkins\jenkins-slave\workspace\n-box_maven-enforcer_master-KHI64AG3D4VZKUKLMNAYHKONI5AIQBLJ5ZKYGGSW7DAZVXCJBFHQ\windows-jdk10-m3.5.x_build\maven-enforcer-plugin\target\invoker-reports\BUILD-ban-distribution-management.xml, f:\jenkins\jenkins-slave\workspace\n-box_maven-enforcer_master-KHI64AG3D4VZKUKLMNAYHKONI5AIQBLJ5ZKYGGSW7DAZVXCJBFHQ\windows-jdk10-m3.5.x_build\maven-enforcer-plugin\target\invoker-reports\BUILD-ban-pom-dependency-version.xml, f:\jenkins\jenkins-slave\workspace\n-box_maven-enforcer_master-KHI64AG3D4VZKUKLMNAYHKONI5AIQBLJ5ZKYGGSW7DAZVXCJBFHQ\windows-jdk10-m3.5.x_build\maven-enforcer-plugin\target\invoker-reports\BUILD-ban-transitive-dependencies-fail.xml, f:\jenkins\jenkins-slave\workspace\n-box_maven-enforcer_master-KHI64AG3D4VZKUKLMNAYHKONI5AIQBLJ5ZKYGGSW7DAZVXCJBFHQ\windows-jdk10-m3.5.x_build\maven-enforcer-plugin\target\invoker-reports\BUILD-ban-transitive-dependencies.xml, f:\jenkins\jenkins-slave\workspace\n-box_maven-enforcer_master-KHI64AG3D4VZKUKLMNAYHKONI5AIQBLJ5ZKYGGSW7DAZVXCJBFHQ\windows-jdk10-m3.5.x_build\maven-enforcer-plugin\target\invoker-reports\BUILD-banned-dependencies-versionrange-fail.xml, f:\jenkins\jenkins-slave\workspace\n-box_maven-enforcer_master-KHI64AG3D4VZKUKLMNAYHKONI5AIQBLJ5ZKYGGSW7DAZVXCJBFHQ\windows-jdk10-m3.5.x_build\maven-enforcer-plugin\target\invoker-reports\BUILD-banned-dependencies-versionrange.xml, f:\jenkins\jenkins-slave\workspace\n-box_maven-enforcer_master-KHI64AG3D4VZKUKLMNAYHKONI5AIQBLJ5ZKYGGSW7DAZVXCJBFHQ\windows-jdk10-m3.5.x_build\maven-enforcer-plugin\target\invoker-reports\BUILD-banned-dependencies-wildcards.xml, f:\jenkins\jenkins-slave\workspace\n-box_maven-enforcer_master-KHI64AG3D4VZKUKLMNAYHKONI5AIQBLJ5ZKYGGSW7DAZVXCJBFHQ\windows-jdk10-m3.5.x_build\maven-enforcer-plugin\target\invoker-reports\BUILD-banned-dependencies.xml, f:\jenkins\jenkins-slave\workspace\n-box_maven-enforcer_master-KHI64AG3D4VZKUKLMNAYHKONI5AIQBLJ5ZKYGGSW7DAZVXCJBFHQ\windows-jdk10-m3.5.x_build\maven-enforcer-plugin\target\invoker-reports\BUILD-banned-plugins.xml, f:\jenkins\jenkins-slave\workspace\n-box_maven-enforcer_master-KHI64AG3D4VZKUKLMNAYHKONI5AIQBLJ5ZKYGGSW7DAZVXCJBFHQ\windows-jdk10-m3.5.x_build\maven-enforcer-plugin\target\invoker-reports\BUILD-builds_a_pom_noop.xml, f:\jenkins\jenkins-slave\workspace\n-box_maven-enforcer_master-KHI64AG3D4VZKUKLMNAYHKONI5AIQBLJ5ZKYGGSW7DAZVXCJBFHQ\windows-jdk10-m3.5.x_build\maven-enforcer-plugin\target\invoker-reports\BUILD-cli-always-fail.xml, f:\jenkins\jenkins-slave\workspace\n-box_maven-enforcer_master-KHI64AG3D4VZKUKLMNAYHKONI5AIQBLJ5ZKYGGSW7DAZVXCJBFHQ\windows-jdk10-m3.5.x_build\maven-enforcer-plugin\target\invoker-reports\BUILD-cli-always-pass.xml, f:\jenkins\jenkins-slave\workspace\n-box_maven-enforcer_master-KHI64AG3D4VZKUKLMNAYHKONI5AIQBLJ5ZKYGGSW7DAZVXCJBFHQ\windows-jdk10-m3.5.x_build\maven-enforcer-plugin\target\invoker-reports\BUILD-dependencies_converge.xml, f:\jenkins\jenkins-slave\workspace\n-box_maven-enforcer_master-KHI64AG3D4VZKUKLMNAYHKONI5AIQBLJ5ZKYGGSW7DAZVXCJBFHQ\windows-jdk10-m3.5.x_build\maven-enforcer-plugin\target\invoker-reports\BUILD-dependencies_not_converging.xml, f:\jenkins\jenkins-slave\workspace\n-box_maven-enforcer_master-KHI64AG3D4VZKUKLMNAYHKONI5AIQBLJ5ZKYGGSW7DAZVXCJBFHQ\windows-jdk10-m3.5.x_build\maven-enforcer-plugin\target\invoker-reports\BUILD-dependencies_not_converging_test_scope.xml, f:\jenkins\jenkins-slave\workspace\n-box_maven-enforcer_master-KHI64AG3D4VZKUKLMNAYHKONI5AIQBLJ5ZKYGGSW7DAZVXCJBFHQ\windows-jdk10-m3.5.x_build\maven-enforcer-plugin\target\invoker-reports\BUILD-display-info.xml, f:\jenkins\jenkins-slave\workspace\n-box_maven-enforcer_master-KHI64AG3D4VZKUKLMNAYHKONI5AIQBLJ5ZKYGGSW7DAZVXCJBFHQ\windows-jdk10-m3.5.x_build\maven-enforcer-plugin\target\invoker-reports\BUILD-evaluate-beanshell.xml, f:\jenkins\jenkins-slave\workspace\n-box_maven-enforcer_master-KHI64AG3D4VZKUKLMNAYHKONI5AIQBLJ5ZKYGGSW7DAZVXCJBFHQ\windows-jdk10-m3.5.x_build\maven-enforcer-plugin\target\invoker-reports\BUILD-multimodule.xml, f:\jenkins\jenkins-slave\workspace\n-box_maven-enforcer_master-KHI64AG3D4VZKUKLMNAYHKONI5AIQBLJ5ZKYGGSW7DAZVXCJBFHQ\windows-jdk10-m3.5.x_build\maven-enforcer-plugin\target\invoker-reports\BUILD-require-active-profile-all.xml, f:\jenkins\jenkins-slave\workspace\n-box_maven-enforcer_master-KHI64AG3D4VZKUKLMNAYHKONI5AIQBLJ5ZKYGGSW7DAZVXCJBFHQ\windows-jdk10-m3.5.x_build\maven-enforcer-plugin\target\invoker-reports\BUILD-require-active-profile-from-settings.xml, f:\jenkins\jenkins-slave\workspace\n-box_maven-enforcer_master-KHI64AG3D4VZKUKLMNAYHKONI5AIQBLJ5ZKYGGSW7DAZVXCJBFHQ\windows-jdk10-m3.5.x_build\maven-enforcer-plugin\target\invoker-reports\BUILD-require-active-profile.xml, f:\jenkins\jenkins-slave\workspace\n-box_maven-enforcer_master-KHI64AG3D4VZKUKLMNAYHKONI5AIQBLJ5ZKYGGSW7DAZVXCJBFHQ\windows-jdk10-m3.5.x_build\maven-enforcer-plugin\target\invoker-reports\BUILD-require-file-checksum.xml, f:\jenkins\jenkins-slave\workspace\n-box_maven-enforcer_master-KHI64AG3D4VZKUKLMNAYHKONI5AIQBLJ5ZKYGGSW7DAZVXCJBFHQ\windows-jdk10-m3.5.x_build\maven-enforcer-plugin\target\invoker-reports\BUILD-require-files-dont-exist.xml, f:\jenkins\jenkins-slave\workspace\n-box_maven-enforcer_master-KHI64AG3D4VZKUKLMNAYHKONI5AIQBLJ5ZKYGGSW7DAZVXCJBFHQ\windows-jdk10-m3.5.x_build\maven-enforcer-plugin\target\invoker-reports\BUILD-require-files-exist.xml, f:\jenkins\jenkins-slave\workspace\n-box_maven-enforcer_master-KHI64AG3D4VZKUKLMNAYHKONI5AIQBLJ5ZKYGGSW7DAZVXCJBFHQ\windows-jdk10-m3.5.x_build\maven-enforcer-plugin\target\invoker-reports\BUILD-require-files-size.xml, f:\jenkins\jenkins-slave\workspace\n-box_maven-enforcer_master-KHI64AG3D4VZKUKLMNAYHKONI5AIQBLJ5ZKYGGSW7DAZVXCJBFHQ\windows-jdk10-m3.5.x_build\maven-enforcer-plugin\target\invoker-reports\BUILD-require-java-version.xml, f:\jenkins\jenkins-slave\workspace\n-box_maven-enforcer_master-KHI64AG3D4VZKUKLMNAYHKONI5AIQBLJ5ZKYGGSW7DAZVXCJBFHQ\windows-jdk10-m3.5.x_build\maven-enforcer-plugin\target\invoker-reports\BUILD-require-maven-version.xml, f:\jenkins\jenkins-slave\workspace\n-box_maven-enforcer_master-KHI64AG3D4VZKUKLMNAYHKONI5AIQBLJ5ZKYGGSW7DAZVXCJBFHQ\windows-jdk10-m3.5.x_build\maven-enforcer-plugin\target\invoker-reports\BUILD-require-no-repositories-allow-plugin-repo.xml, f:\jenkins\jenkins-slave\workspace\n-box_maven-enforcer_master-KHI64AG3D4VZKUKLMNAYHKONI5AIQBLJ5ZKYGGSW7DAZVXCJBFHQ\windows-jdk10-m3.5.x_build\maven-enforcer-plugin\target\invoker-reports\BUILD-require-no-repositories-allow-repo.xml, f:\jenkins\jenkins-slave\workspace\n-box_maven-enforcer_master-KHI64AG3D4VZKUKLMNAYHKONI5AIQBLJ5ZKYGGSW7DAZVXCJBFHQ\windows-jdk10-m3.5.x_build\maven-enforcer-plugin\target\invoker-reports\BUILD-require-no-repositories.xml, f:\jenkins\jenkins-slave\workspace\n-box_maven-enforcer_master-KHI64AG3D4VZKUKLMNAYHKONI5AIQBLJ5ZKYGGSW7DAZVXCJBFHQ\windows-jdk10-m3.5.x_build\maven-enforcer-plugin\target\invoker-reports\BUILD-require-no-repositories_failure.xml, f:\jenkins\jenkins-slave\workspace\n-box_maven-enforcer_master-KHI64AG3D4VZKUKLMNAYHKONI5AIQBLJ5ZKYGGSW7DAZVXCJBFHQ\windows-jdk10-m3.5.x_build\maven-enforcer-plugin\target\invoker-reports\BUILD-require-no-repositories_failure_allowed-plugin-repo.xml, f:\jenkins\jenkins-slave\workspace\n-box_maven-enforcer_master-KHI64AG3D4VZKUKLMNAYHKONI5AIQBLJ5ZKYGGSW7DAZVXCJBFHQ\windows-jdk10-m3.5.x_build\maven-enforcer-plugin\target\invoker-reports\BUILD-require-no-repositories_failure_plugin-repositories.xml, f:\jenkins\jenkins-slave\workspace\n-box_maven-enforcer_master-KHI64AG3D4VZKUKLMNAYHKONI5AIQBLJ5ZKYGGSW7DAZVXCJBFHQ\windows-jdk10-m3.5.x_build\maven-enforcer-plugin\target\invoker-reports\BUILD-require-no-repositories_failure_repositories.xml, f:\jenkins\jenkins-slave\workspace\n-box_maven-enforcer_master-KHI64AG3D4VZKUKLMNAYHKONI5AIQBLJ5ZKYGGSW7DAZVXCJBFHQ\windows-jdk10-m3.5.x_build\maven-enforcer-plugin\target\invoker-reports\BUILD-require-no-repositories_mm.xml, f:\jenkins\jenkins-slave\workspace\n-box_maven-enforcer_master-KHI64AG3D4VZKUKLMNAYHKONI5AIQBLJ5ZKYGGSW7DAZVXCJBFHQ\windows-jdk10-m3.5.x_build\maven-enforcer-plugin\target\invoker-reports\BUILD-require-no-repositories_mm_ci.xml, f:\jenkins\jenkins-slave\workspace\n-box_maven-enforcer_master-KHI64AG3D4VZKUKLMNAYHKONI5AIQBLJ5ZKYGGSW7DAZVXCJBFHQ\windows-jdk10-m3.5.x_build\maven-enforcer-plugin\target\invoker-reports\BUILD-require-plugin-versions-ci.xml, f:\jenkins\jenkins-slave\workspace\n-box_maven-enforcer_master-KHI64AG3D4VZKUKLMNAYHKONI5AIQBLJ5ZKYGGSW7DAZVXCJBFHQ\windows-jdk10-m3.5.x_build\maven-enforcer-plugin\target\invoker-reports\BUILD-require-plugin-versions-custom-packaging.xml, f:\jenkins\jenkins-slave\workspace\n-box_maven-enforcer_master-KHI64AG3D4VZKUKLMNAYHKONI5AIQBLJ5ZKYGGSW7DAZVXCJBFHQ\windows-jdk10-m3.5.x_build\maven-enforcer-plugin\target\invoker-reports\BUILD-require-plugin-versions-expressions.xml, f:\jenkins\jenkins-slave\workspace\n-box_maven-enforcer_master-KHI64AG3D4VZKUKLMNAYHKONI5AIQBLJ5ZKYGGSW7DAZVXCJBFHQ\windows-jdk10-m3.5.x_build\maven-enforcer-plugin\target\invoker-reports\BUILD-require-plugin-versions-mm-ci-friendly.xml, f:\jenkins\jenkins-slave\workspace\n-box_maven-enforcer_master-KHI64AG3D4VZKUKLMNAYHKONI5AIQBLJ5ZKYGGSW7DAZVXCJBFHQ\windows-jdk10-m3.5.x_build\maven-enforcer-plugin\target\invoker-reports\BUILD-require-plugin-versions-plugin-with-extensions.xml, f:\jenkins\jenkins-slave\workspace\n-box_maven-enforcer_master-KHI64AG3D4VZKUKLMNAYHKONI5AIQBLJ5ZKYGGSW7DAZVXCJBFHQ\windows-jdk10-m3.5.x_build\maven-enforcer-plugin\target\invoker-reports\BUILD-require-plugin-versions-plugin-with-integration-test-lifecycle.xml, f:\jenkins\jenkins-slave\workspace\n-box_maven-enforcer_master-KHI64AG3D4VZKUKLMNAYHKONI5AIQBLJ5ZKYGGSW7DAZVXCJBFHQ\windows-jdk10-m3.5.x_build\maven-enforcer-plugin\target\invoker-reports\BUILD-require-plugin-versions-projectGAVexpressions.xml, f:\jenkins\jenkins-slave\workspace\n-box_maven-enforcer_master-KHI64AG3D4VZKUKLMNAYHKONI5AIQBLJ5ZKYGGSW7DAZVXCJBFHQ\windows-jdk10-m3.5.x_build\maven-enforcer-plugin\target\invoker-reports\BUILD-require-plugin-versions.xml, f:\jenkins\jenkins-slave\workspace\n-box_maven-enforcer_master-KHI64AG3D4VZKUKLMNAYHKONI5AIQBLJ5ZKYGGSW7DAZVXCJBFHQ\windows-jdk10-m3.5.x_build\maven-enforcer-plugin\target\invoker-reports\BUILD-require-profile-ids-exist_failure.xml, f:\jenkins\jenkins-slave\workspace\n-box_maven-enforcer_master-KHI64AG3D4VZKUKLMNAYHKONI5AIQBLJ5ZKYGGSW7DAZVXCJBFHQ\windows-jdk10-m3.5.x_build\maven-enforcer-plugin\target\invoker-reports\BUILD-require-profile-ids-exist_success.xml, f:\jenkins\jenkins-slave\workspace\n-box_maven-enforcer_master-KHI64AG3D4VZKUKLMNAYHKONI5AIQBLJ5ZKYGGSW7DAZVXCJBFHQ\windows-jdk10-m3.5.x_build\maven-enforcer-plugin\target\invoker-reports\BUILD-require-property.xml, f:\jenkins\jenkins-slave\workspace\n-box_maven-enforcer_master-KHI64AG3D4VZKUKLMNAYHKONI5AIQBLJ5ZKYGGSW7DAZVXCJBFHQ\windows-jdk10-m3.5.x_build\maven-enforcer-plugin\target\invoker-reports\BUILD-require-release-dependencies-excludes.xml, f:\jenkins\jenkins-slave\workspace\n-box_maven-enforcer_master-KHI64AG3D4VZKUKLMNAYHKONI5AIQBLJ5ZKYGGSW7DAZVXCJBFHQ\windows-jdk10-m3.5.x_build\maven-enforcer-plugin\target\invoker-reports\BUILD-require-release-dependencies-excludes_failure.xml, f:\jenkins\jenkins-slave\workspace\n-box_maven-enforcer_master-KHI64AG3D4VZKUKLMNAYHKONI5AIQBLJ5ZKYGGSW7DAZVXCJBFHQ\windows-jdk10-m3.5.x_build\maven-enforcer-plugin\target\invoker-reports\BUILD-require-release-dependencies.xml, f:\jenkins\jenkins-slave\workspace\n-box_maven-enforcer_master-KHI64AG3D4VZKUKLMNAYHKONI5AIQBLJ5ZKYGGSW7DAZVXCJBFHQ\windows-jdk10-m3.5.x_build\maven-enforcer-plugin\target\invoker-reports\BUILD-require-release-version.xml, f:\jenkins\jenkins-slave\workspace\n-box_maven-enforcer_master-KHI64AG3D4VZKUKLMNAYHKONI5AIQBLJ5ZKYGGSW7DAZVXCJBFHQ\windows-jdk10-m3.5.x_build\maven-enforcer-plugin\target\invoker-reports\BUILD-require-same-versions_failure.xml, f:\jenkins\jenkins-slave\workspace\n-box_maven-enforcer_master-KHI64AG3D4VZKUKLMNAYHKONI5AIQBLJ5ZKYGGSW7DAZVXCJBFHQ\windows-jdk10-m3.5.x_build\maven-enforcer-plugin\target\invoker-reports\BUILD-require-same-versions_success.xml, f:\jenkins\jenkins-slave\workspace\n-box_maven-enforcer_master-KHI64AG3D4VZKUKLMNAYHKONI5AIQBLJ5ZKYGGSW7DAZVXCJBFHQ\windows-jdk10-m3.5.x_build\maven-enforcer-plugin\target\invoker-reports\BUILD-require-snapshot-version_failure.xml, f:\jenkins\jenkins-slave\workspace\n-box_maven-enforcer_master-KHI64AG3D4VZKUKLMNAYHKONI5AIQBLJ5ZKYGGSW7DAZVXCJBFHQ\windows-jdk10-m3.5.x_build\maven-enforcer-plugin\target\invoker-reports\BUILD-require-snapshot-version_success.xml, f:\jenkins\jenkins-slave\workspace\n-box_maven-enforcer_master-KHI64AG3D4VZKUKLMNAYHKONI5AIQBLJ5ZKYGGSW7DAZVXCJBFHQ\windows-jdk10-m3.5.x_build\maven-enforcer-plugin\target\invoker-reports\BUILD-require-upper-bound-dependencies-managed_failure.xml, f:\jenkins\jenkins-slave\workspace\n-box_maven-enforcer_master-KHI64AG3D4VZKUKLMNAYHKONI5AIQBLJ5ZKYGGSW7DAZVXCJBFHQ\windows-jdk10-m3.5.x_build\maven-enforcer-plugin\target\invoker-reports\BUILD-require-upper-bound-dependencies-managed_success.xml, f:\jenkins\jenkins-slave\workspace\n-box_maven-enforcer_master-KHI64AG3D4VZKUKLMNAYHKONI5AIQBLJ5ZKYGGSW7DAZVXCJBFHQ\windows-jdk10-m3.5.x_build\maven-enforcer-plugin\target\invoker-reports\BUILD-require-upper-bound-dependencies-unique_failure.xml, f:\jenkins\jenkins-slave\workspace\n-box_maven-enforcer_master-KHI64AG3D4VZKUKLMNAYHKONI5AIQBLJ5ZKYGGSW7DAZVXCJBFHQ\windows-jdk10-m3.5.x_build\maven-enforcer-plugin\target\invoker-reports\BUILD-require-upper-bound-dependencies-unique_success.xml, f:\jenkins\jenkins-slave\workspace\n-box_maven-enforcer_master-KHI64AG3D4VZKUKLMNAYHKONI5AIQBLJ5ZKYGGSW7DAZVXCJBFHQ\windows-jdk10-m3.5.x_build\maven-enforcer-plugin\target\invoker-reports\BUILD-require-upper-bound-deps_failure.xml, f:\jenkins\jenkins-slave\workspace\n-box_maven-enforcer_master-KHI64AG3D4VZKUKLMNAYHKONI5AIQBLJ5ZKYGGSW7DAZVXCJBFHQ\windows-jdk10-m3.5.x_build\maven-enforcer-plugin\target\invoker-reports\BUILD-require-upper-bound-deps_ignored.xml, f:\jenkins\jenkins-slave\workspace\n-box_maven-enforcer_master-KHI64AG3D4VZKUKLMNAYHKONI5AIQBLJ5ZKYGGSW7DAZVXCJBFHQ\windows-jdk10-m3.5.x_build\maven-enforcer-plugin\target\invoker-reports\BUILD-require-upper-bound-deps_success.xml, f:\jenkins\jenkins-slave\workspace\n-box_maven-enforcer_master-KHI64AG3D4VZKUKLMNAYHKONI5AIQBLJ5ZKYGGSW7DAZVXCJBFHQ\windows-jdk10-m3.5.x_build\maven-enforcer-plugin\target\invoker-reports\BUILD-resolve_collect_dependencies.xml]
[windows-jdk10-m3.5.x_build] Found logs:[f:\jenkins\jenkins-slave\workspace\n-box_maven-enforcer_master-KHI64AG3D4VZKUKLMNAYHKONI5AIQBLJ5ZKYGGSW7DAZVXCJBFHQ\windows-jdk10-m3.5.x_build\maven-enforcer-plugin\target\it\always-fail-warn\build.log, f:\jenkins\jenkins-slave\workspace\n-box_maven-enforcer_master-KHI64AG3D4VZKUKLMNAYHKONI5AIQBLJ5ZKYGGSW7DAZVXCJBFHQ\windows-jdk10-m3.5.x_build\maven-enforcer-plugin\target\it\always-fail\build.log, f:\jenkins\jenkins-slave\workspace\n-box_maven-enforcer_master-KHI64AG3D4VZKUKLMNAYHKONI5AIQBLJ5ZKYGGSW7DAZVXCJBFHQ\windows-jdk10-m3.5.x_build\maven-enforcer-plugin\target\it\always-pass\build.log, f:\jenkins\jenkins-slave\workspace\n-box_maven-enforcer_master-KHI64AG3D4VZKUKLMNAYHKONI5AIQBLJ5ZKYGGSW7DAZVXCJBFHQ\windows-jdk10-m3.5.x_build\maven-enforcer-plugin\target\it\ban-distribution-management-multi-module-build\build.log, f:\jenkins\jenkins-slave\workspace\n-box_maven-enforcer_master-KHI64AG3D4VZKUKLMNAYHKONI5AIQBLJ5ZKYGGSW7DAZVXCJBFHQ\windows-jdk10-m3.5.x_build\maven-enforcer-plugin\target\it\ban-distribution-management-multi-module-except-site\build.log, f:\jenkins\jenkins-slave\workspace\n-box_maven-enforcer_master-KHI64AG3D4VZKUKLMNAYHKONI5AIQBLJ5ZKYGGSW7DAZVXCJBFHQ\windows-jdk10-m3.5.x_build\maven-enforcer-plugin\target\it\ban-distribution-management\build.log, f:\jenkins\jenkins-slave\workspace\n-box_maven-enforcer_master-KHI64AG3D4VZKUKLMNAYHKONI5AIQBLJ5ZKYGGSW7DAZVXCJBFHQ\windows-jdk10-m3.5.x_build\maven-enforcer-plugin\target\it\ban-pom-dependency-version\build.log, f:\jenkins\jenkins-slave\workspace\n-box_maven-enforcer_master-KHI64AG3D4VZKUKLMNAYHKONI5AIQBLJ5ZKYGGSW7DAZVXCJBFHQ\windows-jdk10-m3.5.x_build\maven-enforcer-plugin\target\it\ban-transitive-dependencies-fail\build.log, f:\jenkins\jenkins-slave\workspace\n-box_maven-enforcer_master-KHI64AG3D4VZKUKLMNAYHKONI5AIQBLJ5ZKYGGSW7DAZVXCJBFHQ\windows-jdk10-m3.5.x_build\maven-enforcer-plugin\target\it\ban-transitive-dependencies\build.log, f:\jenkins\jenkins-slave\workspace\n-box_maven-enforcer_master-KHI64AG3D4VZKUKLMNAYHKONI5AIQBLJ5ZKYGGSW7DAZVXCJBFHQ\windows-jdk10-m3.5.x_build\maven-enforcer-plugin\target\it\banned-dependencies-versionrange-fail\build.log, f:\jenkins\jenkins-slave\workspace\n-box_maven-enforcer_master-KHI64AG3D4VZKUKLMNAYHKONI5AIQBLJ5ZKYGGSW7DAZVXCJBFHQ\windows-jdk10-m3.5.x_build\maven-enforcer-plugin\target\it\banned-dependencies-versionrange\build.log, f:\jenkins\jenkins-slave\workspace\n-box_maven-enforcer_master-KHI64AG3D4VZKUKLMNAYHKONI5AIQBLJ5ZKYGGSW7DAZVXCJBFHQ\windows-jdk10-m3.5.x_build\maven-enforcer-plugin\target\it\banned-dependencies-wildcards\build.log, f:\jenkins\jenkins-slave\workspace\n-box_maven-enforcer_master-KHI64AG3D4VZKUKLMNAYHKONI5AIQBLJ5ZKYGGSW7DAZVXCJBFHQ\windows-jdk10-m3.5.x_build\maven-enforcer-plugin\target\it\banned-dependencies\build.log, f:\jenkins\jenkins-slave\workspace\n-box_maven-enforcer_master-KHI64AG3D4VZKUKLMNAYHKONI5AIQBLJ5ZKYGGSW7DAZVXCJBFHQ\windows-jdk10-m3.5.x_build\maven-enforcer-plugin\target\it\banned-plugins\build.log, f:\jenkins\jenkins-slave\workspace\n-box_maven-enforcer_master-KHI64AG3D4VZKUKLMNAYHKONI5AIQBLJ5ZKYGGSW7DAZVXCJBFHQ\windows-jdk10-m3.5.x_build\maven-enforcer-plugin\target\it\builds_a_pom_noop\build.log, f:\jenkins\jenkins-slave\workspace\n-box_maven-enforcer_master-KHI64AG3D4VZKUKLMNAYHKONI5AIQBLJ5ZKYGGSW7DAZVXCJBFHQ\windows-jdk10-m3.5.x_build\maven-enforcer-plugin\target\it\cli-always-fail\build.log, f:\jenkins\jenkins-slave\workspace\n-box_maven-enforcer_master-KHI64AG3D4VZKUKLMNAYHKONI5AIQBLJ5ZKYGGSW7DAZVXCJBFHQ\windows-jdk10-m3.5.x_build\maven-enforcer-plugin\target\it\cli-always-pass\build.log, f:\jenkins\jenkins-slave\workspace\n-box_maven-enforcer_master-KHI64AG3D4VZKUKLMNAYHKONI5AIQBLJ5ZKYGGSW7DAZVXCJBFHQ\windows-jdk10-m3.5.x_build\maven-enforcer-plugin\target\it\dependencies_converge\build.log, f:\jenkins\jenkins-slave\workspace\n-box_maven-enforcer_master-KHI64AG3D4VZKUKLMNAYHKONI5AIQBLJ5ZKYGGSW7DAZVXCJBFHQ\windows-jdk10-m3.5.x_build\maven-enforcer-plugin\target\it\dependencies_not_converging\build.log, f:\jenkins\jenkins-slave\workspace\n-box_maven-enforcer_master-KHI64AG3D4VZKUKLMNAYHKONI5AIQBLJ5ZKYGGSW7DAZVXCJBFHQ\windows-jdk10-m3.5.x_build\maven-enforcer-plugin\target\it\dependencies_not_converging_test_scope\build.log, f:\jenkins\jenkins-slave\workspace\n-box_maven-enforcer_master-KHI64AG3D4VZKUKLMNAYHKONI5AIQBLJ5ZKYGGSW7DAZVXCJBFHQ\windows-jdk10-m3.5.x_build\maven-enforcer-plugin\target\it\display-info\build.log, f:\jenkins\jenkins-slave\workspace\n-box_maven-enforcer_master-KHI64AG3D4VZKUKLMNAYHKONI5AIQBLJ5ZKYGGSW7DAZVXCJBFHQ\windows-jdk10-m3.5.x_build\maven-enforcer-plugin\target\it\evaluate-beanshell\build.log, f:\jenkins\jenkins-slave\workspace\n-box_maven-enforcer_master-KHI64AG3D4VZKUKLMNAYHKONI5AIQBLJ5ZKYGGSW7DAZVXCJBFHQ\windows-jdk10-m3.5.x_build\maven-enforcer-plugin\target\it\multimodule\build.log, f:\jenkins\jenkins-slave\workspace\n-box_maven-enforcer_master-KHI64AG3D4VZKUKLMNAYHKONI5AIQBLJ5ZKYGGSW7DAZVXCJBFHQ\windows-jdk10-m3.5.x_build\maven-enforcer-plugin\target\it\require-active-profile-all\build.log, f:\jenkins\jenkins-slave\workspace\n-box_maven-enforcer_master-KHI64AG3D4VZKUKLMNAYHKONI5AIQBLJ5ZKYGGSW7DAZVXCJBFHQ\windows-jdk10-m3.5.x_build\maven-enforcer-plugin\target\it\require-active-profile-from-settings\build.log, f:\jenkins\jenkins-slave\workspace\n-box_maven-enforcer_master-KHI64AG3D4VZKUKLMNAYHKONI5AIQBLJ5ZKYGGSW7DAZVXCJBFHQ\windows-jdk10-m3.5.x_build\maven-enforcer-plugin\target\it\require-active-profile\build.log, f:\jenkins\jenkins-slave\workspace\n-box_maven-enforcer_master-KHI64AG3D4VZKUKLMNAYHKONI5AIQBLJ5ZKYGGSW7DAZVXCJBFHQ\windows-jdk10-m3.5.x_build\maven-enforcer-plugin\target\it\require-file-checksum\build.log, f:\jenkins\jenkins-slave\workspace\n-box_maven-enforcer_master-KHI64AG3D4VZKUKLMNAYHKONI5AIQBLJ5ZKYGGSW7DAZVXCJBFHQ\windows-jdk10-m3.5.x_build\maven-enforcer-plugin\target\it\require-files-dont-exist\build.log, f:\jenkins\jenkins-slave\workspace\n-box_maven-enforcer_master-KHI64AG3D4VZKUKLMNAYHKONI5AIQBLJ5ZKYGGSW7DAZVXCJBFHQ\windows-jdk10-m3.5.x_build\maven-enforcer-plugin\target\it\require-files-exist\build.log, f:\jenkins\jenkins-slave\workspace\n-box_maven-enforcer_master-KHI64AG3D4VZKUKLMNAYHKONI5AIQBLJ5ZKYGGSW7DAZVXCJBFHQ\windows-jdk10-m3.5.x_build\maven-enforcer-plugin\target\it\require-files-size\build.log, f:\jenkins\jenkins-slave\workspace\n-box_maven-enforcer_master-KHI64AG3D4VZKUKLMNAYHKONI5AIQBLJ5ZKYGGSW7DAZVXCJBFHQ\windows-jdk10-m3.5.x_build\maven-enforcer-plugin\target\it\require-java-version\build.log, f:\jenkins\jenkins-slave\workspace\n-box_maven-enforcer_master-KHI64AG3D4VZKUKLMNAYHKONI5AIQBLJ5ZKYGGSW7DAZVXCJBFHQ\windows-jdk10-m3.5.x_build\maven-enforcer-plugin\target\it\require-maven-version\build.log, f:\jenkins\jenkins-slave\workspace\n-box_maven-enforcer_master-KHI64AG3D4VZKUKLMNAYHKONI5AIQBLJ5ZKYGGSW7DAZVXCJBFHQ\windows-jdk10-m3.5.x_build\maven-enforcer-plugin\target\it\require-no-repositories-allow-plugin-repo\build.log, f:\jenkins\jenkins-slave\workspace\n-box_maven-enforcer_master-KHI64AG3D4VZKUKLMNAYHKONI5AIQBLJ5ZKYGGSW7DAZVXCJBFHQ\windows-jdk10-m3.5.x_build\maven-enforcer-plugin\target\it\require-no-repositories-allow-repo\build.log, f:\jenkins\jenkins-slave\workspace\n-box_maven-enforcer_master-KHI64AG3D4VZKUKLMNAYHKONI5AIQBLJ5ZKYGGSW7DAZVXCJBFHQ\windows-jdk10-m3.5.x_build\maven-enforcer-plugin\target\it\require-no-repositories\build.log, f:\jenkins\jenkins-slave\workspace\n-box_maven-enforcer_master-KHI64AG3D4VZKUKLMNAYHKONI5AIQBLJ5ZKYGGSW7DAZVXCJBFHQ\windows-jdk10-m3.5.x_build\maven-enforcer-plugin\target\it\require-no-repositories_failure\build.log, f:\jenkins\jenkins-slave\workspace\n-box_maven-enforcer_master-KHI64AG3D4VZKUKLMNAYHKONI5AIQBLJ5ZKYGGSW7DAZVXCJBFHQ\windows-jdk10-m3.5.x_build\maven-enforcer-plugin\target\it\require-no-repositories_failure_allowed-plugin-repo\build.log, f:\jenkins\jenkins-slave\workspace\n-box_maven-enforcer_master-KHI64AG3D4VZKUKLMNAYHKONI5AIQBLJ5ZKYGGSW7DAZVXCJBFHQ\windows-jdk10-m3.5.x_build\maven-enforcer-plugin\target\it\require-no-repositories_failure_plugin-repositories\build.log, f:\jenkins\jenkins-slave\workspace\n-box_maven-enforcer_master-KHI64AG3D4VZKUKLMNAYHKONI5AIQBLJ5ZKYGGSW7DAZVXCJBFHQ\windows-jdk10-m3.5.x_build\maven-enforcer-plugin\target\it\require-no-repositories_failure_repositories\build.log, f:\jenkins\jenkins-slave\workspace\n-box_maven-enforcer_master-KHI64AG3D4VZKUKLMNAYHKONI5AIQBLJ5ZKYGGSW7DAZVXCJBFHQ\windows-jdk10-m3.5.x_build\maven-enforcer-plugin\target\it\require-no-repositories_mm\build.log, f:\jenkins\jenkins-slave\workspace\n-box_maven-enforcer_master-KHI64AG3D4VZKUKLMNAYHKONI5AIQBLJ5ZKYGGSW7DAZVXCJBFHQ\windows-jdk10-m3.5.x_build\maven-enforcer-plugin\target\it\require-no-repositories_mm_ci\build.log, f:\jenkins\jenkins-slave\workspace\n-box_maven-enforcer_master-KHI64AG3D4VZKUKLMNAYHKONI5AIQBLJ5ZKYGGSW7DAZVXCJBFHQ\windows-jdk10-m3.5.x_build\maven-enforcer-plugin\target\it\require-plugin-versions-ci\build.log, f:\jenkins\jenkins-slave\workspace\n-box_maven-enforcer_master-KHI64AG3D4VZKUKLMNAYHKONI5AIQBLJ5ZKYGGSW7DAZVXCJBFHQ\windows-jdk10-m3.5.x_build\maven-enforcer-plugin\target\it\require-plugin-versions-custom-packaging\build.log, f:\jenkins\jenkins-slave\workspace\n-box_maven-enforcer_master-KHI64AG3D4VZKUKLMNAYHKONI5AIQBLJ5ZKYGGSW7DAZVXCJBFHQ\windows-jdk10-m3.5.x_build\maven-enforcer-plugin\target\it\require-plugin-versions-expressions\build.log, f:\jenkins\jenkins-slave\workspace\n-box_maven-enforcer_master-KHI64AG3D4VZKUKLMNAYHKONI5AIQBLJ5ZKYGGSW7DAZVXCJBFHQ\windows-jdk10-m3.5.x_build\maven-enforcer-plugin\target\it\require-plugin-versions-mm-ci-friendly\build.log, f:\jenkins\jenkins-slave\workspace\n-box_maven-enforcer_master-KHI64AG3D4VZKUKLMNAYHKONI5AIQBLJ5ZKYGGSW7DAZVXCJBFHQ\windows-jdk10-m3.5.x_build\maven-enforcer-plugin\target\it\require-plugin-versions-plugin-with-extensions\build.log, f:\jenkins\jenkins-slave\workspace\n-box_maven-enforcer_master-KHI64AG3D4VZKUKLMNAYHKONI5AIQBLJ5ZKYGGSW7DAZVXCJBFHQ\windows-jdk10-m3.5.x_build\maven-enforcer-plugin\target\it\require-plugin-versions-plugin-with-integration-test-lifecycle\build.log, f:\jenkins\jenkins-slave\workspace\n-box_maven-enforcer_master-KHI64AG3D4VZKUKLMNAYHKONI5AIQBLJ5ZKYGGSW7DAZVXCJBFHQ\windows-jdk10-m3.5.x_build\maven-enforcer-plugin\target\it\require-plugin-versions-projectGAVexpressions\build.log, f:\jenkins\jenkins-slave\workspace\n-box_maven-enforcer_master-KHI64AG3D4VZKUKLMNAYHKONI5AIQBLJ5ZKYGGSW7DAZVXCJBFHQ\windows-jdk10-m3.5.x_build\maven-enforcer-plugin\target\it\require-plugin-versions\build.log, f:\jenkins\jenkins-slave\workspace\n-box_maven-enforcer_master-KHI64AG3D4VZKUKLMNAYHKONI5AIQBLJ5ZKYGGSW7DAZVXCJBFHQ\windows-jdk10-m3.5.x_build\maven-enforcer-plugin\target\it\require-profile-ids-exist_failure\build.log, f:\jenkins\jenkins-slave\workspace\n-box_maven-enforcer_master-KHI64AG3D4VZKUKLMNAYHKONI5AIQBLJ5ZKYGGSW7DAZVXCJBFHQ\windows-jdk10-m3.5.x_build\maven-enforcer-plugin\target\it\require-profile-ids-exist_success\build.log, f:\jenkins\jenkins-slave\workspace\n-box_maven-enforcer_master-KHI64AG3D4VZKUKLMNAYHKONI5AIQBLJ5ZKYGGSW7DAZVXCJBFHQ\windows-jdk10-m3.5.x_build\maven-enforcer-plugin\target\it\require-property\build.log, f:\jenkins\jenkins-slave\workspace\n-box_maven-enforcer_master-KHI64AG3D4VZKUKLMNAYHKONI5AIQBLJ5ZKYGGSW7DAZVXCJBFHQ\windows-jdk10-m3.5.x_build\maven-enforcer-plugin\target\it\require-release-dependencies-excludes\build.log, f:\jenkins\jenkins-slave\workspace\n-box_maven-enforcer_master-KHI64AG3D4VZKUKLMNAYHKONI5AIQBLJ5ZKYGGSW7DAZVXCJBFHQ\windows-jdk10-m3.5.x_build\maven-enforcer-plugin\target\it\require-release-dependencies-excludes_failure\build.log, f:\jenkins\jenkins-slave\workspace\n-box_maven-enforcer_master-KHI64AG3D4VZKUKLMNAYHKONI5AIQBLJ5ZKYGGSW7DAZVXCJBFHQ\windows-jdk10-m3.5.x_build\maven-enforcer-plugin\target\it\require-release-dependencies\build.log, f:\jenkins\jenkins-slave\workspace\n-box_maven-enforcer_master-KHI64AG3D4VZKUKLMNAYHKONI5AIQBLJ5ZKYGGSW7DAZVXCJBFHQ\windows-jdk10-m3.5.x_build\maven-enforcer-plugin\target\it\require-release-version\build.log, f:\jenkins\jenkins-slave\workspace\n-box_maven-enforcer_master-KHI64AG3D4VZKUKLMNAYHKONI5AIQBLJ5ZKYGGSW7DAZVXCJBFHQ\windows-jdk10-m3.5.x_build\maven-enforcer-plugin\target\it\require-same-versions_failure\build.log, f:\jenkins\jenkins-slave\workspace\n-box_maven-enforcer_master-KHI64AG3D4VZKUKLMNAYHKONI5AIQBLJ5ZKYGGSW7DAZVXCJBFHQ\windows-jdk10-m3.5.x_build\maven-enforcer-plugin\target\it\require-same-versions_success\build.log, f:\jenkins\jenkins-slave\workspace\n-box_maven-enforcer_master-KHI64AG3D4VZKUKLMNAYHKONI5AIQBLJ5ZKYGGSW7DAZVXCJBFHQ\windows-jdk10-m3.5.x_build\maven-enforcer-plugin\target\it\require-snapshot-version_failure\build.log, f:\jenkins\jenkins-slave\workspace\n-box_maven-enforcer_master-KHI64AG3D4VZKUKLMNAYHKONI5AIQBLJ5ZKYGGSW7DAZVXCJBFHQ\windows-jdk10-m3.5.x_build\maven-enforcer-plugin\target\it\require-snapshot-version_success\build.log, f:\jenkins\jenkins-slave\workspace\n-box_maven-enforcer_master-KHI64AG3D4VZKUKLMNAYHKONI5AIQBLJ5ZKYGGSW7DAZVXCJBFHQ\windows-jdk10-m3.5.x_build\maven-enforcer-plugin\target\it\require-upper-bound-dependencies-managed_failure\build.log, f:\jenkins\jenkins-slave\workspace\n-box_maven-enforcer_master-KHI64AG3D4VZKUKLMNAYHKONI5AIQBLJ5ZKYGGSW7DAZVXCJBFHQ\windows-jdk10-m3.5.x_build\maven-enforcer-plugin\target\it\require-upper-bound-dependencies-managed_success\build.log, f:\jenkins\jenkins-slave\workspace\n-box_maven-enforcer_master-KHI64AG3D4VZKUKLMNAYHKONI5AIQBLJ5ZKYGGSW7DAZVXCJBFHQ\windows-jdk10-m3.5.x_build\maven-enforcer-plugin\target\it\require-upper-bound-dependencies-unique_failure\build.log, f:\jenkins\jenkins-slave\workspace\n-box_maven-enforcer_master-KHI64AG3D4VZKUKLMNAYHKONI5AIQBLJ5ZKYGGSW7DAZVXCJBFHQ\windows-jdk10-m3.5.x_build\maven-enforcer-plugin\target\it\require-upper-bound-dependencies-unique_success\build.log, f:\jenkins\jenkins-slave\workspace\n-box_maven-enforcer_master-KHI64AG3D4VZKUKLMNAYHKONI5AIQBLJ5ZKYGGSW7DAZVXCJBFHQ\windows-jdk10-m3.5.x_build\maven-enforcer-plugin\target\it\require-upper-bound-deps_failure\build.log, f:\jenkins\jenkins-slave\workspace\n-box_maven-enforcer_master-KHI64AG3D4VZKUKLMNAYHKONI5AIQBLJ5ZKYGGSW7DAZVXCJBFHQ\windows-jdk10-m3.5.x_build\maven-enforcer-plugin\target\it\require-upper-bound-deps_ignored\build.log, f:\jenkins\jenkins-slave\workspace\n-box_maven-enforcer_master-KHI64AG3D4VZKUKLMNAYHKONI5AIQBLJ5ZKYGGSW7DAZVXCJBFHQ\windows-jdk10-m3.5.x_build\maven-enforcer-plugin\target\it\require-upper-bound-deps_success\build.log, f:\jenkins\jenkins-slave\workspace\n-box_maven-enforcer_master-KHI64AG3D4VZKUKLMNAYHKONI5AIQBLJ5ZKYGGSW7DAZVXCJBFHQ\windows-jdk10-m3.5.x_build\maven-enforcer-plugin\target\it\resolve_collect_dependencies\build.log]
[windows-jdk10-m3.5.x_build] Finished parsing Maven Invoker results (found 68)
[windows-jdk10-m3.5.x_build] [withMaven] junitPublisher - Archive test results for Maven artifact org.apache.maven.enforcer:enforcer-api:3.0.0-SNAPSHOT generated by maven-surefire-plugin:test (default-test): windows-jdk10-m3.5.x_build\enforcer-api\target\surefire-reports\*.xml
[windows-jdk10-m3.5.x_build] Recording test results
[windows-jdk10-m3.5.x_build] None of the test reports contained any result
[windows-jdk10-m3.5.x_build] [withMaven] junitPublisher - Archive test results for Maven artifact org.apache.maven.enforcer:enforcer-rules:3.0.0-SNAPSHOT generated by maven-surefire-plugin:test (default-test): windows-jdk10-m3.5.x_build\enforcer-rules\target\surefire-reports\*.xml
[windows-jdk10-m3.5.x_build] Recording test results
[windows-jdk10-m3.5.x_build] [withMaven] junitPublisher - Archive test results for Maven artifact org.apache.maven.plugins:maven-enforcer-plugin:3.0.0-SNAPSHOT generated by maven-surefire-plugin:test (default-test): windows-jdk10-m3.5.x_build\maven-enforcer-plugin\target\surefire-reports\*.xml
[windows-jdk10-m3.5.x_build] Recording test results
[windows-jdk10-m3.5.x_build] [withMaven] openTasksPublisher - Scan Tasks for Maven artifact org.apache.maven.enforcer:enforcer-api:3.0.0-SNAPSHOT in source directory windows-jdk10-m3.5.x_build\enforcer-api\src\main\java
[windows-jdk10-m3.5.x_build] [withMaven] openTasksPublisher - Scan Tasks for Maven artifact org.apache.maven.enforcer:enforcer-rules:3.0.0-SNAPSHOT in source directory windows-jdk10-m3.5.x_build\enforcer-rules\src\main\java
[windows-jdk10-m3.5.x_build] [withMaven] openTasksPublisher - Scan Tasks for Maven artifact org.apache.maven.plugins:maven-enforcer-plugin:3.0.0-SNAPSHOT in source directory windows-jdk10-m3.5.x_build\maven-enforcer-plugin\src\main\java
[windows-jdk10-m3.5.x_build] [TASKS] Scanning folder 'f:\jenkins\jenkins-slave\workspace\n-box_maven-enforcer_master-KHI64AG3D4VZKUKLMNAYHKONI5AIQBLJ5ZKYGGSW7DAZVXCJBFHQ' for files matching the pattern 'windows-jdk10-m3.5.x_build\enforcer-api\src\main\java\**\*,windows-jdk10-m3.5.x_build\enforcer-rules\src\main\java\**\*,windows-jdk10-m3.5.x_build\maven-enforcer-plugin\src\main\java\**\*' - excludes: null
[windows-jdk10-m3.5.x_build] [TASKS] Found 51 files to scan for tasks
[windows-jdk10-m3.5.x_build] [TASKS] Found 5 open tasks.
[windows-jdk10-m3.5.x_build] Skipping warnings blame since pipelines do not have an SCM link.%n
[windows-jdk10-m3.5.x_build] [TASKS] Computing warning deltas based on reference build #31
[Pipeline] [windows-jdk8-m3.5.x_build] // withMaven
[Pipeline] [windows-jdk10-m3.5.x_build] // withMaven
[Pipeline] [windows-jdk9-m3.5.x_build] }
[Pipeline] [windows-jdk8-m3.5.x_build] cleanWs
[Pipeline] [windows-jdk10-m3.5.x_build] cleanWs
[Pipeline] [windows-jdk9-m3.5.x_build] // stage
[Pipeline] [windows-jdk9-m3.5.x_build] }
[Pipeline] [windows-jdk9-m3.5.x_build] // node
[Pipeline] [windows-jdk9-m3.5.x_build] }
[windows-jdk10-m3.5.x_build] [WS-CLEANUP] Deleting project workspace...[WS-CLEANUP] done
[Pipeline] [windows-jdk10-m3.5.x_build] }
[Pipeline] [windows-jdk10-m3.5.x_build] // stage
[Pipeline] [windows-jdk10-m3.5.x_build] }
[Pipeline] [windows-jdk10-m3.5.x_build] // node
[Pipeline] [windows-jdk10-m3.5.x_build] }
[windows-jdk8-m3.5.x_build] [WS-CLEANUP] Deleting project workspace...[WS-CLEANUP] done
[Pipeline] [windows-jdk8-m3.5.x_build] }
[Pipeline] [windows-jdk8-m3.5.x_build] // stage
[Pipeline] [windows-jdk8-m3.5.x_build] }
[Pipeline] [windows-jdk8-m3.5.x_build] // node
[Pipeline] [windows-jdk8-m3.5.x_build] }
[windows-jdk7-m3.5.x_build] [INFO]           require-snapshot-version_failure\pom.xml ......... SUCCESS (7.4 s)
[windows-jdk7-m3.5.x_build] [INFO] Building: require-snapshot-version_success\pom.xml
[windows-jdk7-m3.5.x_build] [INFO]           require-snapshot-version_success\pom.xml ......... SUCCESS (6.8 s)
[windows-jdk7-m3.5.x_build] [INFO] Building: require-upper-bound-dependencies-managed_failure\pom.xml
[windows-jdk7-m3.5.x_build] [INFO] run post-build script verify.groovy
[windows-jdk7-m3.5.x_build] [INFO]           require-upper-bound-dependencies-managed_failure\pom.xml SUCCESS (7.4 s)
[windows-jdk7-m3.5.x_build] [INFO] Building: require-upper-bound-dependencies-managed_success\pom.xml
[windows-jdk7-m3.5.x_build] [INFO]           require-upper-bound-dependencies-managed_success\pom.xml SUCCESS (7.8 s)
[windows-jdk7-m3.5.x_build] [INFO] Building: require-upper-bound-dependencies-unique_failure\pom.xml
[windows-jdk7-m3.5.x_build] [INFO] snapshot org.apache.maven.plugins.enforcer.its:menforcer134_project:1.0-SNAPSHOT: checking for updates from apache-snapshots
[windows-jdk7-m3.5.x_build] [INFO] snapshot org.apache.maven.plugins.enforcer.its:menforcer134_project:1.0-SNAPSHOT: checking for updates from Nexus
[windows-jdk7-m3.5.x_build] [INFO] artifact org.apache.maven.plugins.enforcer.its.menforcer134_project:1.0-SNAPSHOT: checking for updates from central
[windows-jdk7-m3.5.x_build] [INFO] org.apache.maven.plugins.enforcer.its.menforcer134_project.1.0-SNAPSHOT: checking for updates from central
[windows-jdk7-m3.5.x_build] [INFO] snapshot org.apache.maven.plugins.enforcer.its:menforcer134_modelbuilder:1.0-SNAPSHOT: checking for updates from apache-snapshots
[windows-jdk7-m3.5.x_build] [INFO] snapshot org.apache.maven.plugins.enforcer.its:menforcer134_modelbuilder:1.0-SNAPSHOT: checking for updates from Nexus
[windows-jdk7-m3.5.x_build] [INFO] artifact org.apache.maven.plugins.enforcer.its.menforcer134_modelbuilder:1.0-SNAPSHOT: checking for updates from central
[windows-jdk7-m3.5.x_build] [INFO] org.apache.maven.plugins.enforcer.its.menforcer134_modelbuilder.1.0-SNAPSHOT: checking for updates from central
[windows-jdk7-m3.5.x_build] [INFO] snapshot org.apache.maven.plugins.enforcer.its:menforcer134_model:1.0-SNAPSHOT: checking for updates from apache-snapshots
[windows-jdk7-m3.5.x_build] [INFO] snapshot org.apache.maven.plugins.enforcer.its:menforcer134_model:1.0-SNAPSHOT: checking for updates from Nexus
[windows-jdk7-m3.5.x_build] [INFO] artifact org.apache.maven.plugins.enforcer.its.menforcer134_model:1.0-SNAPSHOT: checking for updates from central
[windows-jdk7-m3.5.x_build] [INFO] org.apache.maven.plugins.enforcer.its.menforcer134_model.1.0-SNAPSHOT: checking for updates from central
[windows-jdk7-m3.5.x_build] [INFO] run post-build script verify.groovy
[windows-jdk7-m3.5.x_build] [INFO]           require-upper-bound-dependencies-unique_failure\pom.xml SUCCESS (9.6 s)
[windows-jdk7-m3.5.x_build] [INFO] Building: require-upper-bound-dependencies-unique_success\pom.xml
[windows-jdk7-m3.5.x_build] [INFO]           require-upper-bound-dependencies-unique_success\pom.xml SUCCESS (8.1 s)
[windows-jdk7-m3.5.x_build] [INFO] Building: require-upper-bound-deps_failure\pom.xml
[windows-jdk7-m3.5.x_build] [INFO] run post-build script verify.groovy
[windows-jdk7-m3.5.x_build] [INFO]           require-upper-bound-deps_failure\pom.xml ......... SUCCESS (7.6 s)
[windows-jdk7-m3.5.x_build] [INFO] Building: require-upper-bound-deps_ignored\pom.xml
[windows-jdk7-m3.5.x_build] [INFO] run post-build script verify.groovy
[windows-jdk7-m3.5.x_build] [INFO]           require-upper-bound-deps_ignored\pom.xml ......... SUCCESS (6.9 s)
[windows-jdk7-m3.5.x_build] [INFO] Building: require-upper-bound-deps_success\pom.xml
[windows-jdk7-m3.5.x_build] [INFO]           require-upper-bound-deps_success\pom.xml ......... SUCCESS (7.7 s)
[windows-jdk7-m3.5.x_build] [INFO] Building: resolve_collect_dependencies\pom.xml
[windows-jdk7-m3.5.x_build] [INFO] run post-build script verify.groovy
[windows-jdk7-m3.5.x_build] [INFO]           resolve_collect_dependencies\pom.xml ............. SUCCESS (12.2 s)
[windows-jdk7-m3.5.x_build] [INFO] -------------------------------------------------
[windows-jdk7-m3.5.x_build] [INFO] Build Summary:
[windows-jdk7-m3.5.x_build] [INFO]   Passed: 68, Failed: 0, Errors: 0, Skipped: 0
[windows-jdk7-m3.5.x_build] [INFO] -------------------------------------------------
[windows-jdk7-m3.5.x_build] [INFO] 
[windows-jdk7-m3.5.x_build] [INFO] --- mrm-maven-plugin:1.0.0:stop (default) @ maven-enforcer-plugin ---
[windows-jdk7-m3.5.x_build] [INFO] Stopping Mock Repository Manager on http://localhost:50694
[windows-jdk7-m3.5.x_build] [INFO] Mock Repository Manager http://localhost:50694 is stopped.
[windows-jdk7-m3.5.x_build] [INFO] 
[windows-jdk7-m3.5.x_build] [INFO] --- maven-checkstyle-plugin:3.0.0:check (checkstyle-check) @ maven-enforcer-plugin ---
[windows-jdk7-m3.5.x_build] [INFO] ------------------------------------------------------------------------
[windows-jdk7-m3.5.x_build] [INFO] Reactor Summary:
[windows-jdk7-m3.5.x_build] [INFO] 
[windows-jdk7-m3.5.x_build] [INFO] Apache Maven Enforcer .............................. SUCCESS [ 50.877 s]
[windows-jdk7-m3.5.x_build] [INFO] Apache Maven Enforcer API .......................... SUCCESS [ 10.553 s]
[windows-jdk7-m3.5.x_build] [INFO] Apache Maven Enforcer Built-In Rules ............... SUCCESS [ 29.192 s]
[windows-jdk7-m3.5.x_build] [INFO] Apache Maven Enforcer Plugin ....................... SUCCESS [09:52 min]
[windows-jdk7-m3.5.x_build] [INFO] ------------------------------------------------------------------------
[windows-jdk7-m3.5.x_build] [INFO] BUILD SUCCESS
[windows-jdk7-m3.5.x_build] [INFO] ------------------------------------------------------------------------
[windows-jdk7-m3.5.x_build] [INFO] Total time: 11:25 min
[windows-jdk7-m3.5.x_build] [INFO] Finished at: 2018-08-16T22:34:50-07:00
[windows-jdk7-m3.5.x_build] [INFO] Final Memory: 48M/359M
[windows-jdk7-m3.5.x_build] [INFO] ------------------------------------------------------------------------
[windows-jdk7-m3.5.x_build] [INFO] [jenkins-event-spy] Generated F:\jenkins\jenkins-slave\workspace\n-box_maven-enforcer_master-KHI64AG3D4VZKUKLMNAYHKONI5AIQBLJ5ZKYGGSW7DAZVXCJBFHQ@tmp\withMaven1d9957a9\maven-spy-20180816-222324-6641195164940289948762.log
[windows-jdk7-m3.5.x_build] Picked up JAVA_TOOL_OPTIONS: -Dmaven.ext.class.path="f:\jenkins\jenkins-slave\workspace\n-box_maven-enforcer_master-KHI64AG3D4VZKUKLMNAYHKONI5AIQBLJ5ZKYGGSW7DAZVXCJBFHQ@tmp\withMaven1d9957a9\pipeline-maven-spy.jar" -Dorg.jenkinsci.plugins.pipeline.maven.reportsFolder="f:\jenkins\jenkins-slave\workspace\n-box_maven-enforcer_master-KHI64AG3D4VZKUKLMNAYHKONI5AIQBLJ5ZKYGGSW7DAZVXCJBFHQ@tmp\withMaven1d9957a9" 
[Pipeline] [windows-jdk7-m3.5.x_build] }
[Pipeline] [windows-jdk7-m3.5.x_build] // dir
[Pipeline] [windows-jdk7-m3.5.x_build] }
[windows-jdk7-m3.5.x_build] [withMaven] artifactsPublisher - Archive artifact windows-jdk7-m3.5.x_build\pom.xml under org\apache\maven\enforcer\enforcer\3.0.0-SNAPSHOT\enforcer-3.0.0-SNAPSHOT.pom
[windows-jdk7-m3.5.x_build] [withMaven] artifactsPublisher - Archive artifact windows-jdk7-m3.5.x_build\target\enforcer-3.0.0-SNAPSHOT-site.xml under org\apache\maven\enforcer\enforcer\3.0.0-SNAPSHOT\enforcer-3.0.0-SNAPSHOT-site.xml
[windows-jdk7-m3.5.x_build] [withMaven] artifactsPublisher - Archive artifact windows-jdk7-m3.5.x_build\enforcer-api\pom.xml under org\apache\maven\enforcer\enforcer-api\3.0.0-SNAPSHOT\enforcer-api-3.0.0-SNAPSHOT.pom
[windows-jdk7-m3.5.x_build] [withMaven] artifactsPublisher - Archive artifact windows-jdk7-m3.5.x_build\enforcer-api\target\enforcer-api-3.0.0-SNAPSHOT.jar under org\apache\maven\enforcer\enforcer-api\3.0.0-SNAPSHOT\enforcer-api-3.0.0-SNAPSHOT.jar
[windows-jdk7-m3.5.x_build] [withMaven] artifactsPublisher - Archive artifact windows-jdk7-m3.5.x_build\enforcer-rules\pom.xml under org\apache\maven\enforcer\enforcer-rules\3.0.0-SNAPSHOT\enforcer-rules-3.0.0-SNAPSHOT.pom
[windows-jdk7-m3.5.x_build] [withMaven] artifactsPublisher - Archive artifact windows-jdk7-m3.5.x_build\enforcer-rules\target\enforcer-rules-3.0.0-SNAPSHOT.jar under org\apache\maven\enforcer\enforcer-rules\3.0.0-SNAPSHOT\enforcer-rules-3.0.0-SNAPSHOT.jar
[windows-jdk7-m3.5.x_build] [withMaven] artifactsPublisher - Archive artifact windows-jdk7-m3.5.x_build\enforcer-rules\target\enforcer-rules-3.0.0-SNAPSHOT-tests.jar under org\apache\maven\enforcer\enforcer-rules\3.0.0-SNAPSHOT\enforcer-rules-3.0.0-SNAPSHOT-tests.jar
[windows-jdk7-m3.5.x_build] [withMaven] artifactsPublisher - Archive artifact windows-jdk7-m3.5.x_build\maven-enforcer-plugin\pom.xml under org\apache\maven\plugins\maven-enforcer-plugin\3.0.0-SNAPSHOT\maven-enforcer-plugin-3.0.0-SNAPSHOT.pom
[windows-jdk7-m3.5.x_build] [withMaven] artifactsPublisher - Archive artifact windows-jdk7-m3.5.x_build\maven-enforcer-plugin\target\maven-enforcer-plugin-3.0.0-SNAPSHOT.jar under org\apache\maven\plugins\maven-enforcer-plugin\3.0.0-SNAPSHOT\maven-enforcer-plugin-3.0.0-SNAPSHOT.jar
[windows-jdk7-m3.5.x_build] [withMaven] invokerPublisher - Archive invoker results for Maven artifact MavenArtifact{org.apache.maven.plugins:maven-enforcer-plugin::3.0.0-SNAPSHOT(version: 3.0.0-SNAPSHOT, snapshot:false) } generated by PluginInvocation{org.apache.maven.plugins:maven-invoker-plugin:3.0.1@run  integration-test}: windows-jdk7-m3.5.x_build\maven-enforcer-plugin\target\invoker-reports\*.xml
[windows-jdk7-m3.5.x_build] performing MavenInvokerRecorder, reportsFilenamePattern:'**/windows-jdk7-m3.5.x_build\maven-enforcer-plugin\target\invoker-reports/BUILD*.xml', invokerBuildDir:'**/windows-jdk7-m3.5.x_build\maven-enforcer-plugin\target\it'
[windows-jdk7-m3.5.x_build] Found reports:[f:\jenkins\jenkins-slave\workspace\n-box_maven-enforcer_master-KHI64AG3D4VZKUKLMNAYHKONI5AIQBLJ5ZKYGGSW7DAZVXCJBFHQ\windows-jdk7-m3.5.x_build\maven-enforcer-plugin\target\invoker-reports\BUILD-always-fail-warn.xml, f:\jenkins\jenkins-slave\workspace\n-box_maven-enforcer_master-KHI64AG3D4VZKUKLMNAYHKONI5AIQBLJ5ZKYGGSW7DAZVXCJBFHQ\windows-jdk7-m3.5.x_build\maven-enforcer-plugin\target\invoker-reports\BUILD-always-fail.xml, f:\jenkins\jenkins-slave\workspace\n-box_maven-enforcer_master-KHI64AG3D4VZKUKLMNAYHKONI5AIQBLJ5ZKYGGSW7DAZVXCJBFHQ\windows-jdk7-m3.5.x_build\maven-enforcer-plugin\target\invoker-reports\BUILD-always-pass.xml, f:\jenkins\jenkins-slave\workspace\n-box_maven-enforcer_master-KHI64AG3D4VZKUKLMNAYHKONI5AIQBLJ5ZKYGGSW7DAZVXCJBFHQ\windows-jdk7-m3.5.x_build\maven-enforcer-plugin\target\invoker-reports\BUILD-ban-distribution-management-multi-module-build.xml, f:\jenkins\jenkins-slave\workspace\n-box_maven-enforcer_master-KHI64AG3D4VZKUKLMNAYHKONI5AIQBLJ5ZKYGGSW7DAZVXCJBFHQ\windows-jdk7-m3.5.x_build\maven-enforcer-plugin\target\invoker-reports\BUILD-ban-distribution-management-multi-module-except-site.xml, f:\jenkins\jenkins-slave\workspace\n-box_maven-enforcer_master-KHI64AG3D4VZKUKLMNAYHKONI5AIQBLJ5ZKYGGSW7DAZVXCJBFHQ\windows-jdk7-m3.5.x_build\maven-enforcer-plugin\target\invoker-reports\BUILD-ban-distribution-management.xml, f:\jenkins\jenkins-slave\workspace\n-box_maven-enforcer_master-KHI64AG3D4VZKUKLMNAYHKONI5AIQBLJ5ZKYGGSW7DAZVXCJBFHQ\windows-jdk7-m3.5.x_build\maven-enforcer-plugin\target\invoker-reports\BUILD-ban-pom-dependency-version.xml, f:\jenkins\jenkins-slave\workspace\n-box_maven-enforcer_master-KHI64AG3D4VZKUKLMNAYHKONI5AIQBLJ5ZKYGGSW7DAZVXCJBFHQ\windows-jdk7-m3.5.x_build\maven-enforcer-plugin\target\invoker-reports\BUILD-ban-transitive-dependencies-fail.xml, f:\jenkins\jenkins-slave\workspace\n-box_maven-enforcer_master-KHI64AG3D4VZKUKLMNAYHKONI5AIQBLJ5ZKYGGSW7DAZVXCJBFHQ\windows-jdk7-m3.5.x_build\maven-enforcer-plugin\target\invoker-reports\BUILD-ban-transitive-dependencies.xml, f:\jenkins\jenkins-slave\workspace\n-box_maven-enforcer_master-KHI64AG3D4VZKUKLMNAYHKONI5AIQBLJ5ZKYGGSW7DAZVXCJBFHQ\windows-jdk7-m3.5.x_build\maven-enforcer-plugin\target\invoker-reports\BUILD-banned-dependencies-versionrange-fail.xml, f:\jenkins\jenkins-slave\workspace\n-box_maven-enforcer_master-KHI64AG3D4VZKUKLMNAYHKONI5AIQBLJ5ZKYGGSW7DAZVXCJBFHQ\windows-jdk7-m3.5.x_build\maven-enforcer-plugin\target\invoker-reports\BUILD-banned-dependencies-versionrange.xml, f:\jenkins\jenkins-slave\workspace\n-box_maven-enforcer_master-KHI64AG3D4VZKUKLMNAYHKONI5AIQBLJ5ZKYGGSW7DAZVXCJBFHQ\windows-jdk7-m3.5.x_build\maven-enforcer-plugin\target\invoker-reports\BUILD-banned-dependencies-wildcards.xml, f:\jenkins\jenkins-slave\workspace\n-box_maven-enforcer_master-KHI64AG3D4VZKUKLMNAYHKONI5AIQBLJ5ZKYGGSW7DAZVXCJBFHQ\windows-jdk7-m3.5.x_build\maven-enforcer-plugin\target\invoker-reports\BUILD-banned-dependencies.xml, f:\jenkins\jenkins-slave\workspace\n-box_maven-enforcer_master-KHI64AG3D4VZKUKLMNAYHKONI5AIQBLJ5ZKYGGSW7DAZVXCJBFHQ\windows-jdk7-m3.5.x_build\maven-enforcer-plugin\target\invoker-reports\BUILD-banned-plugins.xml, f:\jenkins\jenkins-slave\workspace\n-box_maven-enforcer_master-KHI64AG3D4VZKUKLMNAYHKONI5AIQBLJ5ZKYGGSW7DAZVXCJBFHQ\windows-jdk7-m3.5.x_build\maven-enforcer-plugin\target\invoker-reports\BUILD-builds_a_pom_noop.xml, f:\jenkins\jenkins-slave\workspace\n-box_maven-enforcer_master-KHI64AG3D4VZKUKLMNAYHKONI5AIQBLJ5ZKYGGSW7DAZVXCJBFHQ\windows-jdk7-m3.5.x_build\maven-enforcer-plugin\target\invoker-reports\BUILD-cli-always-fail.xml, f:\jenkins\jenkins-slave\workspace\n-box_maven-enforcer_master-KHI64AG3D4VZKUKLMNAYHKONI5AIQBLJ5ZKYGGSW7DAZVXCJBFHQ\windows-jdk7-m3.5.x_build\maven-enforcer-plugin\target\invoker-reports\BUILD-cli-always-pass.xml, f:\jenkins\jenkins-slave\workspace\n-box_maven-enforcer_master-KHI64AG3D4VZKUKLMNAYHKONI5AIQBLJ5ZKYGGSW7DAZVXCJBFHQ\windows-jdk7-m3.5.x_build\maven-enforcer-plugin\target\invoker-reports\BUILD-dependencies_converge.xml, f:\jenkins\jenkins-slave\workspace\n-box_maven-enforcer_master-KHI64AG3D4VZKUKLMNAYHKONI5AIQBLJ5ZKYGGSW7DAZVXCJBFHQ\windows-jdk7-m3.5.x_build\maven-enforcer-plugin\target\invoker-reports\BUILD-dependencies_not_converging.xml, f:\jenkins\jenkins-slave\workspace\n-box_maven-enforcer_master-KHI64AG3D4VZKUKLMNAYHKONI5AIQBLJ5ZKYGGSW7DAZVXCJBFHQ\windows-jdk7-m3.5.x_build\maven-enforcer-plugin\target\invoker-reports\BUILD-dependencies_not_converging_test_scope.xml, f:\jenkins\jenkins-slave\workspace\n-box_maven-enforcer_master-KHI64AG3D4VZKUKLMNAYHKONI5AIQBLJ5ZKYGGSW7DAZVXCJBFHQ\windows-jdk7-m3.5.x_build\maven-enforcer-plugin\target\invoker-reports\BUILD-display-info.xml, f:\jenkins\jenkins-slave\workspace\n-box_maven-enforcer_master-KHI64AG3D4VZKUKLMNAYHKONI5AIQBLJ5ZKYGGSW7DAZVXCJBFHQ\windows-jdk7-m3.5.x_build\maven-enforcer-plugin\target\invoker-reports\BUILD-evaluate-beanshell.xml, f:\jenkins\jenkins-slave\workspace\n-box_maven-enforcer_master-KHI64AG3D4VZKUKLMNAYHKONI5AIQBLJ5ZKYGGSW7DAZVXCJBFHQ\windows-jdk7-m3.5.x_build\maven-enforcer-plugin\target\invoker-reports\BUILD-multimodule.xml, f:\jenkins\jenkins-slave\workspace\n-box_maven-enforcer_master-KHI64AG3D4VZKUKLMNAYHKONI5AIQBLJ5ZKYGGSW7DAZVXCJBFHQ\windows-jdk7-m3.5.x_build\maven-enforcer-plugin\target\invoker-reports\BUILD-require-active-profile-all.xml, f:\jenkins\jenkins-slave\workspace\n-box_maven-enforcer_master-KHI64AG3D4VZKUKLMNAYHKONI5AIQBLJ5ZKYGGSW7DAZVXCJBFHQ\windows-jdk7-m3.5.x_build\maven-enforcer-plugin\target\invoker-reports\BUILD-require-active-profile-from-settings.xml, f:\jenkins\jenkins-slave\workspace\n-box_maven-enforcer_master-KHI64AG3D4VZKUKLMNAYHKONI5AIQBLJ5ZKYGGSW7DAZVXCJBFHQ\windows-jdk7-m3.5.x_build\maven-enforcer-plugin\target\invoker-reports\BUILD-require-active-profile.xml, f:\jenkins\jenkins-slave\workspace\n-box_maven-enforcer_master-KHI64AG3D4VZKUKLMNAYHKONI5AIQBLJ5ZKYGGSW7DAZVXCJBFHQ\windows-jdk7-m3.5.x_build\maven-enforcer-plugin\target\invoker-reports\BUILD-require-file-checksum.xml, f:\jenkins\jenkins-slave\workspace\n-box_maven-enforcer_master-KHI64AG3D4VZKUKLMNAYHKONI5AIQBLJ5ZKYGGSW7DAZVXCJBFHQ\windows-jdk7-m3.5.x_build\maven-enforcer-plugin\target\invoker-reports\BUILD-require-files-dont-exist.xml, f:\jenkins\jenkins-slave\workspace\n-box_maven-enforcer_master-KHI64AG3D4VZKUKLMNAYHKONI5AIQBLJ5ZKYGGSW7DAZVXCJBFHQ\windows-jdk7-m3.5.x_build\maven-enforcer-plugin\target\invoker-reports\BUILD-require-files-exist.xml, f:\jenkins\jenkins-slave\workspace\n-box_maven-enforcer_master-KHI64AG3D4VZKUKLMNAYHKONI5AIQBLJ5ZKYGGSW7DAZVXCJBFHQ\windows-jdk7-m3.5.x_build\maven-enforcer-plugin\target\invoker-reports\BUILD-require-files-size.xml, f:\jenkins\jenkins-slave\workspace\n-box_maven-enforcer_master-KHI64AG3D4VZKUKLMNAYHKONI5AIQBLJ5ZKYGGSW7DAZVXCJBFHQ\windows-jdk7-m3.5.x_build\maven-enforcer-plugin\target\invoker-reports\BUILD-require-java-version.xml, f:\jenkins\jenkins-slave\workspace\n-box_maven-enforcer_master-KHI64AG3D4VZKUKLMNAYHKONI5AIQBLJ5ZKYGGSW7DAZVXCJBFHQ\windows-jdk7-m3.5.x_build\maven-enforcer-plugin\target\invoker-reports\BUILD-require-maven-version.xml, f:\jenkins\jenkins-slave\workspace\n-box_maven-enforcer_master-KHI64AG3D4VZKUKLMNAYHKONI5AIQBLJ5ZKYGGSW7DAZVXCJBFHQ\windows-jdk7-m3.5.x_build\maven-enforcer-plugin\target\invoker-reports\BUILD-require-no-repositories-allow-plugin-repo.xml, f:\jenkins\jenkins-slave\workspace\n-box_maven-enforcer_master-KHI64AG3D4VZKUKLMNAYHKONI5AIQBLJ5ZKYGGSW7DAZVXCJBFHQ\windows-jdk7-m3.5.x_build\maven-enforcer-plugin\target\invoker-reports\BUILD-require-no-repositories-allow-repo.xml, f:\jenkins\jenkins-slave\workspace\n-box_maven-enforcer_master-KHI64AG3D4VZKUKLMNAYHKONI5AIQBLJ5ZKYGGSW7DAZVXCJBFHQ\windows-jdk7-m3.5.x_build\maven-enforcer-plugin\target\invoker-reports\BUILD-require-no-repositories.xml, f:\jenkins\jenkins-slave\workspace\n-box_maven-enforcer_master-KHI64AG3D4VZKUKLMNAYHKONI5AIQBLJ5ZKYGGSW7DAZVXCJBFHQ\windows-jdk7-m3.5.x_build\maven-enforcer-plugin\target\invoker-reports\BUILD-require-no-repositories_failure.xml, f:\jenkins\jenkins-slave\workspace\n-box_maven-enforcer_master-KHI64AG3D4VZKUKLMNAYHKONI5AIQBLJ5ZKYGGSW7DAZVXCJBFHQ\windows-jdk7-m3.5.x_build\maven-enforcer-plugin\target\invoker-reports\BUILD-require-no-repositories_failure_allowed-plugin-repo.xml, f:\jenkins\jenkins-slave\workspace\n-box_maven-enforcer_master-KHI64AG3D4VZKUKLMNAYHKONI5AIQBLJ5ZKYGGSW7DAZVXCJBFHQ\windows-jdk7-m3.5.x_build\maven-enforcer-plugin\target\invoker-reports\BUILD-require-no-repositories_failure_plugin-repositories.xml, f:\jenkins\jenkins-slave\workspace\n-box_maven-enforcer_master-KHI64AG3D4VZKUKLMNAYHKONI5AIQBLJ5ZKYGGSW7DAZVXCJBFHQ\windows-jdk7-m3.5.x_build\maven-enforcer-plugin\target\invoker-reports\BUILD-require-no-repositories_failure_repositories.xml, f:\jenkins\jenkins-slave\workspace\n-box_maven-enforcer_master-KHI64AG3D4VZKUKLMNAYHKONI5AIQBLJ5ZKYGGSW7DAZVXCJBFHQ\windows-jdk7-m3.5.x_build\maven-enforcer-plugin\target\invoker-reports\BUILD-require-no-repositories_mm.xml, f:\jenkins\jenkins-slave\workspace\n-box_maven-enforcer_master-KHI64AG3D4VZKUKLMNAYHKONI5AIQBLJ5ZKYGGSW7DAZVXCJBFHQ\windows-jdk7-m3.5.x_build\maven-enforcer-plugin\target\invoker-reports\BUILD-require-no-repositories_mm_ci.xml, f:\jenkins\jenkins-slave\workspace\n-box_maven-enforcer_master-KHI64AG3D4VZKUKLMNAYHKONI5AIQBLJ5ZKYGGSW7DAZVXCJBFHQ\windows-jdk7-m3.5.x_build\maven-enforcer-plugin\target\invoker-reports\BUILD-require-plugin-versions-ci.xml, f:\jenkins\jenkins-slave\workspace\n-box_maven-enforcer_master-KHI64AG3D4VZKUKLMNAYHKONI5AIQBLJ5ZKYGGSW7DAZVXCJBFHQ\windows-jdk7-m3.5.x_build\maven-enforcer-plugin\target\invoker-reports\BUILD-require-plugin-versions-custom-packaging.xml, f:\jenkins\jenkins-slave\workspace\n-box_maven-enforcer_master-KHI64AG3D4VZKUKLMNAYHKONI5AIQBLJ5ZKYGGSW7DAZVXCJBFHQ\windows-jdk7-m3.5.x_build\maven-enforcer-plugin\target\invoker-reports\BUILD-require-plugin-versions-expressions.xml, f:\jenkins\jenkins-slave\workspace\n-box_maven-enforcer_master-KHI64AG3D4VZKUKLMNAYHKONI5AIQBLJ5ZKYGGSW7DAZVXCJBFHQ\windows-jdk7-m3.5.x_build\maven-enforcer-plugin\target\invoker-reports\BUILD-require-plugin-versions-mm-ci-friendly.xml, f:\jenkins\jenkins-slave\workspace\n-box_maven-enforcer_master-KHI64AG3D4VZKUKLMNAYHKONI5AIQBLJ5ZKYGGSW7DAZVXCJBFHQ\windows-jdk7-m3.5.x_build\maven-enforcer-plugin\target\invoker-reports\BUILD-require-plugin-versions-plugin-with-extensions.xml, f:\jenkins\jenkins-slave\workspace\n-box_maven-enforcer_master-KHI64AG3D4VZKUKLMNAYHKONI5AIQBLJ5ZKYGGSW7DAZVXCJBFHQ\windows-jdk7-m3.5.x_build\maven-enforcer-plugin\target\invoker-reports\BUILD-require-plugin-versions-plugin-with-integration-test-lifecycle.xml, f:\jenkins\jenkins-slave\workspace\n-box_maven-enforcer_master-KHI64AG3D4VZKUKLMNAYHKONI5AIQBLJ5ZKYGGSW7DAZVXCJBFHQ\windows-jdk7-m3.5.x_build\maven-enforcer-plugin\target\invoker-reports\BUILD-require-plugin-versions-projectGAVexpressions.xml, f:\jenkins\jenkins-slave\workspace\n-box_maven-enforcer_master-KHI64AG3D4VZKUKLMNAYHKONI5AIQBLJ5ZKYGGSW7DAZVXCJBFHQ\windows-jdk7-m3.5.x_build\maven-enforcer-plugin\target\invoker-reports\BUILD-require-plugin-versions.xml, f:\jenkins\jenkins-slave\workspace\n-box_maven-enforcer_master-KHI64AG3D4VZKUKLMNAYHKONI5AIQBLJ5ZKYGGSW7DAZVXCJBFHQ\windows-jdk7-m3.5.x_build\maven-enforcer-plugin\target\invoker-reports\BUILD-require-profile-ids-exist_failure.xml, f:\jenkins\jenkins-slave\workspace\n-box_maven-enforcer_master-KHI64AG3D4VZKUKLMNAYHKONI5AIQBLJ5ZKYGGSW7DAZVXCJBFHQ\windows-jdk7-m3.5.x_build\maven-enforcer-plugin\target\invoker-reports\BUILD-require-profile-ids-exist_success.xml, f:\jenkins\jenkins-slave\workspace\n-box_maven-enforcer_master-KHI64AG3D4VZKUKLMNAYHKONI5AIQBLJ5ZKYGGSW7DAZVXCJBFHQ\windows-jdk7-m3.5.x_build\maven-enforcer-plugin\target\invoker-reports\BUILD-require-property.xml, f:\jenkins\jenkins-slave\workspace\n-box_maven-enforcer_master-KHI64AG3D4VZKUKLMNAYHKONI5AIQBLJ5ZKYGGSW7DAZVXCJBFHQ\windows-jdk7-m3.5.x_build\maven-enforcer-plugin\target\invoker-reports\BUILD-require-release-dependencies-excludes.xml, f:\jenkins\jenkins-slave\workspace\n-box_maven-enforcer_master-KHI64AG3D4VZKUKLMNAYHKONI5AIQBLJ5ZKYGGSW7DAZVXCJBFHQ\windows-jdk7-m3.5.x_build\maven-enforcer-plugin\target\invoker-reports\BUILD-require-release-dependencies-excludes_failure.xml, f:\jenkins\jenkins-slave\workspace\n-box_maven-enforcer_master-KHI64AG3D4VZKUKLMNAYHKONI5AIQBLJ5ZKYGGSW7DAZVXCJBFHQ\windows-jdk7-m3.5.x_build\maven-enforcer-plugin\target\invoker-reports\BUILD-require-release-dependencies.xml, f:\jenkins\jenkins-slave\workspace\n-box_maven-enforcer_master-KHI64AG3D4VZKUKLMNAYHKONI5AIQBLJ5ZKYGGSW7DAZVXCJBFHQ\windows-jdk7-m3.5.x_build\maven-enforcer-plugin\target\invoker-reports\BUILD-require-release-version.xml, f:\jenkins\jenkins-slave\workspace\n-box_maven-enforcer_master-KHI64AG3D4VZKUKLMNAYHKONI5AIQBLJ5ZKYGGSW7DAZVXCJBFHQ\windows-jdk7-m3.5.x_build\maven-enforcer-plugin\target\invoker-reports\BUILD-require-same-versions_failure.xml, f:\jenkins\jenkins-slave\workspace\n-box_maven-enforcer_master-KHI64AG3D4VZKUKLMNAYHKONI5AIQBLJ5ZKYGGSW7DAZVXCJBFHQ\windows-jdk7-m3.5.x_build\maven-enforcer-plugin\target\invoker-reports\BUILD-require-same-versions_success.xml, f:\jenkins\jenkins-slave\workspace\n-box_maven-enforcer_master-KHI64AG3D4VZKUKLMNAYHKONI5AIQBLJ5ZKYGGSW7DAZVXCJBFHQ\windows-jdk7-m3.5.x_build\maven-enforcer-plugin\target\invoker-reports\BUILD-require-snapshot-version_failure.xml, f:\jenkins\jenkins-slave\workspace\n-box_maven-enforcer_master-KHI64AG3D4VZKUKLMNAYHKONI5AIQBLJ5ZKYGGSW7DAZVXCJBFHQ\windows-jdk7-m3.5.x_build\maven-enforcer-plugin\target\invoker-reports\BUILD-require-snapshot-version_success.xml, f:\jenkins\jenkins-slave\workspace\n-box_maven-enforcer_master-KHI64AG3D4VZKUKLMNAYHKONI5AIQBLJ5ZKYGGSW7DAZVXCJBFHQ\windows-jdk7-m3.5.x_build\maven-enforcer-plugin\target\invoker-reports\BUILD-require-upper-bound-dependencies-managed_failure.xml, f:\jenkins\jenkins-slave\workspace\n-box_maven-enforcer_master-KHI64AG3D4VZKUKLMNAYHKONI5AIQBLJ5ZKYGGSW7DAZVXCJBFHQ\windows-jdk7-m3.5.x_build\maven-enforcer-plugin\target\invoker-reports\BUILD-require-upper-bound-dependencies-managed_success.xml, f:\jenkins\jenkins-slave\workspace\n-box_maven-enforcer_master-KHI64AG3D4VZKUKLMNAYHKONI5AIQBLJ5ZKYGGSW7DAZVXCJBFHQ\windows-jdk7-m3.5.x_build\maven-enforcer-plugin\target\invoker-reports\BUILD-require-upper-bound-dependencies-unique_failure.xml, f:\jenkins\jenkins-slave\workspace\n-box_maven-enforcer_master-KHI64AG3D4VZKUKLMNAYHKONI5AIQBLJ5ZKYGGSW7DAZVXCJBFHQ\windows-jdk7-m3.5.x_build\maven-enforcer-plugin\target\invoker-reports\BUILD-require-upper-bound-dependencies-unique_success.xml, f:\jenkins\jenkins-slave\workspace\n-box_maven-enforcer_master-KHI64AG3D4VZKUKLMNAYHKONI5AIQBLJ5ZKYGGSW7DAZVXCJBFHQ\windows-jdk7-m3.5.x_build\maven-enforcer-plugin\target\invoker-reports\BUILD-require-upper-bound-deps_failure.xml, f:\jenkins\jenkins-slave\workspace\n-box_maven-enforcer_master-KHI64AG3D4VZKUKLMNAYHKONI5AIQBLJ5ZKYGGSW7DAZVXCJBFHQ\windows-jdk7-m3.5.x_build\maven-enforcer-plugin\target\invoker-reports\BUILD-require-upper-bound-deps_ignored.xml, f:\jenkins\jenkins-slave\workspace\n-box_maven-enforcer_master-KHI64AG3D4VZKUKLMNAYHKONI5AIQBLJ5ZKYGGSW7DAZVXCJBFHQ\windows-jdk7-m3.5.x_build\maven-enforcer-plugin\target\invoker-reports\BUILD-require-upper-bound-deps_success.xml, f:\jenkins\jenkins-slave\workspace\n-box_maven-enforcer_master-KHI64AG3D4VZKUKLMNAYHKONI5AIQBLJ5ZKYGGSW7DAZVXCJBFHQ\windows-jdk7-m3.5.x_build\maven-enforcer-plugin\target\invoker-reports\BUILD-resolve_collect_dependencies.xml]
[windows-jdk7-m3.5.x_build] Found logs:[f:\jenkins\jenkins-slave\workspace\n-box_maven-enforcer_master-KHI64AG3D4VZKUKLMNAYHKONI5AIQBLJ5ZKYGGSW7DAZVXCJBFHQ\windows-jdk7-m3.5.x_build\maven-enforcer-plugin\target\it\always-fail-warn\build.log, f:\jenkins\jenkins-slave\workspace\n-box_maven-enforcer_master-KHI64AG3D4VZKUKLMNAYHKONI5AIQBLJ5ZKYGGSW7DAZVXCJBFHQ\windows-jdk7-m3.5.x_build\maven-enforcer-plugin\target\it\always-fail\build.log, f:\jenkins\jenkins-slave\workspace\n-box_maven-enforcer_master-KHI64AG3D4VZKUKLMNAYHKONI5AIQBLJ5ZKYGGSW7DAZVXCJBFHQ\windows-jdk7-m3.5.x_build\maven-enforcer-plugin\target\it\always-pass\build.log, f:\jenkins\jenkins-slave\workspace\n-box_maven-enforcer_master-KHI64AG3D4VZKUKLMNAYHKONI5AIQBLJ5ZKYGGSW7DAZVXCJBFHQ\windows-jdk7-m3.5.x_build\maven-enforcer-plugin\target\it\ban-distribution-management-multi-module-build\build.log, f:\jenkins\jenkins-slave\workspace\n-box_maven-enforcer_master-KHI64AG3D4VZKUKLMNAYHKONI5AIQBLJ5ZKYGGSW7DAZVXCJBFHQ\windows-jdk7-m3.5.x_build\maven-enforcer-plugin\target\it\ban-distribution-management-multi-module-except-site\build.log, f:\jenkins\jenkins-slave\workspace\n-box_maven-enforcer_master-KHI64AG3D4VZKUKLMNAYHKONI5AIQBLJ5ZKYGGSW7DAZVXCJBFHQ\windows-jdk7-m3.5.x_build\maven-enforcer-plugin\target\it\ban-distribution-management\build.log, f:\jenkins\jenkins-slave\workspace\n-box_maven-enforcer_master-KHI64AG3D4VZKUKLMNAYHKONI5AIQBLJ5ZKYGGSW7DAZVXCJBFHQ\windows-jdk7-m3.5.x_build\maven-enforcer-plugin\target\it\ban-pom-dependency-version\build.log, f:\jenkins\jenkins-slave\workspace\n-box_maven-enforcer_master-KHI64AG3D4VZKUKLMNAYHKONI5AIQBLJ5ZKYGGSW7DAZVXCJBFHQ\windows-jdk7-m3.5.x_build\maven-enforcer-plugin\target\it\ban-transitive-dependencies-fail\build.log, f:\jenkins\jenkins-slave\workspace\n-box_maven-enforcer_master-KHI64AG3D4VZKUKLMNAYHKONI5AIQBLJ5ZKYGGSW7DAZVXCJBFHQ\windows-jdk7-m3.5.x_build\maven-enforcer-plugin\target\it\ban-transitive-dependencies\build.log, f:\jenkins\jenkins-slave\workspace\n-box_maven-enforcer_master-KHI64AG3D4VZKUKLMNAYHKONI5AIQBLJ5ZKYGGSW7DAZVXCJBFHQ\windows-jdk7-m3.5.x_build\maven-enforcer-plugin\target\it\banned-dependencies-versionrange-fail\build.log, f:\jenkins\jenkins-slave\workspace\n-box_maven-enforcer_master-KHI64AG3D4VZKUKLMNAYHKONI5AIQBLJ5ZKYGGSW7DAZVXCJBFHQ\windows-jdk7-m3.5.x_build\maven-enforcer-plugin\target\it\banned-dependencies-versionrange\build.log, f:\jenkins\jenkins-slave\workspace\n-box_maven-enforcer_master-KHI64AG3D4VZKUKLMNAYHKONI5AIQBLJ5ZKYGGSW7DAZVXCJBFHQ\windows-jdk7-m3.5.x_build\maven-enforcer-plugin\target\it\banned-dependencies-wildcards\build.log, f:\jenkins\jenkins-slave\workspace\n-box_maven-enforcer_master-KHI64AG3D4VZKUKLMNAYHKONI5AIQBLJ5ZKYGGSW7DAZVXCJBFHQ\windows-jdk7-m3.5.x_build\maven-enforcer-plugin\target\it\banned-dependencies\build.log, f:\jenkins\jenkins-slave\workspace\n-box_maven-enforcer_master-KHI64AG3D4VZKUKLMNAYHKONI5AIQBLJ5ZKYGGSW7DAZVXCJBFHQ\windows-jdk7-m3.5.x_build\maven-enforcer-plugin\target\it\banned-plugins\build.log, f:\jenkins\jenkins-slave\workspace\n-box_maven-enforcer_master-KHI64AG3D4VZKUKLMNAYHKONI5AIQBLJ5ZKYGGSW7DAZVXCJBFHQ\windows-jdk7-m3.5.x_build\maven-enforcer-plugin\target\it\builds_a_pom_noop\build.log, f:\jenkins\jenkins-slave\workspace\n-box_maven-enforcer_master-KHI64AG3D4VZKUKLMNAYHKONI5AIQBLJ5ZKYGGSW7DAZVXCJBFHQ\windows-jdk7-m3.5.x_build\maven-enforcer-plugin\target\it\cli-always-fail\build.log, f:\jenkins\jenkins-slave\workspace\n-box_maven-enforcer_master-KHI64AG3D4VZKUKLMNAYHKONI5AIQBLJ5ZKYGGSW7DAZVXCJBFHQ\windows-jdk7-m3.5.x_build\maven-enforcer-plugin\target\it\cli-always-pass\build.log, f:\jenkins\jenkins-slave\workspace\n-box_maven-enforcer_master-KHI64AG3D4VZKUKLMNAYHKONI5AIQBLJ5ZKYGGSW7DAZVXCJBFHQ\windows-jdk7-m3.5.x_build\maven-enforcer-plugin\target\it\dependencies_converge\build.log, f:\jenkins\jenkins-slave\workspace\n-box_maven-enforcer_master-KHI64AG3D4VZKUKLMNAYHKONI5AIQBLJ5ZKYGGSW7DAZVXCJBFHQ\windows-jdk7-m3.5.x_build\maven-enforcer-plugin\target\it\dependencies_not_converging\build.log, f:\jenkins\jenkins-slave\workspace\n-box_maven-enforcer_master-KHI64AG3D4VZKUKLMNAYHKONI5AIQBLJ5ZKYGGSW7DAZVXCJBFHQ\windows-jdk7-m3.5.x_build\maven-enforcer-plugin\target\it\dependencies_not_converging_test_scope\build.log, f:\jenkins\jenkins-slave\workspace\n-box_maven-enforcer_master-KHI64AG3D4VZKUKLMNAYHKONI5AIQBLJ5ZKYGGSW7DAZVXCJBFHQ\windows-jdk7-m3.5.x_build\maven-enforcer-plugin\target\it\display-info\build.log, f:\jenkins\jenkins-slave\workspace\n-box_maven-enforcer_master-KHI64AG3D4VZKUKLMNAYHKONI5AIQBLJ5ZKYGGSW7DAZVXCJBFHQ\windows-jdk7-m3.5.x_build\maven-enforcer-plugin\target\it\evaluate-beanshell\build.log, f:\jenkins\jenkins-slave\workspace\n-box_maven-enforcer_master-KHI64AG3D4VZKUKLMNAYHKONI5AIQBLJ5ZKYGGSW7DAZVXCJBFHQ\windows-jdk7-m3.5.x_build\maven-enforcer-plugin\target\it\multimodule\build.log, f:\jenkins\jenkins-slave\workspace\n-box_maven-enforcer_master-KHI64AG3D4VZKUKLMNAYHKONI5AIQBLJ5ZKYGGSW7DAZVXCJBFHQ\windows-jdk7-m3.5.x_build\maven-enforcer-plugin\target\it\require-active-profile-all\build.log, f:\jenkins\jenkins-slave\workspace\n-box_maven-enforcer_master-KHI64AG3D4VZKUKLMNAYHKONI5AIQBLJ5ZKYGGSW7DAZVXCJBFHQ\windows-jdk7-m3.5.x_build\maven-enforcer-plugin\target\it\require-active-profile-from-settings\build.log, f:\jenkins\jenkins-slave\workspace\n-box_maven-enforcer_master-KHI64AG3D4VZKUKLMNAYHKONI5AIQBLJ5ZKYGGSW7DAZVXCJBFHQ\windows-jdk7-m3.5.x_build\maven-enforcer-plugin\target\it\require-active-profile\build.log, f:\jenkins\jenkins-slave\workspace\n-box_maven-enforcer_master-KHI64AG3D4VZKUKLMNAYHKONI5AIQBLJ5ZKYGGSW7DAZVXCJBFHQ\windows-jdk7-m3.5.x_build\maven-enforcer-plugin\target\it\require-file-checksum\build.log, f:\jenkins\jenkins-slave\workspace\n-box_maven-enforcer_master-KHI64AG3D4VZKUKLMNAYHKONI5AIQBLJ5ZKYGGSW7DAZVXCJBFHQ\windows-jdk7-m3.5.x_build\maven-enforcer-plugin\target\it\require-files-dont-exist\build.log, f:\jenkins\jenkins-slave\workspace\n-box_maven-enforcer_master-KHI64AG3D4VZKUKLMNAYHKONI5AIQBLJ5ZKYGGSW7DAZVXCJBFHQ\windows-jdk7-m3.5.x_build\maven-enforcer-plugin\target\it\require-files-exist\build.log, f:\jenkins\jenkins-slave\workspace\n-box_maven-enforcer_master-KHI64AG3D4VZKUKLMNAYHKONI5AIQBLJ5ZKYGGSW7DAZVXCJBFHQ\windows-jdk7-m3.5.x_build\maven-enforcer-plugin\target\it\require-files-size\build.log, f:\jenkins\jenkins-slave\workspace\n-box_maven-enforcer_master-KHI64AG3D4VZKUKLMNAYHKONI5AIQBLJ5ZKYGGSW7DAZVXCJBFHQ\windows-jdk7-m3.5.x_build\maven-enforcer-plugin\target\it\require-java-version\build.log, f:\jenkins\jenkins-slave\workspace\n-box_maven-enforcer_master-KHI64AG3D4VZKUKLMNAYHKONI5AIQBLJ5ZKYGGSW7DAZVXCJBFHQ\windows-jdk7-m3.5.x_build\maven-enforcer-plugin\target\it\require-maven-version\build.log, f:\jenkins\jenkins-slave\workspace\n-box_maven-enforcer_master-KHI64AG3D4VZKUKLMNAYHKONI5AIQBLJ5ZKYGGSW7DAZVXCJBFHQ\windows-jdk7-m3.5.x_build\maven-enforcer-plugin\target\it\require-no-repositories-allow-plugin-repo\build.log, f:\jenkins\jenkins-slave\workspace\n-box_maven-enforcer_master-KHI64AG3D4VZKUKLMNAYHKONI5AIQBLJ5ZKYGGSW7DAZVXCJBFHQ\windows-jdk7-m3.5.x_build\maven-enforcer-plugin\target\it\require-no-repositories-allow-repo\build.log, f:\jenkins\jenkins-slave\workspace\n-box_maven-enforcer_master-KHI64AG3D4VZKUKLMNAYHKONI5AIQBLJ5ZKYGGSW7DAZVXCJBFHQ\windows-jdk7-m3.5.x_build\maven-enforcer-plugin\target\it\require-no-repositories\build.log, f:\jenkins\jenkins-slave\workspace\n-box_maven-enforcer_master-KHI64AG3D4VZKUKLMNAYHKONI5AIQBLJ5ZKYGGSW7DAZVXCJBFHQ\windows-jdk7-m3.5.x_build\maven-enforcer-plugin\target\it\require-no-repositories_failure\build.log, f:\jenkins\jenkins-slave\workspace\n-box_maven-enforcer_master-KHI64AG3D4VZKUKLMNAYHKONI5AIQBLJ5ZKYGGSW7DAZVXCJBFHQ\windows-jdk7-m3.5.x_build\maven-enforcer-plugin\target\it\require-no-repositories_failure_allowed-plugin-repo\build.log, f:\jenkins\jenkins-slave\workspace\n-box_maven-enforcer_master-KHI64AG3D4VZKUKLMNAYHKONI5AIQBLJ5ZKYGGSW7DAZVXCJBFHQ\windows-jdk7-m3.5.x_build\maven-enforcer-plugin\target\it\require-no-repositories_failure_plugin-repositories\build.log, f:\jenkins\jenkins-slave\workspace\n-box_maven-enforcer_master-KHI64AG3D4VZKUKLMNAYHKONI5AIQBLJ5ZKYGGSW7DAZVXCJBFHQ\windows-jdk7-m3.5.x_build\maven-enforcer-plugin\target\it\require-no-repositories_failure_repositories\build.log, f:\jenkins\jenkins-slave\workspace\n-box_maven-enforcer_master-KHI64AG3D4VZKUKLMNAYHKONI5AIQBLJ5ZKYGGSW7DAZVXCJBFHQ\windows-jdk7-m3.5.x_build\maven-enforcer-plugin\target\it\require-no-repositories_mm\build.log, f:\jenkins\jenkins-slave\workspace\n-box_maven-enforcer_master-KHI64AG3D4VZKUKLMNAYHKONI5AIQBLJ5ZKYGGSW7DAZVXCJBFHQ\windows-jdk7-m3.5.x_build\maven-enforcer-plugin\target\it\require-no-repositories_mm_ci\build.log, f:\jenkins\jenkins-slave\workspace\n-box_maven-enforcer_master-KHI64AG3D4VZKUKLMNAYHKONI5AIQBLJ5ZKYGGSW7DAZVXCJBFHQ\windows-jdk7-m3.5.x_build\maven-enforcer-plugin\target\it\require-plugin-versions-ci\build.log, f:\jenkins\jenkins-slave\workspace\n-box_maven-enforcer_master-KHI64AG3D4VZKUKLMNAYHKONI5AIQBLJ5ZKYGGSW7DAZVXCJBFHQ\windows-jdk7-m3.5.x_build\maven-enforcer-plugin\target\it\require-plugin-versions-custom-packaging\build.log, f:\jenkins\jenkins-slave\workspace\n-box_maven-enforcer_master-KHI64AG3D4VZKUKLMNAYHKONI5AIQBLJ5ZKYGGSW7DAZVXCJBFHQ\windows-jdk7-m3.5.x_build\maven-enforcer-plugin\target\it\require-plugin-versions-expressions\build.log, f:\jenkins\jenkins-slave\workspace\n-box_maven-enforcer_master-KHI64AG3D4VZKUKLMNAYHKONI5AIQBLJ5ZKYGGSW7DAZVXCJBFHQ\windows-jdk7-m3.5.x_build\maven-enforcer-plugin\target\it\require-plugin-versions-mm-ci-friendly\build.log, f:\jenkins\jenkins-slave\workspace\n-box_maven-enforcer_master-KHI64AG3D4VZKUKLMNAYHKONI5AIQBLJ5ZKYGGSW7DAZVXCJBFHQ\windows-jdk7-m3.5.x_build\maven-enforcer-plugin\target\it\require-plugin-versions-plugin-with-extensions\build.log, f:\jenkins\jenkins-slave\workspace\n-box_maven-enforcer_master-KHI64AG3D4VZKUKLMNAYHKONI5AIQBLJ5ZKYGGSW7DAZVXCJBFHQ\windows-jdk7-m3.5.x_build\maven-enforcer-plugin\target\it\require-plugin-versions-plugin-with-integration-test-lifecycle\build.log, f:\jenkins\jenkins-slave\workspace\n-box_maven-enforcer_master-KHI64AG3D4VZKUKLMNAYHKONI5AIQBLJ5ZKYGGSW7DAZVXCJBFHQ\windows-jdk7-m3.5.x_build\maven-enforcer-plugin\target\it\require-plugin-versions-projectGAVexpressions\build.log, f:\jenkins\jenkins-slave\workspace\n-box_maven-enforcer_master-KHI64AG3D4VZKUKLMNAYHKONI5AIQBLJ5ZKYGGSW7DAZVXCJBFHQ\windows-jdk7-m3.5.x_build\maven-enforcer-plugin\target\it\require-plugin-versions\build.log, f:\jenkins\jenkins-slave\workspace\n-box_maven-enforcer_master-KHI64AG3D4VZKUKLMNAYHKONI5AIQBLJ5ZKYGGSW7DAZVXCJBFHQ\windows-jdk7-m3.5.x_build\maven-enforcer-plugin\target\it\require-profile-ids-exist_failure\build.log, f:\jenkins\jenkins-slave\workspace\n-box_maven-enforcer_master-KHI64AG3D4VZKUKLMNAYHKONI5AIQBLJ5ZKYGGSW7DAZVXCJBFHQ\windows-jdk7-m3.5.x_build\maven-enforcer-plugin\target\it\require-profile-ids-exist_success\build.log, f:\jenkins\jenkins-slave\workspace\n-box_maven-enforcer_master-KHI64AG3D4VZKUKLMNAYHKONI5AIQBLJ5ZKYGGSW7DAZVXCJBFHQ\windows-jdk7-m3.5.x_build\maven-enforcer-plugin\target\it\require-property\build.log, f:\jenkins\jenkins-slave\workspace\n-box_maven-enforcer_master-KHI64AG3D4VZKUKLMNAYHKONI5AIQBLJ5ZKYGGSW7DAZVXCJBFHQ\windows-jdk7-m3.5.x_build\maven-enforcer-plugin\target\it\require-release-dependencies-excludes\build.log, f:\jenkins\jenkins-slave\workspace\n-box_maven-enforcer_master-KHI64AG3D4VZKUKLMNAYHKONI5AIQBLJ5ZKYGGSW7DAZVXCJBFHQ\windows-jdk7-m3.5.x_build\maven-enforcer-plugin\target\it\require-release-dependencies-excludes_failure\build.log, f:\jenkins\jenkins-slave\workspace\n-box_maven-enforcer_master-KHI64AG3D4VZKUKLMNAYHKONI5AIQBLJ5ZKYGGSW7DAZVXCJBFHQ\windows-jdk7-m3.5.x_build\maven-enforcer-plugin\target\it\require-release-dependencies\build.log, f:\jenkins\jenkins-slave\workspace\n-box_maven-enforcer_master-KHI64AG3D4VZKUKLMNAYHKONI5AIQBLJ5ZKYGGSW7DAZVXCJBFHQ\windows-jdk7-m3.5.x_build\maven-enforcer-plugin\target\it\require-release-version\build.log, f:\jenkins\jenkins-slave\workspace\n-box_maven-enforcer_master-KHI64AG3D4VZKUKLMNAYHKONI5AIQBLJ5ZKYGGSW7DAZVXCJBFHQ\windows-jdk7-m3.5.x_build\maven-enforcer-plugin\target\it\require-same-versions_failure\build.log, f:\jenkins\jenkins-slave\workspace\n-box_maven-enforcer_master-KHI64AG3D4VZKUKLMNAYHKONI5AIQBLJ5ZKYGGSW7DAZVXCJBFHQ\windows-jdk7-m3.5.x_build\maven-enforcer-plugin\target\it\require-same-versions_success\build.log, f:\jenkins\jenkins-slave\workspace\n-box_maven-enforcer_master-KHI64AG3D4VZKUKLMNAYHKONI5AIQBLJ5ZKYGGSW7DAZVXCJBFHQ\windows-jdk7-m3.5.x_build\maven-enforcer-plugin\target\it\require-snapshot-version_failure\build.log, f:\jenkins\jenkins-slave\workspace\n-box_maven-enforcer_master-KHI64AG3D4VZKUKLMNAYHKONI5AIQBLJ5ZKYGGSW7DAZVXCJBFHQ\windows-jdk7-m3.5.x_build\maven-enforcer-plugin\target\it\require-snapshot-version_success\build.log, f:\jenkins\jenkins-slave\workspace\n-box_maven-enforcer_master-KHI64AG3D4VZKUKLMNAYHKONI5AIQBLJ5ZKYGGSW7DAZVXCJBFHQ\windows-jdk7-m3.5.x_build\maven-enforcer-plugin\target\it\require-upper-bound-dependencies-managed_failure\build.log, f:\jenkins\jenkins-slave\workspace\n-box_maven-enforcer_master-KHI64AG3D4VZKUKLMNAYHKONI5AIQBLJ5ZKYGGSW7DAZVXCJBFHQ\windows-jdk7-m3.5.x_build\maven-enforcer-plugin\target\it\require-upper-bound-dependencies-managed_success\build.log, f:\jenkins\jenkins-slave\workspace\n-box_maven-enforcer_master-KHI64AG3D4VZKUKLMNAYHKONI5AIQBLJ5ZKYGGSW7DAZVXCJBFHQ\windows-jdk7-m3.5.x_build\maven-enforcer-plugin\target\it\require-upper-bound-dependencies-unique_failure\build.log, f:\jenkins\jenkins-slave\workspace\n-box_maven-enforcer_master-KHI64AG3D4VZKUKLMNAYHKONI5AIQBLJ5ZKYGGSW7DAZVXCJBFHQ\windows-jdk7-m3.5.x_build\maven-enforcer-plugin\target\it\require-upper-bound-dependencies-unique_success\build.log, f:\jenkins\jenkins-slave\workspace\n-box_maven-enforcer_master-KHI64AG3D4VZKUKLMNAYHKONI5AIQBLJ5ZKYGGSW7DAZVXCJBFHQ\windows-jdk7-m3.5.x_build\maven-enforcer-plugin\target\it\require-upper-bound-deps_failure\build.log, f:\jenkins\jenkins-slave\workspace\n-box_maven-enforcer_master-KHI64AG3D4VZKUKLMNAYHKONI5AIQBLJ5ZKYGGSW7DAZVXCJBFHQ\windows-jdk7-m3.5.x_build\maven-enforcer-plugin\target\it\require-upper-bound-deps_ignored\build.log, f:\jenkins\jenkins-slave\workspace\n-box_maven-enforcer_master-KHI64AG3D4VZKUKLMNAYHKONI5AIQBLJ5ZKYGGSW7DAZVXCJBFHQ\windows-jdk7-m3.5.x_build\maven-enforcer-plugin\target\it\require-upper-bound-deps_success\build.log, f:\jenkins\jenkins-slave\workspace\n-box_maven-enforcer_master-KHI64AG3D4VZKUKLMNAYHKONI5AIQBLJ5ZKYGGSW7DAZVXCJBFHQ\windows-jdk7-m3.5.x_build\maven-enforcer-plugin\target\it\resolve_collect_dependencies\build.log]
[windows-jdk7-m3.5.x_build] Finished parsing Maven Invoker results (found 68)
[windows-jdk7-m3.5.x_build] [withMaven] junitPublisher - Archive test results for Maven artifact org.apache.maven.enforcer:enforcer-api:3.0.0-SNAPSHOT generated by maven-surefire-plugin:test (default-test): windows-jdk7-m3.5.x_build\enforcer-api\target\surefire-reports\*.xml
[windows-jdk7-m3.5.x_build] Recording test results
[windows-jdk7-m3.5.x_build] None of the test reports contained any result
[windows-jdk7-m3.5.x_build] [withMaven] junitPublisher - Archive test results for Maven artifact org.apache.maven.enforcer:enforcer-rules:3.0.0-SNAPSHOT generated by maven-surefire-plugin:test (default-test): windows-jdk7-m3.5.x_build\enforcer-rules\target\surefire-reports\*.xml
[windows-jdk7-m3.5.x_build] Recording test results
[windows-jdk7-m3.5.x_build] [withMaven] junitPublisher - Archive test results for Maven artifact org.apache.maven.plugins:maven-enforcer-plugin:3.0.0-SNAPSHOT generated by maven-surefire-plugin:test (default-test): windows-jdk7-m3.5.x_build\maven-enforcer-plugin\target\surefire-reports\*.xml
[windows-jdk7-m3.5.x_build] Recording test results
[windows-jdk7-m3.5.x_build] [withMaven] openTasksPublisher - Scan Tasks for Maven artifact org.apache.maven.enforcer:enforcer-api:3.0.0-SNAPSHOT in source directory windows-jdk7-m3.5.x_build\enforcer-api\src\main\java
[windows-jdk7-m3.5.x_build] [withMaven] openTasksPublisher - Scan Tasks for Maven artifact org.apache.maven.enforcer:enforcer-rules:3.0.0-SNAPSHOT in source directory windows-jdk7-m3.5.x_build\enforcer-rules\src\main\java
[windows-jdk7-m3.5.x_build] [withMaven] openTasksPublisher - Scan Tasks for Maven artifact org.apache.maven.plugins:maven-enforcer-plugin:3.0.0-SNAPSHOT in source directory windows-jdk7-m3.5.x_build\maven-enforcer-plugin\src\main\java
[windows-jdk7-m3.5.x_build] [TASKS] Scanning folder 'f:\jenkins\jenkins-slave\workspace\n-box_maven-enforcer_master-KHI64AG3D4VZKUKLMNAYHKONI5AIQBLJ5ZKYGGSW7DAZVXCJBFHQ' for files matching the pattern 'windows-jdk7-m3.5.x_build\enforcer-api\src\main\java\**\*,windows-jdk7-m3.5.x_build\enforcer-rules\src\main\java\**\*,windows-jdk7-m3.5.x_build\maven-enforcer-plugin\src\main\java\**\*' - excludes: null
[windows-jdk7-m3.5.x_build] [TASKS] Found 51 files to scan for tasks
[windows-jdk7-m3.5.x_build] [TASKS] Found 5 open tasks.
[windows-jdk7-m3.5.x_build] Skipping warnings blame since pipelines do not have an SCM link.%n
[windows-jdk7-m3.5.x_build] [TASKS] Computing warning deltas based on reference build #31
[Pipeline] [windows-jdk7-m3.5.x_build] // withMaven
[Pipeline] [windows-jdk7-m3.5.x_build] cleanWs
[windows-jdk7-m3.5.x_build] [WS-CLEANUP] Deleting project workspace...[WS-CLEANUP] done
[Pipeline] [windows-jdk7-m3.5.x_build] }
[Pipeline] [windows-jdk7-m3.5.x_build] // stage
[Pipeline] [windows-jdk7-m3.5.x_build] }
[Pipeline] [windows-jdk7-m3.5.x_build] // node
[Pipeline] [windows-jdk7-m3.5.x_build] }
[Pipeline] // parallel
[Pipeline] stage
[Pipeline] { (Notifications)
[Pipeline] echo
Build result: FAILURE
[Pipeline] jiraIssueSelector
[Pipeline] emailext
Mime
  • Unnamed multipart/mixed (inline, None, 0 bytes)
View raw message