maven-notifications mailing list archives

Site index · List index
Message view « Date » · « Thread »
Top « Date » · « Thread »
From Apache Jenkins Server <jenk...@builds.apache.org>
Subject Build failed in Jenkins: Maven TLP » maven-project-info-reports-plugin » MPIR-361 #8
Date Wed, 08 Aug 2018 10:50:31 GMT
See https://builds.apache.org/job/maven-box/job/maven-project-info-reports-plugin/job/MPIR-361/8/

No changes.

All tests passed

Build log:
[...truncated 2.13 MB...]
[windows-jdk10] [INFO] Downloading: https://repo.maven.apache.org/maven2/junit/junit/4.12/junit-4.12.pom
[windows-jdk10] [INFO] Downloaded: https://repo.maven.apache.org/maven2/junit/junit/4.12/junit-4.12.pom
(24 kB at 740 kB/s)
[windows-jdk10] [INFO] Downloading: https://repo.maven.apache.org/maven2/org/codehaus/plexus/plexus-utils/3.0.21/plexus-utils-3.0.21.pom
[windows-jdk10] [INFO] Downloaded: https://repo.maven.apache.org/maven2/org/codehaus/plexus/plexus-utils/3.0.21/plexus-utils-3.0.21.pom
(3.8 kB at 254 kB/s)
[windows-jdk10] [INFO] Downloading: https://repo.maven.apache.org/maven2/org/apache/rat/apache-rat-core/0.12/apache-rat-core-0.12.jar
[windows-jdk10] [INFO] Downloading: https://repo.maven.apache.org/maven2/org/apache/rat/apache-rat-api/0.12/apache-rat-api-0.12.jar
[windows-jdk10] [INFO] Downloading: https://repo.maven.apache.org/maven2/org/apache/commons/commons-compress/1.10/commons-compress-1.10.jar
[windows-jdk10] [INFO] Downloading: https://repo.maven.apache.org/maven2/commons-io/commons-io/2.2/commons-io-2.2.jar
[windows-jdk10] [INFO] Downloading: https://repo.maven.apache.org/maven2/commons-collections/commons-collections/3.2.2/commons-collections-3.2.2.jar
[windows-jdk10] [INFO] Downloaded: https://repo.maven.apache.org/maven2/org/apache/rat/apache-rat-core/0.12/apache-rat-core-0.12.jar
(122 kB at 1.6 MB/s)
[windows-jdk10] [INFO] Downloading: https://repo.maven.apache.org/maven2/commons-logging/commons-logging/1.1.1/commons-logging-1.1.1.jar
[windows-jdk10] [INFO] Downloaded: https://repo.maven.apache.org/maven2/commons-io/commons-io/2.2/commons-io-2.2.jar
(174 kB at 1.4 MB/s)
[windows-jdk10] [INFO] Downloading: https://repo.maven.apache.org/maven2/org/codehaus/plexus/plexus-i18n/1.0-beta-7/plexus-i18n-1.0-beta-7.jar
[windows-jdk10] [INFO] Downloaded: https://repo.maven.apache.org/maven2/commons-logging/commons-logging/1.1.1/commons-logging-1.1.1.jar
(61 kB at 485 kB/s)
[windows-jdk10] [INFO] Downloading: https://repo.maven.apache.org/maven2/commons-beanutils/commons-beanutils/1.7.0/commons-beanutils-1.7.0.jar
[windows-jdk10] [INFO] Downloaded: https://repo.maven.apache.org/maven2/commons-beanutils/commons-beanutils/1.7.0/commons-beanutils-1.7.0.jar
(189 kB at 1.1 MB/s)
[windows-jdk10] [INFO] Downloading: https://repo.maven.apache.org/maven2/commons-digester/commons-digester/1.8/commons-digester-1.8.jar
[windows-jdk10] [INFO] Downloaded: https://repo.maven.apache.org/maven2/org/apache/rat/apache-rat-api/0.12/apache-rat-api-0.12.jar
(11 kB at 52 kB/s)
[windows-jdk10] [INFO] Downloading: https://repo.maven.apache.org/maven2/commons-validator/commons-validator/1.3.1/commons-validator-1.3.1.jar
[windows-jdk10] [INFO] Downloaded: https://repo.maven.apache.org/maven2/commons-digester/commons-digester/1.8/commons-digester-1.8.jar
(144 kB at 656 kB/s)
[windows-jdk10] [INFO] Downloading: https://repo.maven.apache.org/maven2/org/codehaus/plexus/plexus-utils/3.0.21/plexus-utils-3.0.21.jar
[windows-jdk10] [INFO] Downloaded: https://repo.maven.apache.org/maven2/org/codehaus/plexus/plexus-i18n/1.0-beta-7/plexus-i18n-1.0-beta-7.jar
(11 kB at 45 kB/s)
[windows-jdk10] [INFO] Downloaded: https://repo.maven.apache.org/maven2/commons-validator/commons-validator/1.3.1/commons-validator-1.3.1.jar
(139 kB at 556 kB/s)
[windows-jdk7] [WS-CLEANUP] Deleting project workspace...[WS-CLEANUP] done
[Pipeline] [windows-jdk7] }
[Pipeline] [windows-jdk7] // stage
[Pipeline] [windows-jdk7] }
[Pipeline] [windows-jdk7] // node
[Pipeline] [windows-jdk7] }
[windows-jdk7] Failed in branch windows-jdk7
[windows-jdk10] [INFO] Downloaded: https://repo.maven.apache.org/maven2/org/codehaus/plexus/plexus-utils/3.0.21/plexus-utils-3.0.21.jar
(245 kB at 924 kB/s)
[windows-jdk10] [INFO] Downloaded: https://repo.maven.apache.org/maven2/org/apache/commons/commons-compress/1.10/commons-compress-1.10.jar
(409 kB at 1.5 MB/s)
[windows-jdk10] [INFO] Downloaded: https://repo.maven.apache.org/maven2/commons-collections/commons-collections/3.2.2/commons-collections-3.2.2.jar
(588 kB at 2.0 MB/s)
[windows-jdk10] [INFO] Enabled default license matchers.
[windows-jdk10] [INFO] Will parse SCM ignores for exclusions...
[windows-jdk10] [INFO] Parsing exclusions from f:\jenkins\jenkins-slave\workspace\nfo-reports-plugin_MPIR-361-USOHCFAWZ4BXXFD3QLHLQ2HOCUSPDFM5URQGLU7AUHHJFZBJBXTQ\m\.gitignore
[windows-jdk10] [INFO] Finished adding exclusions from SCM ignore files.
[windows-jdk10] [INFO] 71 implicit excludes (use -debug for more details).
[windows-jdk10] [INFO] Exclude: src/main/resources/org/apache/maven/report/projectinfo/resources/resources.txt
[windows-jdk10] [INFO] Exclude: .repository/**
[windows-jdk10] [INFO] Exclude: .maven/spy.log
[windows-jdk10] [INFO] Exclude: dependency-reduced-pom.xml
[windows-jdk10] [INFO] Exclude: .java-version
[windows-jdk10] [INFO] 169 resources included (use -debug for more details)
[windows-jdk8] [INFO] run post-build script verify.groovy
[windows-jdk8] [INFO]           mpir-229\pom.xml ................................. SUCCESS
(7.0 s)
[windows-jdk8] [INFO] Building: MPIR-242\pom.xml
[windows-jdk10] [INFO] Rat check: Summary over all files. Unapproved: 0, unknown: 0, generated:
0, approved: 167 licenses.
[windows-jdk10] [INFO] 
[windows-jdk10] [INFO] --- keytool-maven-plugin:1.0:clean (init) @ maven-project-info-reports-plugin
---
[windows-jdk10] [INFO] Downloading: https://repo.maven.apache.org/maven2/org/apache/maven/maven-project/2.0.6/maven-project-2.0.6.pom
[windows-jdk10] [INFO] Downloaded: https://repo.maven.apache.org/maven2/org/apache/maven/maven-project/2.0.6/maven-project-2.0.6.pom
(2.6 kB at 85 kB/s)
[windows-jdk10] [INFO] Downloading: https://repo.maven.apache.org/maven2/org/apache/maven/maven/2.0.6/maven-2.0.6.pom
[windows-jdk10] [INFO] Downloaded: https://repo.maven.apache.org/maven2/org/apache/maven/maven/2.0.6/maven-2.0.6.pom
(9.0 kB at 603 kB/s)
[windows-jdk10] [INFO] Downloading: https://repo.maven.apache.org/maven2/org/apache/maven/maven-parent/5/maven-parent-5.pom
[windows-jdk10] [INFO] Downloaded: https://repo.maven.apache.org/maven2/org/apache/maven/maven-parent/5/maven-parent-5.pom
(15 kB at 492 kB/s)
[windows-jdk10] [INFO] Downloading: https://repo.maven.apache.org/maven2/org/apache/maven/maven-settings/2.0.6/maven-settings-2.0.6.pom
[windows-jdk10] [INFO] Downloaded: https://repo.maven.apache.org/maven2/org/apache/maven/maven-settings/2.0.6/maven-settings-2.0.6.pom
(2.0 kB at 133 kB/s)
[windows-jdk10] [INFO] Downloading: https://repo.maven.apache.org/maven2/org/apache/maven/maven-model/2.0.6/maven-model-2.0.6.pom
[windows-jdk10] [INFO] Downloaded: https://repo.maven.apache.org/maven2/org/apache/maven/maven-model/2.0.6/maven-model-2.0.6.pom
(3.0 kB at 190 kB/s)
[windows-jdk10] [INFO] Downloading: https://repo.maven.apache.org/maven2/org/apache/maven/maven-profile/2.0.6/maven-profile-2.0.6.pom
[windows-jdk10] [INFO] Downloaded: https://repo.maven.apache.org/maven2/org/apache/maven/maven-profile/2.0.6/maven-profile-2.0.6.pom
(2.0 kB at 64 kB/s)
[windows-jdk10] [INFO] Downloading: https://repo.maven.apache.org/maven2/org/apache/maven/maven-artifact-manager/2.0.6/maven-artifact-manager-2.0.6.pom
[windows-jdk10] [INFO] Downloaded: https://repo.maven.apache.org/maven2/org/apache/maven/maven-artifact-manager/2.0.6/maven-artifact-manager-2.0.6.pom
(2.6 kB at 82 kB/s)
[windows-jdk10] [INFO] Downloading: https://repo.maven.apache.org/maven2/org/apache/maven/maven-repository-metadata/2.0.6/maven-repository-metadata-2.0.6.pom
[windows-jdk10] [INFO] Downloaded: https://repo.maven.apache.org/maven2/org/apache/maven/maven-repository-metadata/2.0.6/maven-repository-metadata-2.0.6.pom
(1.9 kB at 58 kB/s)
[windows-jdk10] [INFO] Downloading: https://repo.maven.apache.org/maven2/org/apache/maven/maven-artifact/2.0.6/maven-artifact-2.0.6.pom
[windows-jdk10] [INFO] Downloaded: https://repo.maven.apache.org/maven2/org/apache/maven/maven-artifact/2.0.6/maven-artifact-2.0.6.pom
(1.6 kB at 99 kB/s)
[windows-jdk10] [INFO] Downloading: https://repo.maven.apache.org/maven2/org/apache/maven/maven-plugin-registry/2.0.6/maven-plugin-registry-2.0.6.pom
[windows-jdk10] [INFO] Downloaded: https://repo.maven.apache.org/maven2/org/apache/maven/maven-plugin-registry/2.0.6/maven-plugin-registry-2.0.6.pom
(1.9 kB at 25 kB/s)
[windows-jdk10] [INFO] Downloading: https://repo.maven.apache.org/maven2/org/apache/maven/maven-plugin-api/2.0.6/maven-plugin-api-2.0.6.pom
[windows-jdk10] [INFO] Downloaded: https://repo.maven.apache.org/maven2/org/apache/maven/maven-plugin-api/2.0.6/maven-plugin-api-2.0.6.pom
(1.5 kB at 58 kB/s)
[windows-jdk10] [INFO] Downloading: https://repo.maven.apache.org/maven2/org/codehaus/plexus/plexus-utils/1.4.9/plexus-utils-1.4.9.pom
[windows-jdk10] [INFO] Downloaded: https://repo.maven.apache.org/maven2/org/codehaus/plexus/plexus-utils/1.4.9/plexus-utils-1.4.9.pom
(2.3 kB at 49 kB/s)
[windows-jdk10] [INFO] Downloading: https://repo.maven.apache.org/maven2/org/apache/maven/maven-settings/2.0.6/maven-settings-2.0.6.jar
[windows-jdk10] [INFO] Downloading: https://repo.maven.apache.org/maven2/org/apache/maven/maven-project/2.0.6/maven-project-2.0.6.jar
[windows-jdk10] [INFO] Downloading: https://repo.maven.apache.org/maven2/org/apache/maven/maven-profile/2.0.6/maven-profile-2.0.6.jar
[windows-jdk10] [INFO] Downloading: https://repo.maven.apache.org/maven2/org/apache/maven/maven-artifact-manager/2.0.6/maven-artifact-manager-2.0.6.jar
[windows-jdk10] [INFO] Downloading: https://repo.maven.apache.org/maven2/org/apache/maven/maven-model/2.0.6/maven-model-2.0.6.jar
[windows-jdk10] [INFO] Downloaded: https://repo.maven.apache.org/maven2/org/apache/maven/maven-model/2.0.6/maven-model-2.0.6.jar
(86 kB at 502 kB/s)
[windows-jdk10] [INFO] Downloading: https://repo.maven.apache.org/maven2/org/apache/maven/maven-repository-metadata/2.0.6/maven-repository-metadata-2.0.6.jar
[windows-jdk10] [INFO] Downloaded: https://repo.maven.apache.org/maven2/org/apache/maven/maven-artifact-manager/2.0.6/maven-artifact-manager-2.0.6.jar
(57 kB at 362 kB/s)
[windows-jdk10] [INFO] Downloading: https://repo.maven.apache.org/maven2/org/apache/maven/maven-plugin-registry/2.0.6/maven-plugin-registry-2.0.6.jar
[windows-jdk10] [INFO] Downloaded: https://repo.maven.apache.org/maven2/org/apache/maven/maven-repository-metadata/2.0.6/maven-repository-metadata-2.0.6.jar
(24 kB at 92 kB/s)
[windows-jdk10] [INFO] Downloading: https://repo.maven.apache.org/maven2/org/apache/maven/maven-artifact/2.0.6/maven-artifact-2.0.6.jar
[windows-jdk10] [INFO] Downloaded: https://repo.maven.apache.org/maven2/org/apache/maven/maven-artifact/2.0.6/maven-artifact-2.0.6.jar
(87 kB at 280 kB/s)
[windows-jdk10] [INFO] Downloading: https://repo.maven.apache.org/maven2/org/apache/maven/maven-plugin-api/2.0.6/maven-plugin-api-2.0.6.jar
[windows-jdk10] [INFO] Downloaded: https://repo.maven.apache.org/maven2/org/apache/maven/maven-settings/2.0.6/maven-settings-2.0.6.jar
(49 kB at 116 kB/s)
[windows-jdk10] [INFO] Downloading: https://repo.maven.apache.org/maven2/org/codehaus/plexus/plexus-utils/1.4.9/plexus-utils-1.4.9.jar
[windows-jdk10] [INFO] Downloaded: https://repo.maven.apache.org/maven2/org/apache/maven/maven-project/2.0.6/maven-project-2.0.6.jar
(116 kB at 275 kB/s)
[windows-jdk10] [INFO] Downloading: https://repo.maven.apache.org/maven2/commons-lang/commons-lang/2.1/commons-lang-2.1.jar
[windows-jdk10] [INFO] Downloaded: https://repo.maven.apache.org/maven2/org/apache/maven/maven-plugin-registry/2.0.6/maven-plugin-registry-2.0.6.jar
(29 kB at 66 kB/s)
[windows-jdk10] [INFO] Downloaded: https://repo.maven.apache.org/maven2/org/codehaus/plexus/plexus-utils/1.4.9/plexus-utils-1.4.9.jar
(204 kB at 251 kB/s)
[windows-jdk10] [INFO] Downloaded: https://repo.maven.apache.org/maven2/commons-lang/commons-lang/2.1/commons-lang-2.1.jar
(208 kB at 256 kB/s)
[windows-jdk10] [INFO] Downloaded: https://repo.maven.apache.org/maven2/org/apache/maven/maven-profile/2.0.6/maven-profile-2.0.6.jar
(35 kB at 42 kB/s)
[windows-jdk10] [INFO] Downloaded: https://repo.maven.apache.org/maven2/org/apache/maven/maven-plugin-api/2.0.6/maven-plugin-api-2.0.6.jar
(13 kB at 16 kB/s)
[windows-jdk10] [WARNING] Keystore file 'f:\jenkins\jenkins-slave\workspace\nfo-reports-plugin_MPIR-361-USOHCFAWZ4BXXFD3QLHLQ2HOCUSPDFM5URQGLU7AUHHJFZBJBXTQ\m/target/jetty.jks'
doesn't exist.
[windows-jdk10] [INFO] 
[windows-jdk10] [INFO] --- keytool-maven-plugin:1.0:genkey (init) @ maven-project-info-reports-plugin
---
[windows-jdk10] [INFO] ------------------------------------------------------------------------
[windows-jdk10] [INFO] BUILD FAILURE
[windows-jdk10] [INFO] ------------------------------------------------------------------------
[windows-jdk10] [INFO] Total time: 54.235 s
[windows-jdk10] [INFO] Finished at: 2018-08-08T03:49:29-07:00
[windows-jdk10] [INFO] Final Memory: 22M/84M
[windows-jdk10] [INFO] ------------------------------------------------------------------------
[windows-jdk10] [INFO] [jenkins-event-spy] Generated F:\jenkins\jenkins-slave\workspace\nfo-reports-plugin_MPIR-361-USOHCFAWZ4BXXFD3QLHLQ2HOCUSPDFM5URQGLU7AUHHJFZBJBXTQ@tmp\withMaven89e5196d\maven-spy-20180808-034834-73617225895542063149275.log
[windows-jdk10] [ERROR] Failed to execute goal org.codehaus.mojo:keytool-maven-plugin:1.0:genkey
(init) on project maven-project-info-reports-plugin: Execution init of goal org.codehaus.mojo:keytool-maven-plugin:1.0:genkey
failed: An API incompatibility was encountered while executing org.codehaus.mojo:keytool-maven-plugin:1.0:genkey:
java.lang.ExceptionInInitializerError: null
[windows-jdk10] [ERROR] -----------------------------------------------------
[windows-jdk10] [ERROR] realm =    plugin>org.codehaus.mojo:keytool-maven-plugin:1.0
[windows-jdk10] [ERROR] strategy = org.codehaus.plexus.classworlds.strategy.SelfFirstStrategy
[windows-jdk10] [ERROR] urls[0] = file:/f:/jenkins/jenkins-slave/workspace/nfo-reports-plugin_MPIR-361-USOHCFAWZ4BXXFD3QLHLQ2HOCUSPDFM5URQGLU7AUHHJFZBJBXTQ/.repository/org/codehaus/mojo/keytool-maven-plugin/1.0/keytool-maven-plugin-1.0.jar
[windows-jdk10] [ERROR] urls[1] = file:/f:/jenkins/jenkins-slave/workspace/nfo-reports-plugin_MPIR-361-USOHCFAWZ4BXXFD3QLHLQ2HOCUSPDFM5URQGLU7AUHHJFZBJBXTQ/.repository/org/codehaus/plexus/plexus-utils/1.4.9/plexus-utils-1.4.9.jar
[windows-jdk10] [ERROR] urls[2] = file:/f:/jenkins/jenkins-slave/workspace/nfo-reports-plugin_MPIR-361-USOHCFAWZ4BXXFD3QLHLQ2HOCUSPDFM5URQGLU7AUHHJFZBJBXTQ/.repository/commons-lang/commons-lang/2.1/commons-lang-2.1.jar
[windows-jdk10] [ERROR] Number of foreign imports: 1
[windows-jdk10] [ERROR] import: Entry[import  from realm ClassRealm[maven.api, parent: null]]
[windows-jdk10] [ERROR] 
[windows-jdk10] [ERROR] -----------------------------------------------------: begin 0, end
3, length 2
[windows-jdk10] [ERROR] -> [Help 1]
[windows-jdk10] [ERROR] 
[windows-jdk10] [ERROR] To see the full stack trace of the errors, re-run Maven with the -e
switch.
[windows-jdk10] [ERROR] Re-run Maven using the -X switch to enable full debug logging.
[windows-jdk10] [ERROR] 
[windows-jdk10] [ERROR] For more information about the errors and possible solutions, please
read the following articles:
[windows-jdk10] [ERROR] [Help 1] http://cwiki.apache.org/confluence/display/MAVEN/PluginContainerException
[Pipeline] [windows-jdk10] }
[Pipeline] [windows-jdk10] // dir
[Pipeline] [windows-jdk10] }
[Pipeline] [windows-jdk10] // withMaven
[Pipeline] [windows-jdk10] cleanWs
[windows-jdk10] [WS-CLEANUP] Deleting project workspace...[WS-CLEANUP] done
[Pipeline] [windows-jdk10] cleanWs
[windows-jdk10] [WS-CLEANUP] Deleting project workspace...[WS-CLEANUP] done
[Pipeline] [windows-jdk10] }
[Pipeline] [windows-jdk10] // stage
[Pipeline] [windows-jdk10] }
[Pipeline] [windows-jdk10] // node
[Pipeline] [windows-jdk10] }
[windows-jdk10] Failed in branch windows-jdk10
[windows-jdk8] [INFO] run post-build script verify.groovy
[windows-jdk8] [INFO]           MPIR-242\pom.xml ................................. SUCCESS
(7.2 s)
[windows-jdk8] [INFO] Building: MPIR-251\pom.xml
[windows-jdk8] [INFO] run post-build script verify.groovy
[windows-jdk8] [INFO]           MPIR-251\pom.xml ................................. SUCCESS
(11.6 s)
[windows-jdk8] [INFO] Building: MPIR-300\pom.xml
[windows-jdk8] [INFO] run post-build script verify.groovy
[windows-jdk8] [INFO]           MPIR-300\pom.xml ................................. SUCCESS
(7.1 s)
[windows-jdk8] [INFO] Building: MPIR-349\parent\pom.xml
[windows-jdk8] [INFO] run post-build script verify.groovy
[windows-jdk8] [INFO]           MPIR-349\parent\pom.xml .......................... SUCCESS
(12.4 s)
[windows-jdk8] [INFO] Building: multi-module\pom.xml
[windows-jdk8] [INFO] run post-build script verify.groovy
[windows-jdk8] [INFO]           multi-module\pom.xml ............................. SUCCESS
(19.6 s)
[windows-jdk8] [INFO] 
[windows-jdk8] [INFO] --- maven-checkstyle-plugin:3.0.0:check (checkstyle-check) @ maven-project-info-reports-plugin
---
[windows-jdk8] [INFO] Downloading: https://repo.maven.apache.org/maven2/org/apache/maven/shared/maven-shared-resources/2/maven-shared-resources-2.pom
[windows-jdk8] [INFO] Downloaded: https://repo.maven.apache.org/maven2/org/apache/maven/shared/maven-shared-resources/2/maven-shared-resources-2.pom
(3.0 kB at 185 kB/s)
[windows-jdk8] [INFO] Downloading: https://repo.maven.apache.org/maven2/org/codehaus/plexus/plexus-utils/3.0.10/plexus-utils-3.0.10.pom
[windows-jdk8] [INFO] Downloaded: https://repo.maven.apache.org/maven2/org/codehaus/plexus/plexus-utils/3.0.10/plexus-utils-3.0.10.pom
(3.1 kB at 101 kB/s)
[windows-jdk8] [INFO] Downloading: https://repo.maven.apache.org/maven2/org/codehaus/plexus/plexus/3.3/plexus-3.3.pom
[windows-jdk8] [INFO] Downloaded: https://repo.maven.apache.org/maven2/org/codehaus/plexus/plexus/3.3/plexus-3.3.pom
(20 kB at 1.2 MB/s)
[windows-jdk8] [INFO] Downloading: https://repo.maven.apache.org/maven2/org/codehaus/plexus/plexus-resources/1.1.0/plexus-resources-1.1.0.pom
[windows-jdk8] [INFO] Downloaded: https://repo.maven.apache.org/maven2/org/codehaus/plexus/plexus-resources/1.1.0/plexus-resources-1.1.0.pom
(3.2 kB at 102 kB/s)
[windows-jdk8] [INFO] Downloading: https://repo.maven.apache.org/maven2/com/puppycrawl/tools/checkstyle/6.18/checkstyle-6.18.pom
[windows-jdk8] [INFO] Downloaded: https://repo.maven.apache.org/maven2/com/puppycrawl/tools/checkstyle/6.18/checkstyle-6.18.pom
(71 kB)
[windows-jdk8] [INFO] Downloading: https://repo.maven.apache.org/maven2/antlr/antlr/2.7.7/antlr-2.7.7.pom
[windows-jdk8] [INFO] Downloaded: https://repo.maven.apache.org/maven2/antlr/antlr/2.7.7/antlr-2.7.7.pom
(632 B)
[windows-jdk8] [INFO] Downloading: https://repo.maven.apache.org/maven2/org/antlr/antlr4-runtime/4.5.3/antlr4-runtime-4.5.3.pom
[windows-jdk8] [INFO] Downloaded: https://repo.maven.apache.org/maven2/org/antlr/antlr4-runtime/4.5.3/antlr4-runtime-4.5.3.pom
(2.3 kB at 62 kB/s)
[windows-jdk8] [INFO] Downloading: https://repo.maven.apache.org/maven2/org/antlr/antlr4-master/4.5.3/antlr4-master-4.5.3.pom
[windows-jdk8] [INFO] Downloaded: https://repo.maven.apache.org/maven2/org/antlr/antlr4-master/4.5.3/antlr4-master-4.5.3.pom
(3.7 kB)
[windows-jdk8] [INFO] Downloading: https://repo.maven.apache.org/maven2/commons-cli/commons-cli/1.3.1/commons-cli-1.3.1.pom
[windows-jdk8] [INFO] Downloaded: https://repo.maven.apache.org/maven2/commons-cli/commons-cli/1.3.1/commons-cli-1.3.1.pom
(10 kB at 693 kB/s)
[windows-jdk8] [INFO] Downloading: https://repo.maven.apache.org/maven2/com/google/guava/guava/19.0/guava-19.0.pom
[windows-jdk8] [INFO] Downloaded: https://repo.maven.apache.org/maven2/com/google/guava/guava/19.0/guava-19.0.pom
(6.8 kB)
[windows-jdk8] [INFO] Downloading: https://repo.maven.apache.org/maven2/com/google/guava/guava-parent/19.0/guava-parent-19.0.pom
[windows-jdk8] [INFO] Downloaded: https://repo.maven.apache.org/maven2/com/google/guava/guava-parent/19.0/guava-parent-19.0.pom
(9.9 kB)
[windows-jdk8] [INFO] Downloading: https://repo.maven.apache.org/maven2/org/sonatype/oss/oss-parent/7/oss-parent-7.pom
[windows-jdk8] [INFO] Downloaded: https://repo.maven.apache.org/maven2/org/sonatype/oss/oss-parent/7/oss-parent-7.pom
(4.8 kB)
[windows-jdk8] [INFO] Downloading: https://repo.maven.apache.org/maven2/commons-digester/commons-digester/1.6/commons-digester-1.6.jar
[windows-jdk8] [INFO] Downloading: https://repo.maven.apache.org/maven2/org/apache/maven/doxia/doxia-core/1.2/doxia-core-1.2.jar
[windows-jdk8] [INFO] Downloading: https://repo.maven.apache.org/maven2/org/codehaus/plexus/plexus-resources/1.1.0/plexus-resources-1.1.0.jar
[windows-jdk8] [INFO] Downloading: https://repo.maven.apache.org/maven2/org/apache/maven/shared/maven-shared-resources/2/maven-shared-resources-2.jar
[windows-jdk8] [INFO] Downloading: https://repo.maven.apache.org/maven2/commons-logging/commons-logging/1.0.4/commons-logging-1.0.4.jar
[windows-jdk8] [INFO] Downloaded: https://repo.maven.apache.org/maven2/commons-digester/commons-digester/1.6/commons-digester-1.6.jar
(168 kB at 2.2 MB/s)
[windows-jdk8] [INFO] Downloading: https://repo.maven.apache.org/maven2/com/puppycrawl/tools/checkstyle/6.18/checkstyle-6.18.jar
[windows-jdk8] [INFO] Downloaded: https://repo.maven.apache.org/maven2/commons-logging/commons-logging/1.0.4/commons-logging-1.0.4.jar
(38 kB at 487 kB/s)
[windows-jdk8] [INFO] Downloading: https://repo.maven.apache.org/maven2/antlr/antlr/2.7.7/antlr-2.7.7.jar
[windows-jdk8] [INFO] Downloaded: https://repo.maven.apache.org/maven2/org/codehaus/plexus/plexus-resources/1.1.0/plexus-resources-1.1.0.jar
(23 kB at 298 kB/s)
[windows-jdk8] [INFO] Downloading: https://repo.maven.apache.org/maven2/org/antlr/antlr4-runtime/4.5.3/antlr4-runtime-4.5.3.jar
[windows-jdk8] [INFO] Downloaded: https://repo.maven.apache.org/maven2/org/apache/maven/doxia/doxia-core/1.2/doxia-core-1.2.jar
(154 kB at 2.0 MB/s)
[windows-jdk8] [INFO] Downloading: https://repo.maven.apache.org/maven2/commons-cli/commons-cli/1.3.1/commons-cli-1.3.1.jar
[windows-jdk8] [INFO] Downloaded: https://repo.maven.apache.org/maven2/org/apache/maven/shared/maven-shared-resources/2/maven-shared-resources-2.jar
(13 kB at 167 kB/s)
[windows-jdk8] [INFO] Downloading: https://repo.maven.apache.org/maven2/com/google/guava/guava/19.0/guava-19.0.jar
[windows-jdk8] [INFO] Downloaded: https://repo.maven.apache.org/maven2/commons-cli/commons-cli/1.3.1/commons-cli-1.3.1.jar
(53 kB at 564 kB/s)
[windows-jdk8] [INFO] Downloaded: https://repo.maven.apache.org/maven2/antlr/antlr/2.7.7/antlr-2.7.7.jar
(445 kB at 4.0 MB/s)
[windows-jdk8] [INFO] Downloaded: https://repo.maven.apache.org/maven2/org/antlr/antlr4-runtime/4.5.3/antlr4-runtime-4.5.3.jar
(302 kB at 2.7 MB/s)
[windows-jdk8] [INFO] Downloaded: https://repo.maven.apache.org/maven2/com/puppycrawl/tools/checkstyle/6.18/checkstyle-6.18.jar
(1.2 MB at 7.4 MB/s)
[windows-jdk8] [INFO] Downloaded: https://repo.maven.apache.org/maven2/com/google/guava/guava/19.0/guava-19.0.jar
(2.3 MB at 13 MB/s)
[windows-jdk8] [INFO] There are 14 errors reported by Checkstyle 6.18 with config/maven_checks.xml
ruleset.
[windows-jdk8] [ERROR] src\main\java\org\apache\maven\report\projectinfo\AbstractProjectInfoReport.java:[456,9]
(modifier) RedundantModifier: Redundant 'public' modifier.
[windows-jdk8] [ERROR] src\main\java\org\apache\maven\report\projectinfo\dependencies\renderer\DependenciesRenderer.java:[1583,9]
(modifier) RedundantModifier: Redundant 'public' modifier.
[windows-jdk8] [ERROR] src\main\java\org\apache\maven\report\projectinfo\dependencies\SinkSerializingDependencyNodeVisitor.java:[46,9]
(modifier) RedundantModifier: Redundant 'public' modifier.
[windows-jdk8] [ERROR] src\main\java\org\apache\maven\report\projectinfo\DependencyInformationReport.java:[113,9]
(modifier) RedundantModifier: Redundant 'public' modifier.
[windows-jdk8] [INFO] Ignored 10 errors, 4 violations remaining.
[windows-jdk8] [INFO] ------------------------------------------------------------------------
[windows-jdk8] [INFO] BUILD FAILURE
[windows-jdk8] [INFO] ------------------------------------------------------------------------
[windows-jdk8] [INFO] Total time: 03:56 min
[windows-jdk8] [INFO] Finished at: 2018-08-08T10:50:27Z
[windows-jdk8] [INFO] Final Memory: 54M/635M
[windows-jdk8] [INFO] ------------------------------------------------------------------------
[windows-jdk8] [INFO] [jenkins-event-spy] Generated F:\jenkins\jenkins-slave\workspace\nfo-reports-plugin_MPIR-361-USOHCFAWZ4BXXFD3QLHLQ2HOCUSPDFM5URQGLU7AUHHJFZBJBXTQ@tmp\withMaven603d6087\maven-spy-20180808-104630-6313838339920917303191.log
[windows-jdk8] [ERROR] Failed to execute goal org.apache.maven.plugins:maven-checkstyle-plugin:3.0.0:check
(checkstyle-check) on project maven-project-info-reports-plugin: You have 4 Checkstyle violations.
-> [Help 1]
[windows-jdk8] [ERROR] 
[windows-jdk8] [ERROR] To see the full stack trace of the errors, re-run Maven with the -e
switch.
[windows-jdk8] [ERROR] Re-run Maven using the -X switch to enable full debug logging.
[windows-jdk8] [ERROR] 
[windows-jdk8] [ERROR] For more information about the errors and possible solutions, please
read the following articles:
[windows-jdk8] [ERROR] [Help 1] http://cwiki.apache.org/confluence/display/MAVEN/MojoFailureException
[windows-jdk8] Picked up JAVA_TOOL_OPTIONS: -Dmaven.ext.class.path="f:\jenkins\jenkins-slave\workspace\nfo-reports-plugin_MPIR-361-USOHCFAWZ4BXXFD3QLHLQ2HOCUSPDFM5URQGLU7AUHHJFZBJBXTQ@tmp\withMaven603d6087\pipeline-maven-spy.jar"
-Dorg.jenkinsci.plugins.pipeline.maven.reportsFolder="f:\jenkins\jenkins-slave\workspace\nfo-reports-plugin_MPIR-361-USOHCFAWZ4BXXFD3QLHLQ2HOCUSPDFM5URQGLU7AUHHJFZBJBXTQ@tmp\withMaven603d6087"

[Pipeline] [windows-jdk8] }
[Pipeline] [windows-jdk8] // dir
[Pipeline] [windows-jdk8] }
[windows-jdk8] [withMaven] invokerPublisher - Archive invoker results for Maven artifact MavenArtifact{org.apache.maven.plugins:maven-project-info-reports-plugin::2.10-SNAPSHOT(version:
2.10-SNAPSHOT, snapshot:false) } generated by PluginInvocation{org.apache.maven.plugins:maven-invoker-plugin:3.0.1@integration-test
 integration-test}: m\target\invoker-reports\*.xml
[windows-jdk8] performing MavenInvokerRecorder, reportsFilenamePattern:'**/m\target\invoker-reports/BUILD*.xml',
invokerBuildDir:'**/m\target\it'
[windows-jdk8] Found reports:[f:\jenkins\jenkins-slave\workspace\nfo-reports-plugin_MPIR-361-USOHCFAWZ4BXXFD3QLHLQ2HOCUSPDFM5URQGLU7AUHHJFZBJBXTQ\m\target\invoker-reports\BUILD-MPIR-242.xml,
f:\jenkins\jenkins-slave\workspace\nfo-reports-plugin_MPIR-361-USOHCFAWZ4BXXFD3QLHLQ2HOCUSPDFM5URQGLU7AUHHJFZBJBXTQ\m\target\invoker-reports\BUILD-MPIR-251.xml,
f:\jenkins\jenkins-slave\workspace\nfo-reports-plugin_MPIR-361-USOHCFAWZ4BXXFD3QLHLQ2HOCUSPDFM5URQGLU7AUHHJFZBJBXTQ\m\target\invoker-reports\BUILD-MPIR-300.xml,
f:\jenkins\jenkins-slave\workspace\nfo-reports-plugin_MPIR-361-USOHCFAWZ4BXXFD3QLHLQ2HOCUSPDFM5URQGLU7AUHHJFZBJBXTQ\m\target\invoker-reports\BUILD-MPIR-349_parent.xml,
f:\jenkins\jenkins-slave\workspace\nfo-reports-plugin_MPIR-361-USOHCFAWZ4BXXFD3QLHLQ2HOCUSPDFM5URQGLU7AUHHJFZBJBXTQ\m\target\invoker-reports\BUILD-dependencies-java-1.7-and-1.8.xml,
f:\jenkins\jenkins-slave\workspace\nfo-reports-plugin_MPIR-361-USOHCFAWZ4BXXFD3QLHLQ2HOCUSPDFM5URQGLU7AUHHJFZBJBXTQ\m\target\invoker-reports\BUILD-full-pom.xml,
f:\jenkins\jenkins-slave\workspace\nfo-reports-plugin_MPIR-361-USOHCFAWZ4BXXFD3QLHLQ2HOCUSPDFM5URQGLU7AUHHJFZBJBXTQ\m\target\invoker-reports\BUILD-git.xml,
f:\jenkins\jenkins-slave\workspace\nfo-reports-plugin_MPIR-361-USOHCFAWZ4BXXFD3QLHLQ2HOCUSPDFM5URQGLU7AUHHJFZBJBXTQ\m\target\invoker-reports\BUILD-java-version.xml,
f:\jenkins\jenkins-slave\workspace\nfo-reports-plugin_MPIR-361-USOHCFAWZ4BXXFD3QLHLQ2HOCUSPDFM5URQGLU7AUHHJFZBJBXTQ\m\target\invoker-reports\BUILD-minimal-pom.xml,
f:\jenkins\jenkins-slave\workspace\nfo-reports-plugin_MPIR-361-USOHCFAWZ4BXXFD3QLHLQ2HOCUSPDFM5URQGLU7AUHHJFZBJBXTQ\m\target\invoker-reports\BUILD-mpir-229.xml,
f:\jenkins\jenkins-slave\workspace\nfo-reports-plugin_MPIR-361-USOHCFAWZ4BXXFD3QLHLQ2HOCUSPDFM5URQGLU7AUHHJFZBJBXTQ\m\target\invoker-reports\BUILD-multi-module.xml]
[windows-jdk8] Found logs:[f:\jenkins\jenkins-slave\workspace\nfo-reports-plugin_MPIR-361-USOHCFAWZ4BXXFD3QLHLQ2HOCUSPDFM5URQGLU7AUHHJFZBJBXTQ\m\target\it\MPIR-242\build.log,
f:\jenkins\jenkins-slave\workspace\nfo-reports-plugin_MPIR-361-USOHCFAWZ4BXXFD3QLHLQ2HOCUSPDFM5URQGLU7AUHHJFZBJBXTQ\m\target\it\MPIR-251\build.log,
f:\jenkins\jenkins-slave\workspace\nfo-reports-plugin_MPIR-361-USOHCFAWZ4BXXFD3QLHLQ2HOCUSPDFM5URQGLU7AUHHJFZBJBXTQ\m\target\it\MPIR-300\build.log,
f:\jenkins\jenkins-slave\workspace\nfo-reports-plugin_MPIR-361-USOHCFAWZ4BXXFD3QLHLQ2HOCUSPDFM5URQGLU7AUHHJFZBJBXTQ\m\target\it\MPIR-349\parent\build.log,
f:\jenkins\jenkins-slave\workspace\nfo-reports-plugin_MPIR-361-USOHCFAWZ4BXXFD3QLHLQ2HOCUSPDFM5URQGLU7AUHHJFZBJBXTQ\m\target\it\dependencies-java-1.7-and-1.8\build.log,
f:\jenkins\jenkins-slave\workspace\nfo-reports-plugin_MPIR-361-USOHCFAWZ4BXXFD3QLHLQ2HOCUSPDFM5URQGLU7AUHHJFZBJBXTQ\m\target\it\full-pom\build.log,
f:\jenkins\jenkins-slave\workspace\nfo-reports-plugin_MPIR-361-USOHCFAWZ4BXXFD3QLHLQ2HOCUSPDFM5URQGLU7AUHHJFZBJBXTQ\m\target\it\git\build.log,
f:\jenkins\jenkins-slave\workspace\nfo-reports-plugin_MPIR-361-USOHCFAWZ4BXXFD3QLHLQ2HOCUSPDFM5URQGLU7AUHHJFZBJBXTQ\m\target\it\java-version\build.log,
f:\jenkins\jenkins-slave\workspace\nfo-reports-plugin_MPIR-361-USOHCFAWZ4BXXFD3QLHLQ2HOCUSPDFM5URQGLU7AUHHJFZBJBXTQ\m\target\it\minimal-pom\build.log,
f:\jenkins\jenkins-slave\workspace\nfo-reports-plugin_MPIR-361-USOHCFAWZ4BXXFD3QLHLQ2HOCUSPDFM5URQGLU7AUHHJFZBJBXTQ\m\target\it\mpir-229\build.log,
f:\jenkins\jenkins-slave\workspace\nfo-reports-plugin_MPIR-361-USOHCFAWZ4BXXFD3QLHLQ2HOCUSPDFM5URQGLU7AUHHJFZBJBXTQ\m\target\it\multi-module\build.log]
[windows-jdk8] Finished parsing Maven Invoker results (found 11)
[windows-jdk8] [withMaven] junitPublisher - Archive test results for Maven artifact org.apache.maven.plugins:maven-project-info-reports-plugin:2.10-SNAPSHOT
generated by maven-surefire-plugin:test (default-test): m\target\surefire-reports\*.xml
[windows-jdk8] Recording test results
[Pipeline] [windows-jdk8] // withMaven
[Pipeline] [windows-jdk8] cleanWs
[windows-jdk8] [WS-CLEANUP] Deleting project workspace...[WS-CLEANUP] done
[Pipeline] [windows-jdk8] cleanWs
[windows-jdk8] [WS-CLEANUP] Deleting project workspace...[WS-CLEANUP] done
[Pipeline] [windows-jdk8] }
[Pipeline] [windows-jdk8] // stage
[Pipeline] [windows-jdk8] }
[Pipeline] [windows-jdk8] // node
[Pipeline] [windows-jdk8] }
[windows-jdk8] Failed in branch windows-jdk8
[Pipeline] // parallel
[Pipeline] stage
[Pipeline] { (Notifications)
[Pipeline] echo
Build result: FAILURE
[Pipeline] jiraIssueSelector
[Pipeline] emailext
Mime
  • Unnamed multipart/mixed (inline, None, 0 bytes)
View raw message