maven-notifications mailing list archives

Site index · List index
Message view « Date » · « Thread »
Top « Date » · « Thread »
From Apache Jenkins Server <jenk...@builds.apache.org>
Subject Build failed in Jenkins: Maven TLP » maven-deploy-plugin » MSHARED-695 #20
Date Tue, 07 Aug 2018 20:08:16 GMT
See https://builds.apache.org/job/maven-box/job/maven-deploy-plugin/job/MSHARED-695/20/

No changes.

All tests passed

Build log:
[...truncated 4.48 MB...]
[linux-jdk9-m3.5.x_build] [INFO] Downloaded from central: https://repo.maven.apache.org/maven2/commons-digester/commons-digester/1.6/commons-digester-1.6.jar (168 kB at 6.7 MB/s)
[linux-jdk9-m3.5.x_build] [INFO] Downloading from central: https://repo.maven.apache.org/maven2/org/antlr/antlr4-runtime/4.5.3/antlr4-runtime-4.5.3.jar
[linux-jdk9-m3.5.x_build] [INFO] Downloaded from central: https://repo.maven.apache.org/maven2/commons-io/commons-io/1.4/commons-io-1.4.jar (109 kB at 3.6 MB/s)
[linux-jdk9-m3.5.x_build] [INFO] Downloading from central: https://repo.maven.apache.org/maven2/commons-beanutils/commons-beanutils/1.9.2/commons-beanutils-1.9.2.jar
[linux-jdk9-m3.5.x_build] [INFO] Downloaded from central: https://repo.maven.apache.org/maven2/org/codehaus/plexus/plexus-resources/1.1.0/plexus-resources-1.1.0.jar (23 kB at 663 kB/s)
[linux-jdk9-m3.5.x_build] [INFO] Downloading from central: https://repo.maven.apache.org/maven2/commons-cli/commons-cli/1.3.1/commons-cli-1.3.1.jar
[linux-jdk9-m3.5.x_build] [INFO] Downloaded from central: https://repo.maven.apache.org/maven2/org/antlr/antlr4-runtime/4.5.3/antlr4-runtime-4.5.3.jar (302 kB at 6.2 MB/s)
[linux-jdk9-m3.5.x_build] [INFO] Downloading from central: https://repo.maven.apache.org/maven2/com/google/guava/guava/19.0/guava-19.0.jar
[linux-jdk9-m3.5.x_build] [INFO] Downloaded from central: https://repo.maven.apache.org/maven2/commons-cli/commons-cli/1.3.1/commons-cli-1.3.1.jar (53 kB at 1.1 MB/s)
[linux-jdk9-m3.5.x_build] [INFO] Downloading from central: https://repo.maven.apache.org/maven2/commons-lang/commons-lang/2.1/commons-lang-2.1.jar
[linux-jdk9-m3.5.x_build] [INFO] Downloaded from central: https://repo.maven.apache.org/maven2/antlr/antlr/2.7.7/antlr-2.7.7.jar (445 kB at 8.9 MB/s)
[linux-jdk9-m3.5.x_build] [INFO] Downloading from central: https://repo.maven.apache.org/maven2/javax/xml/bind/jaxb-api/2.3.0/jaxb-api-2.3.0.jar
[linux-jdk9-m3.5.x_build] [INFO] Downloaded from central: https://repo.maven.apache.org/maven2/commons-beanutils/commons-beanutils/1.9.2/commons-beanutils-1.9.2.jar (234 kB at 4.4 MB/s)
[linux-jdk9-m3.5.x_build] [INFO] Downloaded from central: https://repo.maven.apache.org/maven2/javax/xml/bind/jaxb-api/2.3.0/jaxb-api-2.3.0.jar (126 kB at 1.9 MB/s)
[linux-jdk9-m3.5.x_build] [INFO] Downloaded from central: https://repo.maven.apache.org/maven2/commons-lang/commons-lang/2.1/commons-lang-2.1.jar (208 kB at 2.9 MB/s)
[linux-jdk9-m3.5.x_build] [INFO] Downloaded from central: https://repo.maven.apache.org/maven2/com/puppycrawl/tools/checkstyle/6.18/checkstyle-6.18.jar (1.2 MB at 14 MB/s)
[linux-jdk9-m3.5.x_build] [INFO] Downloaded from central: https://repo.maven.apache.org/maven2/com/google/guava/guava/19.0/guava-19.0.jar (2.3 MB at 20 MB/s)
[linux-jdk9-m3.5.x_build] [INFO] There is 1 error reported by Checkstyle 6.18 with config/maven_checks.xml ruleset.
[linux-jdk9-m3.5.x_build] [INFO] Ignored 1 error, 0 violation remaining.
[linux-jdk9-m3.5.x_build] [INFO] 
[linux-jdk9-m3.5.x_build] [INFO] --- maven-invoker-plugin:3.1.0:verify (integration-test) @ maven-deploy-plugin ---
[linux-jdk9-m3.5.x_build] [INFO] -------------------------------------------------
[linux-jdk9-m3.5.x_build] [INFO] Build Summary:
[linux-jdk9-m3.5.x_build] [INFO]   Passed: 29, Failed: 2, Errors: 0, Skipped: 0
[linux-jdk9-m3.5.x_build] [INFO] -------------------------------------------------
[linux-jdk9-m3.5.x_build] [ERROR] The following builds failed:
[linux-jdk9-m3.5.x_build] [ERROR] *  attach-jar-checksum-release/pom.xml
[linux-jdk9-m3.5.x_build] [ERROR] *  attach-jar-checksum-snapshot/pom.xml
[linux-jdk9-m3.5.x_build] [INFO] -------------------------------------------------
[linux-jdk9-m3.5.x_build] [INFO] ------------------------------------------------------------------------
[linux-jdk9-m3.5.x_build] [INFO] BUILD FAILURE
[linux-jdk9-m3.5.x_build] [INFO] ------------------------------------------------------------------------
[linux-jdk9-m3.5.x_build] [INFO] Total time: 03:49 min
[linux-jdk9-m3.5.x_build] [INFO] Finished at: 2018-08-07T20:06:30Z
[linux-jdk9-m3.5.x_build] [INFO] Final Memory: 58M/192M
[linux-jdk9-m3.5.x_build] [INFO] ------------------------------------------------------------------------
[linux-jdk9-m3.5.x_build] [INFO] [jenkins-event-spy] Generated /home/jenkins/jenkins-slave/workspace/n-deploy-plugin_MSHARED-695-QKWZBEISZCJZBLERRKRCUKWJHH6YND5Z2N2RRA7VKODZB77LKVRQ@tmp/withMavene7b13e87/maven-spy-20180807-200240-37013100052342869154403.log
[linux-jdk9-m3.5.x_build] [ERROR] Failed to execute goal org.apache.maven.plugins:maven-invoker-plugin:3.1.0:verify (integration-test) on project maven-deploy-plugin: 2 builds failed. See console output above for details. -> [Help 1]
[linux-jdk9-m3.5.x_build] [ERROR] 
[linux-jdk9-m3.5.x_build] [ERROR] To see the full stack trace of the errors, re-run Maven with the -e switch.
[linux-jdk9-m3.5.x_build] [ERROR] Re-run Maven using the -X switch to enable full debug logging.
[linux-jdk9-m3.5.x_build] [ERROR] 
[linux-jdk9-m3.5.x_build] [ERROR] For more information about the errors and possible solutions, please read the following articles:
[linux-jdk9-m3.5.x_build] [ERROR] [Help 1] http://cwiki.apache.org/confluence/display/MAVEN/MojoFailureException
[Pipeline] [linux-jdk9-m3.5.x_build] }
[Pipeline] [linux-jdk9-m3.5.x_build] // dir
[linux-jdk10-m3.5.x_build] [INFO] run post-build script verify.bsh
[linux-jdk10-m3.5.x_build] [INFO]           MDEPLOY-213/pom.xml .............................. SUCCESS (14.6 s)
[linux-jdk10-m3.5.x_build] [INFO] Building: deploy-attached-sources/pom.xml
[linux-jdk10-m3.5.x_build] [INFO] run pre-build script setup.bsh
[Pipeline] [linux-jdk9-m3.5.x_build] }
[linux-jdk10-m3.5.x_build] [INFO] run post-build script verify.bsh
[linux-jdk10-m3.5.x_build] [INFO]           deploy-attached-sources/pom.xml .................. SUCCESS (17.1 s)
[linux-jdk10-m3.5.x_build] [INFO] Building: MDEPLOY-169_deploy-at-end-multithread/pom.xml
[linux-jdk9-m3.5.x_build] [withMaven] invokerPublisher - Archive invoker results for Maven artifact MavenArtifact{org.apache.maven.plugins:maven-deploy-plugin::3.0.0-SNAPSHOT(version: 3.0.0-SNAPSHOT, snapshot:false) } generated by PluginInvocation{org.apache.maven.plugins:maven-invoker-plugin:3.1.0@integration-test  integration-test}: linux-jdk9-m3.5.x_build/target/invoker-reports/*.xml
[linux-jdk9-m3.5.x_build] performing MavenInvokerRecorder, reportsFilenamePattern:'**/linux-jdk9-m3.5.x_build/target/invoker-reports/BUILD*.xml', invokerBuildDir:'**/linux-jdk9-m3.5.x_build/target/it'
[linux-jdk9-m3.5.x_build] Found reports:[/home/jenkins/jenkins-slave/workspace/n-deploy-plugin_MSHARED-695-QKWZBEISZCJZBLERRKRCUKWJHH6YND5Z2N2RRA7VKODZB77LKVRQ/linux-jdk9-m3.5.x_build/target/invoker-reports/BUILD-3rd-party-jar-with-extras.xml, /home/jenkins/jenkins-slave/workspace/n-deploy-plugin_MSHARED-695-QKWZBEISZCJZBLERRKRCUKWJHH6YND5Z2N2RRA7VKODZB77LKVRQ/linux-jdk9-m3.5.x_build/target/invoker-reports/BUILD-3rd-party-jar-without-pom.xml, /home/jenkins/jenkins-slave/workspace/n-deploy-plugin_MSHARED-695-QKWZBEISZCJZBLERRKRCUKWJHH6YND5Z2N2RRA7VKODZB77LKVRQ/linux-jdk9-m3.5.x_build/target/invoker-reports/BUILD-3rd-party-pom-with-extras.xml, /home/jenkins/jenkins-slave/workspace/n-deploy-plugin_MSHARED-695-QKWZBEISZCJZBLERRKRCUKWJHH6YND5Z2N2RRA7VKODZB77LKVRQ/linux-jdk9-m3.5.x_build/target/invoker-reports/BUILD-MDEPLOY-169_deploy-at-end-multithread.xml, /home/jenkins/jenkins-slave/workspace/n-deploy-plugin_MSHARED-695-QKWZBEISZCJZBLERRKRCUKWJHH6YND5Z2N2RRA7VKODZB77LKVRQ/linux-jdk9-m3.5.x_build/target/invoker-reports/BUILD-MDEPLOY-170_deploy-at-end-configperproject.xml, /home/jenkins/jenkins-slave/workspace/n-deploy-plugin_MSHARED-695-QKWZBEISZCJZBLERRKRCUKWJHH6YND5Z2N2RRA7VKODZB77LKVRQ/linux-jdk9-m3.5.x_build/target/invoker-reports/BUILD-MDEPLOY-178_deployfile-with-embedded-pom.xml, /home/jenkins/jenkins-slave/workspace/n-deploy-plugin_MSHARED-695-QKWZBEISZCJZBLERRKRCUKWJHH6YND5Z2N2RRA7VKODZB77LKVRQ/linux-jdk9-m3.5.x_build/target/invoker-reports/BUILD-MDEPLOY-202_deployfile-with-multiple-executions.xml, /home/jenkins/jenkins-slave/workspace/n-deploy-plugin_MSHARED-695-QKWZBEISZCJZBLERRKRCUKWJHH6YND5Z2N2RRA7VKODZB77LKVRQ/linux-jdk9-m3.5.x_build/target/invoker-reports/BUILD-MDEPLOY-212.xml, /home/jenkins/jenkins-slave/workspace/n-deploy-plugin_MSHARED-695-QKWZBEISZCJZBLERRKRCUKWJHH6YND5Z2N2RRA7VKODZB77LKVRQ/linux-jdk9-m3.5.x_build/target/invoker-reports/BUILD-MDEPLOY-213.xml, /home/jenkins/jenkins-slave/workspace/n-deploy-plugin_MSHARED-695-QKWZBEISZCJZBLERRKRCUKWJHH6YND5Z2N2RRA7VKODZB77LKVRQ/linux-jdk9-m3.5.x_build/target/invoker-reports/BUILD-alt-deploy-repo-with-dist-mgmt-snapshot.xml, /home/jenkins/jenkins-slave/workspace/n-deploy-plugin_MSHARED-695-QKWZBEISZCJZBLERRKRCUKWJHH6YND5Z2N2RRA7VKODZB77LKVRQ/linux-jdk9-m3.5.x_build/target/invoker-reports/BUILD-alt-deploy-repo-with-dist-mgmt.xml, /home/jenkins/jenkins-slave/workspace/n-deploy-plugin_MSHARED-695-QKWZBEISZCJZBLERRKRCUKWJHH6YND5Z2N2RRA7VKODZB77LKVRQ/linux-jdk9-m3.5.x_build/target/invoker-reports/BUILD-alt-deploy-repo-without-dist-mgmt.xml, /home/jenkins/jenkins-slave/workspace/n-deploy-plugin_MSHARED-695-QKWZBEISZCJZBLERRKRCUKWJHH6YND5Z2N2RRA7VKODZB77LKVRQ/linux-jdk9-m3.5.x_build/target/invoker-reports/BUILD-attach-jar-checksum-release.xml, /home/jenkins/jenkins-slave/workspace/n-deploy-plugin_MSHARED-695-QKWZBEISZCJZBLERRKRCUKWJHH6YND5Z2N2RRA7VKODZB77LKVRQ/linux-jdk9-m3.5.x_build/target/invoker-reports/BUILD-attach-jar-checksum-snapshot.xml, /home/jenkins/jenkins-slave/workspace/n-deploy-plugin_MSHARED-695-QKWZBEISZCJZBLERRKRCUKWJHH6YND5Z2N2RRA7VKODZB77LKVRQ/linux-jdk9-m3.5.x_build/target/invoker-reports/BUILD-attach-release-jar.xml, /home/jenkins/jenkins-slave/workspace/n-deploy-plugin_MSHARED-695-QKWZBEISZCJZBLERRKRCUKWJHH6YND5Z2N2RRA7VKODZB77LKVRQ/linux-jdk9-m3.5.x_build/target/invoker-reports/BUILD-deploy-at-end-fail.xml, /home/jenkins/jenkins-slave/workspace/n-deploy-plugin_MSHARED-695-QKWZBEISZCJZBLERRKRCUKWJHH6YND5Z2N2RRA7VKODZB77LKVRQ/linux-jdk9-m3.5.x_build/target/invoker-reports/BUILD-deploy-at-end-pass.xml, /home/jenkins/jenkins-slave/workspace/n-deploy-plugin_MSHARED-695-QKWZBEISZCJZBLERRKRCUKWJHH6YND5Z2N2RRA7VKODZB77LKVRQ/linux-jdk9-m3.5.x_build/target/invoker-reports/BUILD-deploy-attached-sources.xml, /home/jenkins/jenkins-slave/workspace/n-deploy-plugin_MSHARED-695-QKWZBEISZCJZBLERRKRCUKWJHH6YND5Z2N2RRA7VKODZB77LKVRQ/linux-jdk9-m3.5.x_build/target/invoker-reports/BUILD-deploy-default-packaging.xml, /home/jenkins/jenkins-slave/workspace/n-deploy-plugin_MSHARED-695-QKWZBEISZCJZBLERRKRCUKWJHH6YND5Z2N2RRA7VKODZB77LKVRQ/linux-jdk9-m3.5.x_build/target/invoker-reports/BUILD-external-release-jar.xml, /home/jenkins/jenkins-slave/workspace/n-deploy-plugin_MSHARED-695-QKWZBEISZCJZBLERRKRCUKWJHH6YND5Z2N2RRA7VKODZB77LKVRQ/linux-jdk9-m3.5.x_build/target/invoker-reports/BUILD-gav-validation.xml, /home/jenkins/jenkins-slave/workspace/n-deploy-plugin_MSHARED-695-QKWZBEISZCJZBLERRKRCUKWJHH6YND5Z2N2RRA7VKODZB77LKVRQ/linux-jdk9-m3.5.x_build/target/invoker-reports/BUILD-mdeploy-45-test.xml, /home/jenkins/jenkins-slave/workspace/n-deploy-plugin_MSHARED-695-QKWZBEISZCJZBLERRKRCUKWJHH6YND5Z2N2RRA7VKODZB77LKVRQ/linux-jdk9-m3.5.x_build/target/invoker-reports/BUILD-no-main-artifact-1.xml, /home/jenkins/jenkins-slave/workspace/n-deploy-plugin_MSHARED-695-QKWZBEISZCJZBLERRKRCUKWJHH6YND5Z2N2RRA7VKODZB77LKVRQ/linux-jdk9-m3.5.x_build/target/invoker-reports/BUILD-no-main-artifact-2.xml, /home/jenkins/jenkins-slave/workspace/n-deploy-plugin_MSHARED-695-QKWZBEISZCJZBLERRKRCUKWJHH6YND5Z2N2RRA7VKODZB77LKVRQ/linux-jdk9-m3.5.x_build/target/invoker-reports/BUILD-no-main-artifact-snapshot.xml, /home/jenkins/jenkins-slave/workspace/n-deploy-plugin_MSHARED-695-QKWZBEISZCJZBLERRKRCUKWJHH6YND5Z2N2RRA7VKODZB77LKVRQ/linux-jdk9-m3.5.x_build/target/invoker-reports/BUILD-offline.xml, /home/jenkins/jenkins-slave/workspace/n-deploy-plugin_MSHARED-695-QKWZBEISZCJZBLERRKRCUKWJHH6YND5Z2N2RRA7VKODZB77LKVRQ/linux-jdk9-m3.5.x_build/target/invoker-reports/BUILD-release-jar.xml, /home/jenkins/jenkins-slave/workspace/n-deploy-plugin_MSHARED-695-QKWZBEISZCJZBLERRKRCUKWJHH6YND5Z2N2RRA7VKODZB77LKVRQ/linux-jdk9-m3.5.x_build/target/invoker-reports/BUILD-release-pom.xml, /home/jenkins/jenkins-slave/workspace/n-deploy-plugin_MSHARED-695-QKWZBEISZCJZBLERRKRCUKWJHH6YND5Z2N2RRA7VKODZB77LKVRQ/linux-jdk9-m3.5.x_build/target/invoker-reports/BUILD-skip.xml, /home/jenkins/jenkins-slave/workspace/n-deploy-plugin_MSHARED-695-QKWZBEISZCJZBLERRKRCUKWJHH6YND5Z2N2RRA7VKODZB77LKVRQ/linux-jdk9-m3.5.x_build/target/invoker-reports/BUILD-snapshot-jar.xml, /home/jenkins/jenkins-slave/workspace/n-deploy-plugin_MSHARED-695-QKWZBEISZCJZBLERRKRCUKWJHH6YND5Z2N2RRA7VKODZB77LKVRQ/linux-jdk9-m3.5.x_build/target/invoker-reports/BUILD-snapshot-pom.xml]
[linux-jdk9-m3.5.x_build] Found logs:[/home/jenkins/jenkins-slave/workspace/n-deploy-plugin_MSHARED-695-QKWZBEISZCJZBLERRKRCUKWJHH6YND5Z2N2RRA7VKODZB77LKVRQ/linux-jdk9-m3.5.x_build/target/it/3rd-party-jar-with-extras/build.log, /home/jenkins/jenkins-slave/workspace/n-deploy-plugin_MSHARED-695-QKWZBEISZCJZBLERRKRCUKWJHH6YND5Z2N2RRA7VKODZB77LKVRQ/linux-jdk9-m3.5.x_build/target/it/3rd-party-jar-without-pom/build.log, /home/jenkins/jenkins-slave/workspace/n-deploy-plugin_MSHARED-695-QKWZBEISZCJZBLERRKRCUKWJHH6YND5Z2N2RRA7VKODZB77LKVRQ/linux-jdk9-m3.5.x_build/target/it/3rd-party-pom-with-extras/build.log, /home/jenkins/jenkins-slave/workspace/n-deploy-plugin_MSHARED-695-QKWZBEISZCJZBLERRKRCUKWJHH6YND5Z2N2RRA7VKODZB77LKVRQ/linux-jdk9-m3.5.x_build/target/it/MDEPLOY-169_deploy-at-end-multithread/build.log, /home/jenkins/jenkins-slave/workspace/n-deploy-plugin_MSHARED-695-QKWZBEISZCJZBLERRKRCUKWJHH6YND5Z2N2RRA7VKODZB77LKVRQ/linux-jdk9-m3.5.x_build/target/it/MDEPLOY-170_deploy-at-end-configperproject/build.log, /home/jenkins/jenkins-slave/workspace/n-deploy-plugin_MSHARED-695-QKWZBEISZCJZBLERRKRCUKWJHH6YND5Z2N2RRA7VKODZB77LKVRQ/linux-jdk9-m3.5.x_build/target/it/MDEPLOY-178_deployfile-with-embedded-pom/build.log, /home/jenkins/jenkins-slave/workspace/n-deploy-plugin_MSHARED-695-QKWZBEISZCJZBLERRKRCUKWJHH6YND5Z2N2RRA7VKODZB77LKVRQ/linux-jdk9-m3.5.x_build/target/it/MDEPLOY-202_deployfile-with-multiple-executions/build.log, /home/jenkins/jenkins-slave/workspace/n-deploy-plugin_MSHARED-695-QKWZBEISZCJZBLERRKRCUKWJHH6YND5Z2N2RRA7VKODZB77LKVRQ/linux-jdk9-m3.5.x_build/target/it/MDEPLOY-212/build.log, /home/jenkins/jenkins-slave/workspace/n-deploy-plugin_MSHARED-695-QKWZBEISZCJZBLERRKRCUKWJHH6YND5Z2N2RRA7VKODZB77LKVRQ/linux-jdk9-m3.5.x_build/target/it/MDEPLOY-213/build.log, /home/jenkins/jenkins-slave/workspace/n-deploy-plugin_MSHARED-695-QKWZBEISZCJZBLERRKRCUKWJHH6YND5Z2N2RRA7VKODZB77LKVRQ/linux-jdk9-m3.5.x_build/target/it/alt-deploy-repo-with-dist-mgmt-snapshot/build.log, /home/jenkins/jenkins-slave/workspace/n-deploy-plugin_MSHARED-695-QKWZBEISZCJZBLERRKRCUKWJHH6YND5Z2N2RRA7VKODZB77LKVRQ/linux-jdk9-m3.5.x_build/target/it/alt-deploy-repo-with-dist-mgmt/build.log, /home/jenkins/jenkins-slave/workspace/n-deploy-plugin_MSHARED-695-QKWZBEISZCJZBLERRKRCUKWJHH6YND5Z2N2RRA7VKODZB77LKVRQ/linux-jdk9-m3.5.x_build/target/it/alt-deploy-repo-without-dist-mgmt/build.log, /home/jenkins/jenkins-slave/workspace/n-deploy-plugin_MSHARED-695-QKWZBEISZCJZBLERRKRCUKWJHH6YND5Z2N2RRA7VKODZB77LKVRQ/linux-jdk9-m3.5.x_build/target/it/attach-jar-checksum-release/build.log, /home/jenkins/jenkins-slave/workspace/n-deploy-plugin_MSHARED-695-QKWZBEISZCJZBLERRKRCUKWJHH6YND5Z2N2RRA7VKODZB77LKVRQ/linux-jdk9-m3.5.x_build/target/it/attach-jar-checksum-snapshot/build.log, /home/jenkins/jenkins-slave/workspace/n-deploy-plugin_MSHARED-695-QKWZBEISZCJZBLERRKRCUKWJHH6YND5Z2N2RRA7VKODZB77LKVRQ/linux-jdk9-m3.5.x_build/target/it/attach-release-jar/build.log, /home/jenkins/jenkins-slave/workspace/n-deploy-plugin_MSHARED-695-QKWZBEISZCJZBLERRKRCUKWJHH6YND5Z2N2RRA7VKODZB77LKVRQ/linux-jdk9-m3.5.x_build/target/it/deploy-at-end-fail/build.log, /home/jenkins/jenkins-slave/workspace/n-deploy-plugin_MSHARED-695-QKWZBEISZCJZBLERRKRCUKWJHH6YND5Z2N2RRA7VKODZB77LKVRQ/linux-jdk9-m3.5.x_build/target/it/deploy-at-end-pass/build.log, /home/jenkins/jenkins-slave/workspace/n-deploy-plugin_MSHARED-695-QKWZBEISZCJZBLERRKRCUKWJHH6YND5Z2N2RRA7VKODZB77LKVRQ/linux-jdk9-m3.5.x_build/target/it/deploy-attached-sources/build.log, /home/jenkins/jenkins-slave/workspace/n-deploy-plugin_MSHARED-695-QKWZBEISZCJZBLERRKRCUKWJHH6YND5Z2N2RRA7VKODZB77LKVRQ/linux-jdk9-m3.5.x_build/target/it/deploy-default-packaging/build.log, /home/jenkins/jenkins-slave/workspace/n-deploy-plugin_MSHARED-695-QKWZBEISZCJZBLERRKRCUKWJHH6YND5Z2N2RRA7VKODZB77LKVRQ/linux-jdk9-m3.5.x_build/target/it/external-release-jar/build.log, /home/jenkins/jenkins-slave/workspace/n-deploy-plugin_MSHARED-695-QKWZBEISZCJZBLERRKRCUKWJHH6YND5Z2N2RRA7VKODZB77LKVRQ/linux-jdk9-m3.5.x_build/target/it/gav-validation/build.log, /home/jenkins/jenkins-slave/workspace/n-deploy-plugin_MSHARED-695-QKWZBEISZCJZBLERRKRCUKWJHH6YND5Z2N2RRA7VKODZB77LKVRQ/linux-jdk9-m3.5.x_build/target/it/mdeploy-45-test/build.log, /home/jenkins/jenkins-slave/workspace/n-deploy-plugin_MSHARED-695-QKWZBEISZCJZBLERRKRCUKWJHH6YND5Z2N2RRA7VKODZB77LKVRQ/linux-jdk9-m3.5.x_build/target/it/no-main-artifact-1/build.log, /home/jenkins/jenkins-slave/workspace/n-deploy-plugin_MSHARED-695-QKWZBEISZCJZBLERRKRCUKWJHH6YND5Z2N2RRA7VKODZB77LKVRQ/linux-jdk9-m3.5.x_build/target/it/no-main-artifact-2/build.log, /home/jenkins/jenkins-slave/workspace/n-deploy-plugin_MSHARED-695-QKWZBEISZCJZBLERRKRCUKWJHH6YND5Z2N2RRA7VKODZB77LKVRQ/linux-jdk9-m3.5.x_build/target/it/no-main-artifact-snapshot/build.log, /home/jenkins/jenkins-slave/workspace/n-deploy-plugin_MSHARED-695-QKWZBEISZCJZBLERRKRCUKWJHH6YND5Z2N2RRA7VKODZB77LKVRQ/linux-jdk9-m3.5.x_build/target/it/offline/build.log, /home/jenkins/jenkins-slave/workspace/n-deploy-plugin_MSHARED-695-QKWZBEISZCJZBLERRKRCUKWJHH6YND5Z2N2RRA7VKODZB77LKVRQ/linux-jdk9-m3.5.x_build/target/it/release-jar/build.log, /home/jenkins/jenkins-slave/workspace/n-deploy-plugin_MSHARED-695-QKWZBEISZCJZBLERRKRCUKWJHH6YND5Z2N2RRA7VKODZB77LKVRQ/linux-jdk9-m3.5.x_build/target/it/release-pom/build.log, /home/jenkins/jenkins-slave/workspace/n-deploy-plugin_MSHARED-695-QKWZBEISZCJZBLERRKRCUKWJHH6YND5Z2N2RRA7VKODZB77LKVRQ/linux-jdk9-m3.5.x_build/target/it/skip/build.log, /home/jenkins/jenkins-slave/workspace/n-deploy-plugin_MSHARED-695-QKWZBEISZCJZBLERRKRCUKWJHH6YND5Z2N2RRA7VKODZB77LKVRQ/linux-jdk9-m3.5.x_build/target/it/snapshot-jar/build.log, /home/jenkins/jenkins-slave/workspace/n-deploy-plugin_MSHARED-695-QKWZBEISZCJZBLERRKRCUKWJHH6YND5Z2N2RRA7VKODZB77LKVRQ/linux-jdk9-m3.5.x_build/target/it/snapshot-pom/build.log]
[linux-jdk9-m3.5.x_build] Finished parsing Maven Invoker results (found 31)
[linux-jdk9-m3.5.x_build] [withMaven] junitPublisher - Archive test results for Maven artifact org.apache.maven.plugins:maven-deploy-plugin:3.0.0-SNAPSHOT generated by maven-surefire-plugin:test (default-test): linux-jdk9-m3.5.x_build/target/surefire-reports/*.xml
[linux-jdk9-m3.5.x_build] Recording test results
[linux-jdk9-m3.5.x_build] [withMaven] openTasksPublisher - Scan Tasks for Maven artifact org.apache.maven.plugins:maven-deploy-plugin:3.0.0-SNAPSHOT in source directory linux-jdk9-m3.5.x_build/src/main/java
[linux-jdk9-m3.5.x_build] [TASKS] Scanning folder '/home/jenkins/jenkins-slave/workspace/n-deploy-plugin_MSHARED-695-QKWZBEISZCJZBLERRKRCUKWJHH6YND5Z2N2RRA7VKODZB77LKVRQ' for files matching the pattern 'linux-jdk9-m3.5.x_build/src/main/java/**/*' - excludes: null
[linux-jdk9-m3.5.x_build] [TASKS] Found 3 files to scan for tasks
[linux-jdk9-m3.5.x_build] [TASKS] Found 0 open tasks.
[linux-jdk9-m3.5.x_build] Skipping warnings blame since pipelines do not have an SCM link.%n
[linux-jdk9-m3.5.x_build] [TASKS] Computing warning deltas based on reference build #18
[Pipeline] [linux-jdk9-m3.5.x_build] // withMaven
[Pipeline] [linux-jdk9-m3.5.x_build] cleanWs
[linux-jdk9-m3.5.x_build] [WS-CLEANUP] Deleting project workspace...[WS-CLEANUP] done
[Pipeline] [linux-jdk9-m3.5.x_build] cleanWs
[linux-jdk9-m3.5.x_build] [WS-CLEANUP] Deleting project workspace...[WS-CLEANUP] done
[Pipeline] [linux-jdk9-m3.5.x_build] }
[Pipeline] [linux-jdk9-m3.5.x_build] // stage
[Pipeline] [linux-jdk9-m3.5.x_build] }
[Pipeline] [linux-jdk9-m3.5.x_build] // node
[Pipeline] [linux-jdk9-m3.5.x_build] }
[linux-jdk10-m3.5.x_build] [INFO] run post-build script verify.groovy
[linux-jdk10-m3.5.x_build] [INFO]           MDEPLOY-169_deploy-at-end-multithread/pom.xml .... SUCCESS (4.1 s)
[linux-jdk10-m3.5.x_build] [INFO] Building: deploy-at-end-pass/pom.xml
[linux-jdk9-m3.5.x_build] Failed in branch linux-jdk9-m3.5.x_build
[linux-jdk10-m3.5.x_build] [INFO] run post-build script verify.groovy
[linux-jdk10-m3.5.x_build] [INFO]           deploy-at-end-pass/pom.xml ....................... SUCCESS (4.5 s)
[linux-jdk10-m3.5.x_build] [INFO] Building: attach-jar-checksum-release/pom.xml
[linux-jdk10-m3.5.x_build] [INFO] run pre-build script setup.bsh
[linux-jdk10-m3.5.x_build] [INFO] run post-build script verify.groovy
[linux-jdk10-m3.5.x_build] [INFO]           attach-jar-checksum-release/pom.xml .............. FAILED (4.5 s)
[linux-jdk10-m3.5.x_build] [INFO]   The post-build script did not succeed. Missing: /home/jenkins/jenkins-slave/workspace/n-deploy-plugin_MSHARED-695-QKWZBEISZCJZBLERRKRCUKWJHH6YND5Z2N2RRA7VKODZB77LKVRQ/linux-jdk10-m3.5.x_build/target/it/attach-jar-checksum-release/target/remoterepo/org/apache/maven/its/deploy/ajc/test/1.0/maven-metadata.xml
[linux-jdk10-m3.5.x_build] [INFO] Building: snapshot-jar/pom.xml
[linux-jdk10-m3.5.x_build] [INFO] run pre-build script setup.bsh
[linux-jdk10-m3.5.x_build] [INFO] run post-build script verify.bsh
[linux-jdk10-m3.5.x_build] [INFO]           snapshot-jar/pom.xml ............................. SUCCESS (4.8 s)
[linux-jdk10-m3.5.x_build] [INFO] Building: no-main-artifact-2/pom.xml
[linux-jdk10-m3.5.x_build] [INFO] run pre-build script setup.bsh
[linux-jdk10-m3.5.x_build] [INFO] run post-build script verify.groovy
[linux-jdk10-m3.5.x_build] [INFO]           no-main-artifact-2/pom.xml ....................... SUCCESS (5.2 s)
[linux-jdk10-m3.5.x_build] [INFO] Building: no-main-artifact-1/pom.xml
[linux-jdk10-m3.5.x_build] [INFO] run pre-build script setup.bsh
[linux-jdk10-m3.5.x_build] [INFO] run post-build script verify.groovy
[linux-jdk10-m3.5.x_build] [INFO]           no-main-artifact-1/pom.xml ....................... SUCCESS (4.2 s)
[linux-jdk10-m3.5.x_build] [INFO] Building: offline/pom.xml
[linux-jdk10-m3.5.x_build] [INFO] run pre-build script setup.bsh
[linux-jdk10-m3.5.x_build] [INFO]           offline/pom.xml .................................. SUCCESS (8.8 s)
[linux-jdk10-m3.5.x_build] [INFO] Building: alt-deploy-repo-with-dist-mgmt-snapshot/pom.xml
[linux-jdk10-m3.5.x_build] [INFO] run pre-build script setup.bsh
[linux-jdk10-m3.5.x_build] [INFO] run post-build script verify.bsh
[linux-jdk10-m3.5.x_build] [INFO]           alt-deploy-repo-with-dist-mgmt-snapshot/pom.xml .. SUCCESS (3.8 s)
[linux-jdk10-m3.5.x_build] [INFO] Building: alt-deploy-repo-with-dist-mgmt/pom.xml
[linux-jdk10-m3.5.x_build] [INFO] run pre-build script setup.bsh
[linux-jdk10-m3.5.x_build] [INFO] run post-build script verify.bsh
[linux-jdk10-m3.5.x_build] [INFO]           alt-deploy-repo-with-dist-mgmt/pom.xml ........... SUCCESS (4.5 s)
[linux-jdk10-m3.5.x_build] [INFO] Building: MDEPLOY-212/pom.xml
[linux-jdk10-m3.5.x_build] [INFO] run post-build script verify.bsh
[linux-jdk10-m3.5.x_build] [INFO]           MDEPLOY-212/pom.xml .............................. SUCCESS (9.8 s)
[linux-jdk10-m3.5.x_build] [INFO] Building: release-jar/pom.xml
[linux-jdk10-m3.5.x_build] [INFO] run pre-build script setup.bsh
[linux-jdk10-m3.5.x_build] [INFO] run post-build script verify.bsh
[linux-jdk10-m3.5.x_build] [INFO]           release-jar/pom.xml .............................. SUCCESS (5.0 s)
[linux-jdk10-m3.5.x_build] [INFO] 
[linux-jdk10-m3.5.x_build] [INFO] --- maven-checkstyle-plugin:3.0.0:check (checkstyle-check) @ maven-deploy-plugin ---
[linux-jdk10-m3.5.x_build] [INFO] Downloading from central: https://repo.maven.apache.org/maven2/org/apache/maven/shared/maven-shared-resources/2/maven-shared-resources-2.pom
[linux-jdk10-m3.5.x_build] [INFO] Downloaded from central: https://repo.maven.apache.org/maven2/org/apache/maven/shared/maven-shared-resources/2/maven-shared-resources-2.pom (3.0 kB at 148 kB/s)
[linux-jdk10-m3.5.x_build] [INFO] Downloading from central: https://repo.maven.apache.org/maven2/org/codehaus/plexus/plexus-utils/3.0.10/plexus-utils-3.0.10.pom
[linux-jdk10-m3.5.x_build] [INFO] Downloaded from central: https://repo.maven.apache.org/maven2/org/codehaus/plexus/plexus-utils/3.0.10/plexus-utils-3.0.10.pom (3.1 kB at 131 kB/s)
[linux-jdk10-m3.5.x_build] [INFO] Downloading from central: https://repo.maven.apache.org/maven2/org/codehaus/plexus/plexus/3.3/plexus-3.3.pom
[linux-jdk10-m3.5.x_build] [INFO] Downloaded from central: https://repo.maven.apache.org/maven2/org/codehaus/plexus/plexus/3.3/plexus-3.3.pom (20 kB at 1.1 MB/s)
[linux-jdk10-m3.5.x_build] [INFO] Downloading from central: https://repo.maven.apache.org/maven2/org/apache/maven/doxia/doxia-integration-tools/1.6/doxia-integration-tools-1.6.pom
[linux-jdk10-m3.5.x_build] [INFO] Downloaded from central: https://repo.maven.apache.org/maven2/org/apache/maven/doxia/doxia-integration-tools/1.6/doxia-integration-tools-1.6.pom (7.0 kB at 497 kB/s)
[linux-jdk10-m3.5.x_build] [INFO] Downloading from central: https://repo.maven.apache.org/maven2/org/apache/maven/doxia/doxia-tools/3/doxia-tools-3.pom
[linux-jdk10-m3.5.x_build] [INFO] Downloaded from central: https://repo.maven.apache.org/maven2/org/apache/maven/doxia/doxia-tools/3/doxia-tools-3.pom (9.9 kB at 709 kB/s)
[linux-jdk10-m3.5.x_build] [INFO] Downloading from central: https://repo.maven.apache.org/maven2/org/codehaus/plexus/plexus-resources/1.1.0/plexus-resources-1.1.0.pom
[linux-jdk10-m3.5.x_build] [INFO] Downloaded from central: https://repo.maven.apache.org/maven2/org/codehaus/plexus/plexus-resources/1.1.0/plexus-resources-1.1.0.pom (3.2 kB at 151 kB/s)
[linux-jdk10-m3.5.x_build] [INFO] Downloading from central: https://repo.maven.apache.org/maven2/com/puppycrawl/tools/checkstyle/6.18/checkstyle-6.18.pom
[linux-jdk10-m3.5.x_build] [INFO] Downloaded from central: https://repo.maven.apache.org/maven2/com/puppycrawl/tools/checkstyle/6.18/checkstyle-6.18.pom (71 kB at 2.3 MB/s)
[linux-jdk10-m3.5.x_build] [INFO] Downloading from central: https://repo.maven.apache.org/maven2/antlr/antlr/2.7.7/antlr-2.7.7.pom
[linux-jdk10-m3.5.x_build] [INFO] Downloaded from central: https://repo.maven.apache.org/maven2/antlr/antlr/2.7.7/antlr-2.7.7.pom (632 B at 23 kB/s)
[linux-jdk10-m3.5.x_build] [INFO] Downloading from central: https://repo.maven.apache.org/maven2/org/antlr/antlr4-runtime/4.5.3/antlr4-runtime-4.5.3.pom
[linux-jdk10-m3.5.x_build] [INFO] Downloaded from central: https://repo.maven.apache.org/maven2/org/antlr/antlr4-runtime/4.5.3/antlr4-runtime-4.5.3.pom (2.3 kB at 144 kB/s)
[linux-jdk10-m3.5.x_build] [INFO] Downloading from central: https://repo.maven.apache.org/maven2/org/antlr/antlr4-master/4.5.3/antlr4-master-4.5.3.pom
[linux-jdk10-m3.5.x_build] [INFO] Downloaded from central: https://repo.maven.apache.org/maven2/org/antlr/antlr4-master/4.5.3/antlr4-master-4.5.3.pom (3.7 kB at 230 kB/s)
[linux-jdk10-m3.5.x_build] [INFO] Downloading from central: https://repo.maven.apache.org/maven2/commons-beanutils/commons-beanutils/1.9.2/commons-beanutils-1.9.2.pom
[linux-jdk10-m3.5.x_build] [INFO] Downloaded from central: https://repo.maven.apache.org/maven2/commons-beanutils/commons-beanutils/1.9.2/commons-beanutils-1.9.2.pom (14 kB at 1.0 MB/s)
[linux-jdk10-m3.5.x_build] [INFO] Downloading from central: https://repo.maven.apache.org/maven2/org/apache/commons/commons-parent/33/commons-parent-33.pom
[linux-jdk10-m3.5.x_build] [INFO] Downloaded from central: https://repo.maven.apache.org/maven2/org/apache/commons/commons-parent/33/commons-parent-33.pom (53 kB at 2.2 MB/s)
[linux-jdk10-m3.5.x_build] [INFO] Downloading from central: https://repo.maven.apache.org/maven2/commons-cli/commons-cli/1.3.1/commons-cli-1.3.1.pom
[linux-jdk10-m3.5.x_build] [INFO] Downloaded from central: https://repo.maven.apache.org/maven2/commons-cli/commons-cli/1.3.1/commons-cli-1.3.1.pom (10 kB at 577 kB/s)
[linux-jdk10-m3.5.x_build] [INFO] Downloading from central: https://repo.maven.apache.org/maven2/com/google/guava/guava/19.0/guava-19.0.pom
[linux-jdk10-m3.5.x_build] [INFO] Downloaded from central: https://repo.maven.apache.org/maven2/com/google/guava/guava/19.0/guava-19.0.pom (6.8 kB at 400 kB/s)
[linux-jdk10-m3.5.x_build] [INFO] Downloading from central: https://repo.maven.apache.org/maven2/com/google/guava/guava-parent/19.0/guava-parent-19.0.pom
[linux-jdk10-m3.5.x_build] [INFO] Downloaded from central: https://repo.maven.apache.org/maven2/com/google/guava/guava-parent/19.0/guava-parent-19.0.pom (9.9 kB at 549 kB/s)
[linux-jdk10-m3.5.x_build] [INFO] Downloading from central: https://repo.maven.apache.org/maven2/org/sonatype/oss/oss-parent/7/oss-parent-7.pom
[linux-jdk10-m3.5.x_build] [INFO] Downloaded from central: https://repo.maven.apache.org/maven2/org/sonatype/oss/oss-parent/7/oss-parent-7.pom (4.8 kB at 302 kB/s)
[linux-jdk10-m3.5.x_build] [INFO] Downloading from central: https://repo.maven.apache.org/maven2/javax/xml/bind/jaxb-api/2.3.0/jaxb-api-2.3.0.pom
[linux-jdk10-m3.5.x_build] [INFO] Downloaded from central: https://repo.maven.apache.org/maven2/javax/xml/bind/jaxb-api/2.3.0/jaxb-api-2.3.0.pom (23 kB at 1.4 MB/s)
[linux-jdk10-m3.5.x_build] [INFO] Downloading from central: https://repo.maven.apache.org/maven2/javax/xml/bind/jaxb-api-parent/2.3.0/jaxb-api-parent-2.3.0.pom
[linux-jdk10-m3.5.x_build] [INFO] Downloaded from central: https://repo.maven.apache.org/maven2/javax/xml/bind/jaxb-api-parent/2.3.0/jaxb-api-parent-2.3.0.pom (5.6 kB at 434 kB/s)
[linux-jdk10-m3.5.x_build] [INFO] Downloading from central: https://repo.maven.apache.org/maven2/net/java/jvnet-parent/5/jvnet-parent-5.pom
[linux-jdk10-m3.5.x_build] [INFO] Downloaded from central: https://repo.maven.apache.org/maven2/net/java/jvnet-parent/5/jvnet-parent-5.pom (8.9 kB at 633 kB/s)
[linux-jdk10-m3.5.x_build] [INFO] Downloading from central: https://repo.maven.apache.org/maven2/org/apache/maven/shared/maven-shared-resources/2/maven-shared-resources-2.jar
[linux-jdk10-m3.5.x_build] [INFO] Downloading from central: https://repo.maven.apache.org/maven2/org/apache/maven/doxia/doxia-core/1.2/doxia-core-1.2.jar
[linux-jdk10-m3.5.x_build] [INFO] Downloading from central: https://repo.maven.apache.org/maven2/commons-digester/commons-digester/1.6/commons-digester-1.6.jar
[linux-jdk10-m3.5.x_build] [INFO] Downloading from central: https://repo.maven.apache.org/maven2/commons-logging/commons-logging/1.0.4/commons-logging-1.0.4.jar
[linux-jdk10-m3.5.x_build] [INFO] Downloading from central: https://repo.maven.apache.org/maven2/org/apache/maven/doxia/doxia-integration-tools/1.6/doxia-integration-tools-1.6.jar
[linux-jdk10-m3.5.x_build] [INFO] Downloaded from central: https://repo.maven.apache.org/maven2/org/apache/maven/shared/maven-shared-resources/2/maven-shared-resources-2.jar (13 kB at 933 kB/s)
[linux-jdk10-m3.5.x_build] [INFO] Downloading from central: https://repo.maven.apache.org/maven2/commons-io/commons-io/1.4/commons-io-1.4.jar
[linux-jdk10-m3.5.x_build] [INFO] Downloaded from central: https://repo.maven.apache.org/maven2/org/apache/maven/doxia/doxia-integration-tools/1.6/doxia-integration-tools-1.6.jar (45 kB at 2.3 MB/s)
[linux-jdk10-m3.5.x_build] [INFO] Downloading from central: https://repo.maven.apache.org/maven2/org/codehaus/plexus/plexus-resources/1.1.0/plexus-resources-1.1.0.jar
[linux-jdk10-m3.5.x_build] [INFO] Downloaded from central: https://repo.maven.apache.org/maven2/commons-logging/commons-logging/1.0.4/commons-logging-1.0.4.jar (38 kB at 1.9 MB/s)
[linux-jdk10-m3.5.x_build] [INFO] Downloading from central: https://repo.maven.apache.org/maven2/com/puppycrawl/tools/checkstyle/6.18/checkstyle-6.18.jar
[linux-jdk10-m3.5.x_build] [INFO] Downloaded from central: https://repo.maven.apache.org/maven2/org/apache/maven/doxia/doxia-core/1.2/doxia-core-1.2.jar (154 kB at 6.7 MB/s)
[linux-jdk10-m3.5.x_build] [INFO] Downloading from central: https://repo.maven.apache.org/maven2/antlr/antlr/2.7.7/antlr-2.7.7.jar
[linux-jdk10-m3.5.x_build] [INFO] Downloaded from central: https://repo.maven.apache.org/maven2/commons-digester/commons-digester/1.6/commons-digester-1.6.jar (168 kB at 7.3 MB/s)
[linux-jdk10-m3.5.x_build] [INFO] Downloading from central: https://repo.maven.apache.org/maven2/org/antlr/antlr4-runtime/4.5.3/antlr4-runtime-4.5.3.jar
[linux-jdk10-m3.5.x_build] [INFO] Downloaded from central: https://repo.maven.apache.org/maven2/commons-io/commons-io/1.4/commons-io-1.4.jar (109 kB at 4.0 MB/s)
[linux-jdk10-m3.5.x_build] [INFO] Downloading from central: https://repo.maven.apache.org/maven2/commons-beanutils/commons-beanutils/1.9.2/commons-beanutils-1.9.2.jar
[linux-jdk10-m3.5.x_build] [INFO] Downloaded from central: https://repo.maven.apache.org/maven2/org/codehaus/plexus/plexus-resources/1.1.0/plexus-resources-1.1.0.jar (23 kB at 516 kB/s)
[linux-jdk10-m3.5.x_build] [INFO] Downloading from central: https://repo.maven.apache.org/maven2/commons-cli/commons-cli/1.3.1/commons-cli-1.3.1.jar
[linux-jdk10-m3.5.x_build] [INFO] Downloaded from central: https://repo.maven.apache.org/maven2/commons-beanutils/commons-beanutils/1.9.2/commons-beanutils-1.9.2.jar (234 kB at 4.3 MB/s)
[linux-jdk10-m3.5.x_build] [INFO] Downloading from central: https://repo.maven.apache.org/maven2/com/google/guava/guava/19.0/guava-19.0.jar
[linux-jdk10-m3.5.x_build] [INFO] Downloaded from central: https://repo.maven.apache.org/maven2/antlr/antlr/2.7.7/antlr-2.7.7.jar (445 kB at 8.0 MB/s)
[linux-jdk10-m3.5.x_build] [INFO] Downloaded from central: https://repo.maven.apache.org/maven2/org/antlr/antlr4-runtime/4.5.3/antlr4-runtime-4.5.3.jar (302 kB at 5.4 MB/s)
[linux-jdk10-m3.5.x_build] [INFO] Downloading from central: https://repo.maven.apache.org/maven2/commons-lang/commons-lang/2.1/commons-lang-2.1.jar
[linux-jdk10-m3.5.x_build] [INFO] Downloading from central: https://repo.maven.apache.org/maven2/javax/xml/bind/jaxb-api/2.3.0/jaxb-api-2.3.0.jar
[linux-jdk10-m3.5.x_build] [INFO] Downloaded from central: https://repo.maven.apache.org/maven2/commons-cli/commons-cli/1.3.1/commons-cli-1.3.1.jar (53 kB at 898 kB/s)
[linux-jdk10-m3.5.x_build] [INFO] Downloaded from central: https://repo.maven.apache.org/maven2/com/puppycrawl/tools/checkstyle/6.18/checkstyle-6.18.jar (1.2 MB at 17 MB/s)
[linux-jdk10-m3.5.x_build] [INFO] Downloaded from central: https://repo.maven.apache.org/maven2/commons-lang/commons-lang/2.1/commons-lang-2.1.jar (208 kB at 2.7 MB/s)
[linux-jdk10-m3.5.x_build] [INFO] Downloaded from central: https://repo.maven.apache.org/maven2/javax/xml/bind/jaxb-api/2.3.0/jaxb-api-2.3.0.jar (126 kB at 1.6 MB/s)
[linux-jdk10-m3.5.x_build] [INFO] Downloaded from central: https://repo.maven.apache.org/maven2/com/google/guava/guava/19.0/guava-19.0.jar (2.3 MB at 9.5 MB/s)
[linux-jdk10-m3.5.x_build] [INFO] There is 1 error reported by Checkstyle 6.18 with config/maven_checks.xml ruleset.
[linux-jdk10-m3.5.x_build] [INFO] Ignored 1 error, 0 violation remaining.
[linux-jdk10-m3.5.x_build] [INFO] 
[linux-jdk10-m3.5.x_build] [INFO] --- maven-invoker-plugin:3.1.0:verify (integration-test) @ maven-deploy-plugin ---
[linux-jdk10-m3.5.x_build] [INFO] -------------------------------------------------
[linux-jdk10-m3.5.x_build] [INFO] Build Summary:
[linux-jdk10-m3.5.x_build] [INFO]   Passed: 29, Failed: 2, Errors: 0, Skipped: 0
[linux-jdk10-m3.5.x_build] [INFO] -------------------------------------------------
[linux-jdk10-m3.5.x_build] [ERROR] The following builds failed:
[linux-jdk10-m3.5.x_build] [ERROR] *  attach-jar-checksum-snapshot/pom.xml
[linux-jdk10-m3.5.x_build] [ERROR] *  attach-jar-checksum-release/pom.xml
[linux-jdk10-m3.5.x_build] [INFO] -------------------------------------------------
[linux-jdk10-m3.5.x_build] [INFO] ------------------------------------------------------------------------
[linux-jdk10-m3.5.x_build] [INFO] BUILD FAILURE
[linux-jdk10-m3.5.x_build] [INFO] ------------------------------------------------------------------------
[linux-jdk10-m3.5.x_build] [INFO] Total time: 03:37 min
[linux-jdk10-m3.5.x_build] [INFO] Finished at: 2018-08-07T20:07:52Z
[linux-jdk10-m3.5.x_build] [INFO] Final Memory: 49M/256M
[linux-jdk10-m3.5.x_build] [INFO] ------------------------------------------------------------------------
[linux-jdk10-m3.5.x_build] [INFO] [jenkins-event-spy] Generated /home/jenkins/jenkins-slave/workspace/n-deploy-plugin_MSHARED-695-QKWZBEISZCJZBLERRKRCUKWJHH6YND5Z2N2RRA7VKODZB77LKVRQ@tmp/withMaven293ca87b/maven-spy-20180807-200414-54416013252521057994072.log
[linux-jdk10-m3.5.x_build] [ERROR] Failed to execute goal org.apache.maven.plugins:maven-invoker-plugin:3.1.0:verify (integration-test) on project maven-deploy-plugin: 2 builds failed. See console output above for details. -> [Help 1]
[linux-jdk10-m3.5.x_build] [ERROR] 
[linux-jdk10-m3.5.x_build] [ERROR] To see the full stack trace of the errors, re-run Maven with the -e switch.
[linux-jdk10-m3.5.x_build] [ERROR] Re-run Maven using the -X switch to enable full debug logging.
[linux-jdk10-m3.5.x_build] [ERROR] 
[linux-jdk10-m3.5.x_build] [ERROR] For more information about the errors and possible solutions, please read the following articles:
[linux-jdk10-m3.5.x_build] [ERROR] [Help 1] http://cwiki.apache.org/confluence/display/MAVEN/MojoFailureException
[Pipeline] [linux-jdk10-m3.5.x_build] }
[Pipeline] [linux-jdk10-m3.5.x_build] // dir
[Pipeline] [linux-jdk10-m3.5.x_build] }
[linux-jdk10-m3.5.x_build] [withMaven] invokerPublisher - Archive invoker results for Maven artifact MavenArtifact{org.apache.maven.plugins:maven-deploy-plugin::3.0.0-SNAPSHOT(version: 3.0.0-SNAPSHOT, snapshot:false) } generated by PluginInvocation{org.apache.maven.plugins:maven-invoker-plugin:3.1.0@integration-test  integration-test}: linux-jdk10-m3.5.x_build/target/invoker-reports/*.xml
[linux-jdk10-m3.5.x_build] performing MavenInvokerRecorder, reportsFilenamePattern:'**/linux-jdk10-m3.5.x_build/target/invoker-reports/BUILD*.xml', invokerBuildDir:'**/linux-jdk10-m3.5.x_build/target/it'
[linux-jdk10-m3.5.x_build] Found reports:[/home/jenkins/jenkins-slave/workspace/n-deploy-plugin_MSHARED-695-QKWZBEISZCJZBLERRKRCUKWJHH6YND5Z2N2RRA7VKODZB77LKVRQ/linux-jdk10-m3.5.x_build/target/invoker-reports/BUILD-3rd-party-jar-with-extras.xml, /home/jenkins/jenkins-slave/workspace/n-deploy-plugin_MSHARED-695-QKWZBEISZCJZBLERRKRCUKWJHH6YND5Z2N2RRA7VKODZB77LKVRQ/linux-jdk10-m3.5.x_build/target/invoker-reports/BUILD-3rd-party-jar-without-pom.xml, /home/jenkins/jenkins-slave/workspace/n-deploy-plugin_MSHARED-695-QKWZBEISZCJZBLERRKRCUKWJHH6YND5Z2N2RRA7VKODZB77LKVRQ/linux-jdk10-m3.5.x_build/target/invoker-reports/BUILD-3rd-party-pom-with-extras.xml, /home/jenkins/jenkins-slave/workspace/n-deploy-plugin_MSHARED-695-QKWZBEISZCJZBLERRKRCUKWJHH6YND5Z2N2RRA7VKODZB77LKVRQ/linux-jdk10-m3.5.x_build/target/invoker-reports/BUILD-MDEPLOY-169_deploy-at-end-multithread.xml, /home/jenkins/jenkins-slave/workspace/n-deploy-plugin_MSHARED-695-QKWZBEISZCJZBLERRKRCUKWJHH6YND5Z2N2RRA7VKODZB77LKVRQ/linux-jdk10-m3.5.x_build/target/invoker-reports/BUILD-MDEPLOY-170_deploy-at-end-configperproject.xml, /home/jenkins/jenkins-slave/workspace/n-deploy-plugin_MSHARED-695-QKWZBEISZCJZBLERRKRCUKWJHH6YND5Z2N2RRA7VKODZB77LKVRQ/linux-jdk10-m3.5.x_build/target/invoker-reports/BUILD-MDEPLOY-178_deployfile-with-embedded-pom.xml, /home/jenkins/jenkins-slave/workspace/n-deploy-plugin_MSHARED-695-QKWZBEISZCJZBLERRKRCUKWJHH6YND5Z2N2RRA7VKODZB77LKVRQ/linux-jdk10-m3.5.x_build/target/invoker-reports/BUILD-MDEPLOY-202_deployfile-with-multiple-executions.xml, /home/jenkins/jenkins-slave/workspace/n-deploy-plugin_MSHARED-695-QKWZBEISZCJZBLERRKRCUKWJHH6YND5Z2N2RRA7VKODZB77LKVRQ/linux-jdk10-m3.5.x_build/target/invoker-reports/BUILD-MDEPLOY-212.xml, /home/jenkins/jenkins-slave/workspace/n-deploy-plugin_MSHARED-695-QKWZBEISZCJZBLERRKRCUKWJHH6YND5Z2N2RRA7VKODZB77LKVRQ/linux-jdk10-m3.5.x_build/target/invoker-reports/BUILD-MDEPLOY-213.xml, /home/jenkins/jenkins-slave/workspace/n-deploy-plugin_MSHARED-695-QKWZBEISZCJZBLERRKRCUKWJHH6YND5Z2N2RRA7VKODZB77LKVRQ/linux-jdk10-m3.5.x_build/target/invoker-reports/BUILD-alt-deploy-repo-with-dist-mgmt-snapshot.xml, /home/jenkins/jenkins-slave/workspace/n-deploy-plugin_MSHARED-695-QKWZBEISZCJZBLERRKRCUKWJHH6YND5Z2N2RRA7VKODZB77LKVRQ/linux-jdk10-m3.5.x_build/target/invoker-reports/BUILD-alt-deploy-repo-with-dist-mgmt.xml, /home/jenkins/jenkins-slave/workspace/n-deploy-plugin_MSHARED-695-QKWZBEISZCJZBLERRKRCUKWJHH6YND5Z2N2RRA7VKODZB77LKVRQ/linux-jdk10-m3.5.x_build/target/invoker-reports/BUILD-alt-deploy-repo-without-dist-mgmt.xml, /home/jenkins/jenkins-slave/workspace/n-deploy-plugin_MSHARED-695-QKWZBEISZCJZBLERRKRCUKWJHH6YND5Z2N2RRA7VKODZB77LKVRQ/linux-jdk10-m3.5.x_build/target/invoker-reports/BUILD-attach-jar-checksum-release.xml, /home/jenkins/jenkins-slave/workspace/n-deploy-plugin_MSHARED-695-QKWZBEISZCJZBLERRKRCUKWJHH6YND5Z2N2RRA7VKODZB77LKVRQ/linux-jdk10-m3.5.x_build/target/invoker-reports/BUILD-attach-jar-checksum-snapshot.xml, /home/jenkins/jenkins-slave/workspace/n-deploy-plugin_MSHARED-695-QKWZBEISZCJZBLERRKRCUKWJHH6YND5Z2N2RRA7VKODZB77LKVRQ/linux-jdk10-m3.5.x_build/target/invoker-reports/BUILD-attach-release-jar.xml, /home/jenkins/jenkins-slave/workspace/n-deploy-plugin_MSHARED-695-QKWZBEISZCJZBLERRKRCUKWJHH6YND5Z2N2RRA7VKODZB77LKVRQ/linux-jdk10-m3.5.x_build/target/invoker-reports/BUILD-deploy-at-end-fail.xml, /home/jenkins/jenkins-slave/workspace/n-deploy-plugin_MSHARED-695-QKWZBEISZCJZBLERRKRCUKWJHH6YND5Z2N2RRA7VKODZB77LKVRQ/linux-jdk10-m3.5.x_build/target/invoker-reports/BUILD-deploy-at-end-pass.xml, /home/jenkins/jenkins-slave/workspace/n-deploy-plugin_MSHARED-695-QKWZBEISZCJZBLERRKRCUKWJHH6YND5Z2N2RRA7VKODZB77LKVRQ/linux-jdk10-m3.5.x_build/target/invoker-reports/BUILD-deploy-attached-sources.xml, /home/jenkins/jenkins-slave/workspace/n-deploy-plugin_MSHARED-695-QKWZBEISZCJZBLERRKRCUKWJHH6YND5Z2N2RRA7VKODZB77LKVRQ/linux-jdk10-m3.5.x_build/target/invoker-reports/BUILD-deploy-default-packaging.xml, /home/jenkins/jenkins-slave/workspace/n-deploy-plugin_MSHARED-695-QKWZBEISZCJZBLERRKRCUKWJHH6YND5Z2N2RRA7VKODZB77LKVRQ/linux-jdk10-m3.5.x_build/target/invoker-reports/BUILD-external-release-jar.xml, /home/jenkins/jenkins-slave/workspace/n-deploy-plugin_MSHARED-695-QKWZBEISZCJZBLERRKRCUKWJHH6YND5Z2N2RRA7VKODZB77LKVRQ/linux-jdk10-m3.5.x_build/target/invoker-reports/BUILD-gav-validation.xml, /home/jenkins/jenkins-slave/workspace/n-deploy-plugin_MSHARED-695-QKWZBEISZCJZBLERRKRCUKWJHH6YND5Z2N2RRA7VKODZB77LKVRQ/linux-jdk10-m3.5.x_build/target/invoker-reports/BUILD-mdeploy-45-test.xml, /home/jenkins/jenkins-slave/workspace/n-deploy-plugin_MSHARED-695-QKWZBEISZCJZBLERRKRCUKWJHH6YND5Z2N2RRA7VKODZB77LKVRQ/linux-jdk10-m3.5.x_build/target/invoker-reports/BUILD-no-main-artifact-1.xml, /home/jenkins/jenkins-slave/workspace/n-deploy-plugin_MSHARED-695-QKWZBEISZCJZBLERRKRCUKWJHH6YND5Z2N2RRA7VKODZB77LKVRQ/linux-jdk10-m3.5.x_build/target/invoker-reports/BUILD-no-main-artifact-2.xml, /home/jenkins/jenkins-slave/workspace/n-deploy-plugin_MSHARED-695-QKWZBEISZCJZBLERRKRCUKWJHH6YND5Z2N2RRA7VKODZB77LKVRQ/linux-jdk10-m3.5.x_build/target/invoker-reports/BUILD-no-main-artifact-snapshot.xml, /home/jenkins/jenkins-slave/workspace/n-deploy-plugin_MSHARED-695-QKWZBEISZCJZBLERRKRCUKWJHH6YND5Z2N2RRA7VKODZB77LKVRQ/linux-jdk10-m3.5.x_build/target/invoker-reports/BUILD-offline.xml, /home/jenkins/jenkins-slave/workspace/n-deploy-plugin_MSHARED-695-QKWZBEISZCJZBLERRKRCUKWJHH6YND5Z2N2RRA7VKODZB77LKVRQ/linux-jdk10-m3.5.x_build/target/invoker-reports/BUILD-release-jar.xml, /home/jenkins/jenkins-slave/workspace/n-deploy-plugin_MSHARED-695-QKWZBEISZCJZBLERRKRCUKWJHH6YND5Z2N2RRA7VKODZB77LKVRQ/linux-jdk10-m3.5.x_build/target/invoker-reports/BUILD-release-pom.xml, /home/jenkins/jenkins-slave/workspace/n-deploy-plugin_MSHARED-695-QKWZBEISZCJZBLERRKRCUKWJHH6YND5Z2N2RRA7VKODZB77LKVRQ/linux-jdk10-m3.5.x_build/target/invoker-reports/BUILD-skip.xml, /home/jenkins/jenkins-slave/workspace/n-deploy-plugin_MSHARED-695-QKWZBEISZCJZBLERRKRCUKWJHH6YND5Z2N2RRA7VKODZB77LKVRQ/linux-jdk10-m3.5.x_build/target/invoker-reports/BUILD-snapshot-jar.xml, /home/jenkins/jenkins-slave/workspace/n-deploy-plugin_MSHARED-695-QKWZBEISZCJZBLERRKRCUKWJHH6YND5Z2N2RRA7VKODZB77LKVRQ/linux-jdk10-m3.5.x_build/target/invoker-reports/BUILD-snapshot-pom.xml]
[linux-jdk10-m3.5.x_build] Found logs:[/home/jenkins/jenkins-slave/workspace/n-deploy-plugin_MSHARED-695-QKWZBEISZCJZBLERRKRCUKWJHH6YND5Z2N2RRA7VKODZB77LKVRQ/linux-jdk10-m3.5.x_build/target/it/3rd-party-jar-with-extras/build.log, /home/jenkins/jenkins-slave/workspace/n-deploy-plugin_MSHARED-695-QKWZBEISZCJZBLERRKRCUKWJHH6YND5Z2N2RRA7VKODZB77LKVRQ/linux-jdk10-m3.5.x_build/target/it/3rd-party-jar-without-pom/build.log, /home/jenkins/jenkins-slave/workspace/n-deploy-plugin_MSHARED-695-QKWZBEISZCJZBLERRKRCUKWJHH6YND5Z2N2RRA7VKODZB77LKVRQ/linux-jdk10-m3.5.x_build/target/it/3rd-party-pom-with-extras/build.log, /home/jenkins/jenkins-slave/workspace/n-deploy-plugin_MSHARED-695-QKWZBEISZCJZBLERRKRCUKWJHH6YND5Z2N2RRA7VKODZB77LKVRQ/linux-jdk10-m3.5.x_build/target/it/MDEPLOY-169_deploy-at-end-multithread/build.log, /home/jenkins/jenkins-slave/workspace/n-deploy-plugin_MSHARED-695-QKWZBEISZCJZBLERRKRCUKWJHH6YND5Z2N2RRA7VKODZB77LKVRQ/linux-jdk10-m3.5.x_build/target/it/MDEPLOY-170_deploy-at-end-configperproject/build.log, /home/jenkins/jenkins-slave/workspace/n-deploy-plugin_MSHARED-695-QKWZBEISZCJZBLERRKRCUKWJHH6YND5Z2N2RRA7VKODZB77LKVRQ/linux-jdk10-m3.5.x_build/target/it/MDEPLOY-178_deployfile-with-embedded-pom/build.log, /home/jenkins/jenkins-slave/workspace/n-deploy-plugin_MSHARED-695-QKWZBEISZCJZBLERRKRCUKWJHH6YND5Z2N2RRA7VKODZB77LKVRQ/linux-jdk10-m3.5.x_build/target/it/MDEPLOY-202_deployfile-with-multiple-executions/build.log, /home/jenkins/jenkins-slave/workspace/n-deploy-plugin_MSHARED-695-QKWZBEISZCJZBLERRKRCUKWJHH6YND5Z2N2RRA7VKODZB77LKVRQ/linux-jdk10-m3.5.x_build/target/it/MDEPLOY-212/build.log, /home/jenkins/jenkins-slave/workspace/n-deploy-plugin_MSHARED-695-QKWZBEISZCJZBLERRKRCUKWJHH6YND5Z2N2RRA7VKODZB77LKVRQ/linux-jdk10-m3.5.x_build/target/it/MDEPLOY-213/build.log, /home/jenkins/jenkins-slave/workspace/n-deploy-plugin_MSHARED-695-QKWZBEISZCJZBLERRKRCUKWJHH6YND5Z2N2RRA7VKODZB77LKVRQ/linux-jdk10-m3.5.x_build/target/it/alt-deploy-repo-with-dist-mgmt-snapshot/build.log, /home/jenkins/jenkins-slave/workspace/n-deploy-plugin_MSHARED-695-QKWZBEISZCJZBLERRKRCUKWJHH6YND5Z2N2RRA7VKODZB77LKVRQ/linux-jdk10-m3.5.x_build/target/it/alt-deploy-repo-with-dist-mgmt/build.log, /home/jenkins/jenkins-slave/workspace/n-deploy-plugin_MSHARED-695-QKWZBEISZCJZBLERRKRCUKWJHH6YND5Z2N2RRA7VKODZB77LKVRQ/linux-jdk10-m3.5.x_build/target/it/alt-deploy-repo-without-dist-mgmt/build.log, /home/jenkins/jenkins-slave/workspace/n-deploy-plugin_MSHARED-695-QKWZBEISZCJZBLERRKRCUKWJHH6YND5Z2N2RRA7VKODZB77LKVRQ/linux-jdk10-m3.5.x_build/target/it/attach-jar-checksum-release/build.log, /home/jenkins/jenkins-slave/workspace/n-deploy-plugin_MSHARED-695-QKWZBEISZCJZBLERRKRCUKWJHH6YND5Z2N2RRA7VKODZB77LKVRQ/linux-jdk10-m3.5.x_build/target/it/attach-jar-checksum-snapshot/build.log, /home/jenkins/jenkins-slave/workspace/n-deploy-plugin_MSHARED-695-QKWZBEISZCJZBLERRKRCUKWJHH6YND5Z2N2RRA7VKODZB77LKVRQ/linux-jdk10-m3.5.x_build/target/it/attach-release-jar/build.log, /home/jenkins/jenkins-slave/workspace/n-deploy-plugin_MSHARED-695-QKWZBEISZCJZBLERRKRCUKWJHH6YND5Z2N2RRA7VKODZB77LKVRQ/linux-jdk10-m3.5.x_build/target/it/deploy-at-end-fail/build.log, /home/jenkins/jenkins-slave/workspace/n-deploy-plugin_MSHARED-695-QKWZBEISZCJZBLERRKRCUKWJHH6YND5Z2N2RRA7VKODZB77LKVRQ/linux-jdk10-m3.5.x_build/target/it/deploy-at-end-pass/build.log, /home/jenkins/jenkins-slave/workspace/n-deploy-plugin_MSHARED-695-QKWZBEISZCJZBLERRKRCUKWJHH6YND5Z2N2RRA7VKODZB77LKVRQ/linux-jdk10-m3.5.x_build/target/it/deploy-attached-sources/build.log, /home/jenkins/jenkins-slave/workspace/n-deploy-plugin_MSHARED-695-QKWZBEISZCJZBLERRKRCUKWJHH6YND5Z2N2RRA7VKODZB77LKVRQ/linux-jdk10-m3.5.x_build/target/it/deploy-default-packaging/build.log, /home/jenkins/jenkins-slave/workspace/n-deploy-plugin_MSHARED-695-QKWZBEISZCJZBLERRKRCUKWJHH6YND5Z2N2RRA7VKODZB77LKVRQ/linux-jdk10-m3.5.x_build/target/it/external-release-jar/build.log, /home/jenkins/jenkins-slave/workspace/n-deploy-plugin_MSHARED-695-QKWZBEISZCJZBLERRKRCUKWJHH6YND5Z2N2RRA7VKODZB77LKVRQ/linux-jdk10-m3.5.x_build/target/it/gav-validation/build.log, /home/jenkins/jenkins-slave/workspace/n-deploy-plugin_MSHARED-695-QKWZBEISZCJZBLERRKRCUKWJHH6YND5Z2N2RRA7VKODZB77LKVRQ/linux-jdk10-m3.5.x_build/target/it/mdeploy-45-test/build.log, /home/jenkins/jenkins-slave/workspace/n-deploy-plugin_MSHARED-695-QKWZBEISZCJZBLERRKRCUKWJHH6YND5Z2N2RRA7VKODZB77LKVRQ/linux-jdk10-m3.5.x_build/target/it/no-main-artifact-1/build.log, /home/jenkins/jenkins-slave/workspace/n-deploy-plugin_MSHARED-695-QKWZBEISZCJZBLERRKRCUKWJHH6YND5Z2N2RRA7VKODZB77LKVRQ/linux-jdk10-m3.5.x_build/target/it/no-main-artifact-2/build.log, /home/jenkins/jenkins-slave/workspace/n-deploy-plugin_MSHARED-695-QKWZBEISZCJZBLERRKRCUKWJHH6YND5Z2N2RRA7VKODZB77LKVRQ/linux-jdk10-m3.5.x_build/target/it/no-main-artifact-snapshot/build.log, /home/jenkins/jenkins-slave/workspace/n-deploy-plugin_MSHARED-695-QKWZBEISZCJZBLERRKRCUKWJHH6YND5Z2N2RRA7VKODZB77LKVRQ/linux-jdk10-m3.5.x_build/target/it/offline/build.log, /home/jenkins/jenkins-slave/workspace/n-deploy-plugin_MSHARED-695-QKWZBEISZCJZBLERRKRCUKWJHH6YND5Z2N2RRA7VKODZB77LKVRQ/linux-jdk10-m3.5.x_build/target/it/release-jar/build.log, /home/jenkins/jenkins-slave/workspace/n-deploy-plugin_MSHARED-695-QKWZBEISZCJZBLERRKRCUKWJHH6YND5Z2N2RRA7VKODZB77LKVRQ/linux-jdk10-m3.5.x_build/target/it/release-pom/build.log, /home/jenkins/jenkins-slave/workspace/n-deploy-plugin_MSHARED-695-QKWZBEISZCJZBLERRKRCUKWJHH6YND5Z2N2RRA7VKODZB77LKVRQ/linux-jdk10-m3.5.x_build/target/it/skip/build.log, /home/jenkins/jenkins-slave/workspace/n-deploy-plugin_MSHARED-695-QKWZBEISZCJZBLERRKRCUKWJHH6YND5Z2N2RRA7VKODZB77LKVRQ/linux-jdk10-m3.5.x_build/target/it/snapshot-jar/build.log, /home/jenkins/jenkins-slave/workspace/n-deploy-plugin_MSHARED-695-QKWZBEISZCJZBLERRKRCUKWJHH6YND5Z2N2RRA7VKODZB77LKVRQ/linux-jdk10-m3.5.x_build/target/it/snapshot-pom/build.log]
[linux-jdk10-m3.5.x_build] Finished parsing Maven Invoker results (found 31)
[linux-jdk10-m3.5.x_build] [withMaven] junitPublisher - Archive test results for Maven artifact org.apache.maven.plugins:maven-deploy-plugin:3.0.0-SNAPSHOT generated by maven-surefire-plugin:test (default-test): linux-jdk10-m3.5.x_build/target/surefire-reports/*.xml
[linux-jdk10-m3.5.x_build] Recording test results
[linux-jdk10-m3.5.x_build] [withMaven] openTasksPublisher - Scan Tasks for Maven artifact org.apache.maven.plugins:maven-deploy-plugin:3.0.0-SNAPSHOT in source directory linux-jdk10-m3.5.x_build/src/main/java
[linux-jdk10-m3.5.x_build] [TASKS] Scanning folder '/home/jenkins/jenkins-slave/workspace/n-deploy-plugin_MSHARED-695-QKWZBEISZCJZBLERRKRCUKWJHH6YND5Z2N2RRA7VKODZB77LKVRQ' for files matching the pattern 'linux-jdk10-m3.5.x_build/src/main/java/**/*' - excludes: null
[linux-jdk10-m3.5.x_build] [TASKS] Found 3 files to scan for tasks
[linux-jdk10-m3.5.x_build] [TASKS] Found 0 open tasks.
[linux-jdk10-m3.5.x_build] Skipping warnings blame since pipelines do not have an SCM link.%n
[linux-jdk10-m3.5.x_build] [TASKS] Computing warning deltas based on reference build #18
[Pipeline] [linux-jdk10-m3.5.x_build] // withMaven
[Pipeline] [linux-jdk10-m3.5.x_build] cleanWs
[linux-jdk10-m3.5.x_build] [WS-CLEANUP] Deleting project workspace...[WS-CLEANUP] done
[Pipeline] [linux-jdk10-m3.5.x_build] cleanWs
[linux-jdk10-m3.5.x_build] [WS-CLEANUP] Deleting project workspace...[WS-CLEANUP] done
[Pipeline] [linux-jdk10-m3.5.x_build] }
[Pipeline] [linux-jdk10-m3.5.x_build] // stage
[Pipeline] [linux-jdk10-m3.5.x_build] }
[Pipeline] [linux-jdk10-m3.5.x_build] // node
[Pipeline] [linux-jdk10-m3.5.x_build] }
[linux-jdk10-m3.5.x_build] Failed in branch linux-jdk10-m3.5.x_build
[Pipeline] // parallel
[Pipeline] stage
[Pipeline] { (Notifications)
[Pipeline] echo
Build result: FAILURE
[Pipeline] jiraIssueSelector
[Pipeline] emailext
Mime
  • Unnamed multipart/mixed (inline, None, 0 bytes)
View raw message