maven-notifications mailing list archives

Site index · List index
Message view « Date » · « Thread »
Top « Date » · « Thread »
From Apache Jenkins Server <jenk...@builds.apache.org>
Subject Build unstable in Jenkins: Maven TLP » maven-enforcer » MENFORCER-294 #9
Date Fri, 17 Aug 2018 05:30:05 GMT
See https://builds.apache.org/job/maven-box/job/maven-enforcer/job/MENFORCER-294/9/

Changes:

* Upgrade latest version of Maven
* [INFRA-16893] set Windows to windows-2016-1 node
* Back to Windows label
* Windows + M3.5.x = M3.5.2
* [INFRA-16893] Trying workaround
* Revert "[INFRA-16893] Trying workaround"
* Try to display PATH value

4 tests failed.
FAILED:  org.apache.maven.plugins.enforcer.TestRequireEnvironmentVariable.testRuleWithRegex

Error Message:
This should not throw an exception

Stack Trace:
junit.framework.AssertionFailedError: This should not throw an exception
	at org.apache.maven.plugins.enforcer.TestRequireEnvironmentVariable.testRuleWithRegex(TestRequireEnvironmentVariable.java:107)


FAILED:  org.apache.maven.plugins.enforcer.TestRequireEnvironmentVariable.testRuleWithRegex

Error Message:
This should not throw an exception

Stack Trace:
junit.framework.AssertionFailedError: This should not throw an exception
	at org.apache.maven.plugins.enforcer.TestRequireEnvironmentVariable.testRuleWithRegex(TestRequireEnvironmentVariable.java:107)


FAILED:  org.apache.maven.plugins.enforcer.TestRequireEnvironmentVariable.testRuleWithRegex

Error Message:
This should not throw an exception

Stack Trace:
junit.framework.AssertionFailedError: This should not throw an exception
	at org.apache.maven.plugins.enforcer.TestRequireEnvironmentVariable.testRuleWithRegex(TestRequireEnvironmentVariable.java:107)


FAILED:  org.apache.maven.plugins.enforcer.TestRequireEnvironmentVariable.testRuleWithRegex

Error Message:
This should not throw an exception

Stack Trace:
junit.framework.AssertionFailedError: This should not throw an exception
	at org.apache.maven.plugins.enforcer.TestRequireEnvironmentVariable.testRuleWithRegex(TestRequireEnvironmentVariable.java:107)




Build log:
[...truncated 3.09 MB...]
[windows-jdk10] [INFO] run post-build script verify.groovy
[windows-jdk10] [INFO]           require-no-repositories_failure_repositories\pom.xml SUCCESS (5.4 s)
[windows-jdk10] [INFO] Building: require-no-repositories_mm\pom.xml
[Pipeline] [windows-jdk7] }
[windows-jdk7] [withMaven] invokerPublisher - Archive invoker results for Maven artifact MavenArtifact{org.apache.maven.plugins:maven-enforcer-plugin::3.0.0-SNAPSHOT(version: 3.0.0-SNAPSHOT, snapshot:false) } generated by PluginInvocation{org.apache.maven.plugins:maven-invoker-plugin:3.0.1@run  integration-test}: m\maven-enforcer-plugin\target\invoker-reports\*.xml
[windows-jdk7] performing MavenInvokerRecorder, reportsFilenamePattern:'**/m\maven-enforcer-plugin\target\invoker-reports/BUILD*.xml', invokerBuildDir:'**/m\maven-enforcer-plugin\target\it'
[windows-jdk7] Found reports:[f:\jenkins\jenkins-slave\workspace\aven-enforcer_MENFORCER-294-IBUS6H5LUW3LLGQ77JNQBEL74UE2BN3AO433QECSA2A76NFISVIQ\m\maven-enforcer-plugin\target\invoker-reports\BUILD-always-fail-warn.xml, f:\jenkins\jenkins-slave\workspace\aven-enforcer_MENFORCER-294-IBUS6H5LUW3LLGQ77JNQBEL74UE2BN3AO433QECSA2A76NFISVIQ\m\maven-enforcer-plugin\target\invoker-reports\BUILD-always-fail.xml, f:\jenkins\jenkins-slave\workspace\aven-enforcer_MENFORCER-294-IBUS6H5LUW3LLGQ77JNQBEL74UE2BN3AO433QECSA2A76NFISVIQ\m\maven-enforcer-plugin\target\invoker-reports\BUILD-always-pass.xml, f:\jenkins\jenkins-slave\workspace\aven-enforcer_MENFORCER-294-IBUS6H5LUW3LLGQ77JNQBEL74UE2BN3AO433QECSA2A76NFISVIQ\m\maven-enforcer-plugin\target\invoker-reports\BUILD-ban-distribution-management-multi-module-build.xml, f:\jenkins\jenkins-slave\workspace\aven-enforcer_MENFORCER-294-IBUS6H5LUW3LLGQ77JNQBEL74UE2BN3AO433QECSA2A76NFISVIQ\m\maven-enforcer-plugin\target\invoker-reports\BUILD-ban-distribution-management-multi-module-except-site.xml, f:\jenkins\jenkins-slave\workspace\aven-enforcer_MENFORCER-294-IBUS6H5LUW3LLGQ77JNQBEL74UE2BN3AO433QECSA2A76NFISVIQ\m\maven-enforcer-plugin\target\invoker-reports\BUILD-ban-distribution-management.xml, f:\jenkins\jenkins-slave\workspace\aven-enforcer_MENFORCER-294-IBUS6H5LUW3LLGQ77JNQBEL74UE2BN3AO433QECSA2A76NFISVIQ\m\maven-enforcer-plugin\target\invoker-reports\BUILD-ban-pom-dependency-version.xml, f:\jenkins\jenkins-slave\workspace\aven-enforcer_MENFORCER-294-IBUS6H5LUW3LLGQ77JNQBEL74UE2BN3AO433QECSA2A76NFISVIQ\m\maven-enforcer-plugin\target\invoker-reports\BUILD-ban-transitive-dependencies-fail.xml, f:\jenkins\jenkins-slave\workspace\aven-enforcer_MENFORCER-294-IBUS6H5LUW3LLGQ77JNQBEL74UE2BN3AO433QECSA2A76NFISVIQ\m\maven-enforcer-plugin\target\invoker-reports\BUILD-ban-transitive-dependencies.xml, f:\jenkins\jenkins-slave\workspace\aven-enforcer_MENFORCER-294-IBUS6H5LUW3LLGQ77JNQBEL74UE2BN3AO433QECSA2A76NFISVIQ\m\maven-enforcer-plugin\target\invoker-reports\BUILD-banned-dependencies-versionrange-fail.xml, f:\jenkins\jenkins-slave\workspace\aven-enforcer_MENFORCER-294-IBUS6H5LUW3LLGQ77JNQBEL74UE2BN3AO433QECSA2A76NFISVIQ\m\maven-enforcer-plugin\target\invoker-reports\BUILD-banned-dependencies-versionrange.xml, f:\jenkins\jenkins-slave\workspace\aven-enforcer_MENFORCER-294-IBUS6H5LUW3LLGQ77JNQBEL74UE2BN3AO433QECSA2A76NFISVIQ\m\maven-enforcer-plugin\target\invoker-reports\BUILD-banned-dependencies-wildcards.xml, f:\jenkins\jenkins-slave\workspace\aven-enforcer_MENFORCER-294-IBUS6H5LUW3LLGQ77JNQBEL74UE2BN3AO433QECSA2A76NFISVIQ\m\maven-enforcer-plugin\target\invoker-reports\BUILD-banned-dependencies.xml, f:\jenkins\jenkins-slave\workspace\aven-enforcer_MENFORCER-294-IBUS6H5LUW3LLGQ77JNQBEL74UE2BN3AO433QECSA2A76NFISVIQ\m\maven-enforcer-plugin\target\invoker-reports\BUILD-banned-plugins.xml, f:\jenkins\jenkins-slave\workspace\aven-enforcer_MENFORCER-294-IBUS6H5LUW3LLGQ77JNQBEL74UE2BN3AO433QECSA2A76NFISVIQ\m\maven-enforcer-plugin\target\invoker-reports\BUILD-builds_a_pom_noop.xml, f:\jenkins\jenkins-slave\workspace\aven-enforcer_MENFORCER-294-IBUS6H5LUW3LLGQ77JNQBEL74UE2BN3AO433QECSA2A76NFISVIQ\m\maven-enforcer-plugin\target\invoker-reports\BUILD-cli-always-fail.xml, f:\jenkins\jenkins-slave\workspace\aven-enforcer_MENFORCER-294-IBUS6H5LUW3LLGQ77JNQBEL74UE2BN3AO433QECSA2A76NFISVIQ\m\maven-enforcer-plugin\target\invoker-reports\BUILD-cli-always-pass.xml, f:\jenkins\jenkins-slave\workspace\aven-enforcer_MENFORCER-294-IBUS6H5LUW3LLGQ77JNQBEL74UE2BN3AO433QECSA2A76NFISVIQ\m\maven-enforcer-plugin\target\invoker-reports\BUILD-dependencies_converge.xml, f:\jenkins\jenkins-slave\workspace\aven-enforcer_MENFORCER-294-IBUS6H5LUW3LLGQ77JNQBEL74UE2BN3AO433QECSA2A76NFISVIQ\m\maven-enforcer-plugin\target\invoker-reports\BUILD-dependencies_not_converging.xml, f:\jenkins\jenkins-slave\workspace\aven-enforcer_MENFORCER-294-IBUS6H5LUW3LLGQ77JNQBEL74UE2BN3AO433QECSA2A76NFISVIQ\m\maven-enforcer-plugin\target\invoker-reports\BUILD-dependencies_not_converging_test_scope.xml, f:\jenkins\jenkins-slave\workspace\aven-enforcer_MENFORCER-294-IBUS6H5LUW3LLGQ77JNQBEL74UE2BN3AO433QECSA2A76NFISVIQ\m\maven-enforcer-plugin\target\invoker-reports\BUILD-display-info.xml, f:\jenkins\jenkins-slave\workspace\aven-enforcer_MENFORCER-294-IBUS6H5LUW3LLGQ77JNQBEL74UE2BN3AO433QECSA2A76NFISVIQ\m\maven-enforcer-plugin\target\invoker-reports\BUILD-evaluate-beanshell.xml, f:\jenkins\jenkins-slave\workspace\aven-enforcer_MENFORCER-294-IBUS6H5LUW3LLGQ77JNQBEL74UE2BN3AO433QECSA2A76NFISVIQ\m\maven-enforcer-plugin\target\invoker-reports\BUILD-multimodule.xml, f:\jenkins\jenkins-slave\workspace\aven-enforcer_MENFORCER-294-IBUS6H5LUW3LLGQ77JNQBEL74UE2BN3AO433QECSA2A76NFISVIQ\m\maven-enforcer-plugin\target\invoker-reports\BUILD-require-active-profile-all.xml, f:\jenkins\jenkins-slave\workspace\aven-enforcer_MENFORCER-294-IBUS6H5LUW3LLGQ77JNQBEL74UE2BN3AO433QECSA2A76NFISVIQ\m\maven-enforcer-plugin\target\invoker-reports\BUILD-require-active-profile-from-settings.xml, f:\jenkins\jenkins-slave\workspace\aven-enforcer_MENFORCER-294-IBUS6H5LUW3LLGQ77JNQBEL74UE2BN3AO433QECSA2A76NFISVIQ\m\maven-enforcer-plugin\target\invoker-reports\BUILD-require-active-profile.xml, f:\jenkins\jenkins-slave\workspace\aven-enforcer_MENFORCER-294-IBUS6H5LUW3LLGQ77JNQBEL74UE2BN3AO433QECSA2A76NFISVIQ\m\maven-enforcer-plugin\target\invoker-reports\BUILD-require-file-checksum.xml, f:\jenkins\jenkins-slave\workspace\aven-enforcer_MENFORCER-294-IBUS6H5LUW3LLGQ77JNQBEL74UE2BN3AO433QECSA2A76NFISVIQ\m\maven-enforcer-plugin\target\invoker-reports\BUILD-require-files-dont-exist.xml, f:\jenkins\jenkins-slave\workspace\aven-enforcer_MENFORCER-294-IBUS6H5LUW3LLGQ77JNQBEL74UE2BN3AO433QECSA2A76NFISVIQ\m\maven-enforcer-plugin\target\invoker-reports\BUILD-require-files-exist.xml, f:\jenkins\jenkins-slave\workspace\aven-enforcer_MENFORCER-294-IBUS6H5LUW3LLGQ77JNQBEL74UE2BN3AO433QECSA2A76NFISVIQ\m\maven-enforcer-plugin\target\invoker-reports\BUILD-require-files-size.xml, f:\jenkins\jenkins-slave\workspace\aven-enforcer_MENFORCER-294-IBUS6H5LUW3LLGQ77JNQBEL74UE2BN3AO433QECSA2A76NFISVIQ\m\maven-enforcer-plugin\target\invoker-reports\BUILD-require-java-version.xml, f:\jenkins\jenkins-slave\workspace\aven-enforcer_MENFORCER-294-IBUS6H5LUW3LLGQ77JNQBEL74UE2BN3AO433QECSA2A76NFISVIQ\m\maven-enforcer-plugin\target\invoker-reports\BUILD-require-maven-version.xml, f:\jenkins\jenkins-slave\workspace\aven-enforcer_MENFORCER-294-IBUS6H5LUW3LLGQ77JNQBEL74UE2BN3AO433QECSA2A76NFISVIQ\m\maven-enforcer-plugin\target\invoker-reports\BUILD-require-no-repositories-allow-plugin-repo.xml, f:\jenkins\jenkins-slave\workspace\aven-enforcer_MENFORCER-294-IBUS6H5LUW3LLGQ77JNQBEL74UE2BN3AO433QECSA2A76NFISVIQ\m\maven-enforcer-plugin\target\invoker-reports\BUILD-require-no-repositories-allow-repo.xml, f:\jenkins\jenkins-slave\workspace\aven-enforcer_MENFORCER-294-IBUS6H5LUW3LLGQ77JNQBEL74UE2BN3AO433QECSA2A76NFISVIQ\m\maven-enforcer-plugin\target\invoker-reports\BUILD-require-no-repositories.xml, f:\jenkins\jenkins-slave\workspace\aven-enforcer_MENFORCER-294-IBUS6H5LUW3LLGQ77JNQBEL74UE2BN3AO433QECSA2A76NFISVIQ\m\maven-enforcer-plugin\target\invoker-reports\BUILD-require-no-repositories_failure.xml, f:\jenkins\jenkins-slave\workspace\aven-enforcer_MENFORCER-294-IBUS6H5LUW3LLGQ77JNQBEL74UE2BN3AO433QECSA2A76NFISVIQ\m\maven-enforcer-plugin\target\invoker-reports\BUILD-require-no-repositories_failure_allowed-plugin-repo.xml, f:\jenkins\jenkins-slave\workspace\aven-enforcer_MENFORCER-294-IBUS6H5LUW3LLGQ77JNQBEL74UE2BN3AO433QECSA2A76NFISVIQ\m\maven-enforcer-plugin\target\invoker-reports\BUILD-require-no-repositories_failure_plugin-repositories.xml, f:\jenkins\jenkins-slave\workspace\aven-enforcer_MENFORCER-294-IBUS6H5LUW3LLGQ77JNQBEL74UE2BN3AO433QECSA2A76NFISVIQ\m\maven-enforcer-plugin\target\invoker-reports\BUILD-require-no-repositories_failure_repositories.xml, f:\jenkins\jenkins-slave\workspace\aven-enforcer_MENFORCER-294-IBUS6H5LUW3LLGQ77JNQBEL74UE2BN3AO433QECSA2A76NFISVIQ\m\maven-enforcer-plugin\target\invoker-reports\BUILD-require-no-repositories_mm.xml, f:\jenkins\jenkins-slave\workspace\aven-enforcer_MENFORCER-294-IBUS6H5LUW3LLGQ77JNQBEL74UE2BN3AO433QECSA2A76NFISVIQ\m\maven-enforcer-plugin\target\invoker-reports\BUILD-require-no-repositories_mm_ci.xml, f:\jenkins\jenkins-slave\workspace\aven-enforcer_MENFORCER-294-IBUS6H5LUW3LLGQ77JNQBEL74UE2BN3AO433QECSA2A76NFISVIQ\m\maven-enforcer-plugin\target\invoker-reports\BUILD-require-plugin-versions-ci.xml, f:\jenkins\jenkins-slave\workspace\aven-enforcer_MENFORCER-294-IBUS6H5LUW3LLGQ77JNQBEL74UE2BN3AO433QECSA2A76NFISVIQ\m\maven-enforcer-plugin\target\invoker-reports\BUILD-require-plugin-versions-custom-packaging.xml, f:\jenkins\jenkins-slave\workspace\aven-enforcer_MENFORCER-294-IBUS6H5LUW3LLGQ77JNQBEL74UE2BN3AO433QECSA2A76NFISVIQ\m\maven-enforcer-plugin\target\invoker-reports\BUILD-require-plugin-versions-expressions.xml, f:\jenkins\jenkins-slave\workspace\aven-enforcer_MENFORCER-294-IBUS6H5LUW3LLGQ77JNQBEL74UE2BN3AO433QECSA2A76NFISVIQ\m\maven-enforcer-plugin\target\invoker-reports\BUILD-require-plugin-versions-mm-ci-friendly.xml, f:\jenkins\jenkins-slave\workspace\aven-enforcer_MENFORCER-294-IBUS6H5LUW3LLGQ77JNQBEL74UE2BN3AO433QECSA2A76NFISVIQ\m\maven-enforcer-plugin\target\invoker-reports\BUILD-require-plugin-versions-plugin-with-extensions.xml, f:\jenkins\jenkins-slave\workspace\aven-enforcer_MENFORCER-294-IBUS6H5LUW3LLGQ77JNQBEL74UE2BN3AO433QECSA2A76NFISVIQ\m\maven-enforcer-plugin\target\invoker-reports\BUILD-require-plugin-versions-plugin-with-integration-test-lifecycle.xml, f:\jenkins\jenkins-slave\workspace\aven-enforcer_MENFORCER-294-IBUS6H5LUW3LLGQ77JNQBEL74UE2BN3AO433QECSA2A76NFISVIQ\m\maven-enforcer-plugin\target\invoker-reports\BUILD-require-plugin-versions-projectGAVexpressions.xml, f:\jenkins\jenkins-slave\workspace\aven-enforcer_MENFORCER-294-IBUS6H5LUW3LLGQ77JNQBEL74UE2BN3AO433QECSA2A76NFISVIQ\m\maven-enforcer-plugin\target\invoker-reports\BUILD-require-plugin-versions.xml, f:\jenkins\jenkins-slave\workspace\aven-enforcer_MENFORCER-294-IBUS6H5LUW3LLGQ77JNQBEL74UE2BN3AO433QECSA2A76NFISVIQ\m\maven-enforcer-plugin\target\invoker-reports\BUILD-require-profile-ids-exist_failure.xml, f:\jenkins\jenkins-slave\workspace\aven-enforcer_MENFORCER-294-IBUS6H5LUW3LLGQ77JNQBEL74UE2BN3AO433QECSA2A76NFISVIQ\m\maven-enforcer-plugin\target\invoker-reports\BUILD-require-profile-ids-exist_success.xml, f:\jenkins\jenkins-slave\workspace\aven-enforcer_MENFORCER-294-IBUS6H5LUW3LLGQ77JNQBEL74UE2BN3AO433QECSA2A76NFISVIQ\m\maven-enforcer-plugin\target\invoker-reports\BUILD-require-property.xml, f:\jenkins\jenkins-slave\workspace\aven-enforcer_MENFORCER-294-IBUS6H5LUW3LLGQ77JNQBEL74UE2BN3AO433QECSA2A76NFISVIQ\m\maven-enforcer-plugin\target\invoker-reports\BUILD-require-release-dependencies-excludes.xml, f:\jenkins\jenkins-slave\workspace\aven-enforcer_MENFORCER-294-IBUS6H5LUW3LLGQ77JNQBEL74UE2BN3AO433QECSA2A76NFISVIQ\m\maven-enforcer-plugin\target\invoker-reports\BUILD-require-release-dependencies-excludes_failure.xml, f:\jenkins\jenkins-slave\workspace\aven-enforcer_MENFORCER-294-IBUS6H5LUW3LLGQ77JNQBEL74UE2BN3AO433QECSA2A76NFISVIQ\m\maven-enforcer-plugin\target\invoker-reports\BUILD-require-release-dependencies.xml, f:\jenkins\jenkins-slave\workspace\aven-enforcer_MENFORCER-294-IBUS6H5LUW3LLGQ77JNQBEL74UE2BN3AO433QECSA2A76NFISVIQ\m\maven-enforcer-plugin\target\invoker-reports\BUILD-require-release-version.xml, f:\jenkins\jenkins-slave\workspace\aven-enforcer_MENFORCER-294-IBUS6H5LUW3LLGQ77JNQBEL74UE2BN3AO433QECSA2A76NFISVIQ\m\maven-enforcer-plugin\target\invoker-reports\BUILD-require-same-versions_failure.xml, f:\jenkins\jenkins-slave\workspace\aven-enforcer_MENFORCER-294-IBUS6H5LUW3LLGQ77JNQBEL74UE2BN3AO433QECSA2A76NFISVIQ\m\maven-enforcer-plugin\target\invoker-reports\BUILD-require-same-versions_success.xml, f:\jenkins\jenkins-slave\workspace\aven-enforcer_MENFORCER-294-IBUS6H5LUW3LLGQ77JNQBEL74UE2BN3AO433QECSA2A76NFISVIQ\m\maven-enforcer-plugin\target\invoker-reports\BUILD-require-snapshot-version_failure.xml, f:\jenkins\jenkins-slave\workspace\aven-enforcer_MENFORCER-294-IBUS6H5LUW3LLGQ77JNQBEL74UE2BN3AO433QECSA2A76NFISVIQ\m\maven-enforcer-plugin\target\invoker-reports\BUILD-require-snapshot-version_success.xml, f:\jenkins\jenkins-slave\workspace\aven-enforcer_MENFORCER-294-IBUS6H5LUW3LLGQ77JNQBEL74UE2BN3AO433QECSA2A76NFISVIQ\m\maven-enforcer-plugin\target\invoker-reports\BUILD-require-upper-bound-dependencies-managed_failure.xml, f:\jenkins\jenkins-slave\workspace\aven-enforcer_MENFORCER-294-IBUS6H5LUW3LLGQ77JNQBEL74UE2BN3AO433QECSA2A76NFISVIQ\m\maven-enforcer-plugin\target\invoker-reports\BUILD-require-upper-bound-dependencies-managed_success.xml, f:\jenkins\jenkins-slave\workspace\aven-enforcer_MENFORCER-294-IBUS6H5LUW3LLGQ77JNQBEL74UE2BN3AO433QECSA2A76NFISVIQ\m\maven-enforcer-plugin\target\invoker-reports\BUILD-require-upper-bound-dependencies-unique_failure.xml, f:\jenkins\jenkins-slave\workspace\aven-enforcer_MENFORCER-294-IBUS6H5LUW3LLGQ77JNQBEL74UE2BN3AO433QECSA2A76NFISVIQ\m\maven-enforcer-plugin\target\invoker-reports\BUILD-require-upper-bound-dependencies-unique_success.xml, f:\jenkins\jenkins-slave\workspace\aven-enforcer_MENFORCER-294-IBUS6H5LUW3LLGQ77JNQBEL74UE2BN3AO433QECSA2A76NFISVIQ\m\maven-enforcer-plugin\target\invoker-reports\BUILD-require-upper-bound-deps_failure.xml, f:\jenkins\jenkins-slave\workspace\aven-enforcer_MENFORCER-294-IBUS6H5LUW3LLGQ77JNQBEL74UE2BN3AO433QECSA2A76NFISVIQ\m\maven-enforcer-plugin\target\invoker-reports\BUILD-require-upper-bound-deps_ignored.xml, f:\jenkins\jenkins-slave\workspace\aven-enforcer_MENFORCER-294-IBUS6H5LUW3LLGQ77JNQBEL74UE2BN3AO433QECSA2A76NFISVIQ\m\maven-enforcer-plugin\target\invoker-reports\BUILD-require-upper-bound-deps_success.xml, f:\jenkins\jenkins-slave\workspace\aven-enforcer_MENFORCER-294-IBUS6H5LUW3LLGQ77JNQBEL74UE2BN3AO433QECSA2A76NFISVIQ\m\maven-enforcer-plugin\target\invoker-reports\BUILD-resolve_collect_dependencies.xml]
[windows-jdk7] Found logs:[f:\jenkins\jenkins-slave\workspace\aven-enforcer_MENFORCER-294-IBUS6H5LUW3LLGQ77JNQBEL74UE2BN3AO433QECSA2A76NFISVIQ\m\maven-enforcer-plugin\target\it\always-fail-warn\build.log, f:\jenkins\jenkins-slave\workspace\aven-enforcer_MENFORCER-294-IBUS6H5LUW3LLGQ77JNQBEL74UE2BN3AO433QECSA2A76NFISVIQ\m\maven-enforcer-plugin\target\it\always-fail\build.log, f:\jenkins\jenkins-slave\workspace\aven-enforcer_MENFORCER-294-IBUS6H5LUW3LLGQ77JNQBEL74UE2BN3AO433QECSA2A76NFISVIQ\m\maven-enforcer-plugin\target\it\always-pass\build.log, f:\jenkins\jenkins-slave\workspace\aven-enforcer_MENFORCER-294-IBUS6H5LUW3LLGQ77JNQBEL74UE2BN3AO433QECSA2A76NFISVIQ\m\maven-enforcer-plugin\target\it\ban-distribution-management-multi-module-build\build.log, f:\jenkins\jenkins-slave\workspace\aven-enforcer_MENFORCER-294-IBUS6H5LUW3LLGQ77JNQBEL74UE2BN3AO433QECSA2A76NFISVIQ\m\maven-enforcer-plugin\target\it\ban-distribution-management-multi-module-except-site\build.log, f:\jenkins\jenkins-slave\workspace\aven-enforcer_MENFORCER-294-IBUS6H5LUW3LLGQ77JNQBEL74UE2BN3AO433QECSA2A76NFISVIQ\m\maven-enforcer-plugin\target\it\ban-distribution-management\build.log, f:\jenkins\jenkins-slave\workspace\aven-enforcer_MENFORCER-294-IBUS6H5LUW3LLGQ77JNQBEL74UE2BN3AO433QECSA2A76NFISVIQ\m\maven-enforcer-plugin\target\it\ban-pom-dependency-version\build.log, f:\jenkins\jenkins-slave\workspace\aven-enforcer_MENFORCER-294-IBUS6H5LUW3LLGQ77JNQBEL74UE2BN3AO433QECSA2A76NFISVIQ\m\maven-enforcer-plugin\target\it\ban-transitive-dependencies-fail\build.log, f:\jenkins\jenkins-slave\workspace\aven-enforcer_MENFORCER-294-IBUS6H5LUW3LLGQ77JNQBEL74UE2BN3AO433QECSA2A76NFISVIQ\m\maven-enforcer-plugin\target\it\ban-transitive-dependencies\build.log, f:\jenkins\jenkins-slave\workspace\aven-enforcer_MENFORCER-294-IBUS6H5LUW3LLGQ77JNQBEL74UE2BN3AO433QECSA2A76NFISVIQ\m\maven-enforcer-plugin\target\it\banned-dependencies-versionrange-fail\build.log, f:\jenkins\jenkins-slave\workspace\aven-enforcer_MENFORCER-294-IBUS6H5LUW3LLGQ77JNQBEL74UE2BN3AO433QECSA2A76NFISVIQ\m\maven-enforcer-plugin\target\it\banned-dependencies-versionrange\build.log, f:\jenkins\jenkins-slave\workspace\aven-enforcer_MENFORCER-294-IBUS6H5LUW3LLGQ77JNQBEL74UE2BN3AO433QECSA2A76NFISVIQ\m\maven-enforcer-plugin\target\it\banned-dependencies-wildcards\build.log, f:\jenkins\jenkins-slave\workspace\aven-enforcer_MENFORCER-294-IBUS6H5LUW3LLGQ77JNQBEL74UE2BN3AO433QECSA2A76NFISVIQ\m\maven-enforcer-plugin\target\it\banned-dependencies\build.log, f:\jenkins\jenkins-slave\workspace\aven-enforcer_MENFORCER-294-IBUS6H5LUW3LLGQ77JNQBEL74UE2BN3AO433QECSA2A76NFISVIQ\m\maven-enforcer-plugin\target\it\banned-plugins\build.log, f:\jenkins\jenkins-slave\workspace\aven-enforcer_MENFORCER-294-IBUS6H5LUW3LLGQ77JNQBEL74UE2BN3AO433QECSA2A76NFISVIQ\m\maven-enforcer-plugin\target\it\builds_a_pom_noop\build.log, f:\jenkins\jenkins-slave\workspace\aven-enforcer_MENFORCER-294-IBUS6H5LUW3LLGQ77JNQBEL74UE2BN3AO433QECSA2A76NFISVIQ\m\maven-enforcer-plugin\target\it\cli-always-fail\build.log, f:\jenkins\jenkins-slave\workspace\aven-enforcer_MENFORCER-294-IBUS6H5LUW3LLGQ77JNQBEL74UE2BN3AO433QECSA2A76NFISVIQ\m\maven-enforcer-plugin\target\it\cli-always-pass\build.log, f:\jenkins\jenkins-slave\workspace\aven-enforcer_MENFORCER-294-IBUS6H5LUW3LLGQ77JNQBEL74UE2BN3AO433QECSA2A76NFISVIQ\m\maven-enforcer-plugin\target\it\dependencies_converge\build.log, f:\jenkins\jenkins-slave\workspace\aven-enforcer_MENFORCER-294-IBUS6H5LUW3LLGQ77JNQBEL74UE2BN3AO433QECSA2A76NFISVIQ\m\maven-enforcer-plugin\target\it\dependencies_not_converging\build.log, f:\jenkins\jenkins-slave\workspace\aven-enforcer_MENFORCER-294-IBUS6H5LUW3LLGQ77JNQBEL74UE2BN3AO433QECSA2A76NFISVIQ\m\maven-enforcer-plugin\target\it\dependencies_not_converging_test_scope\build.log, f:\jenkins\jenkins-slave\workspace\aven-enforcer_MENFORCER-294-IBUS6H5LUW3LLGQ77JNQBEL74UE2BN3AO433QECSA2A76NFISVIQ\m\maven-enforcer-plugin\target\it\display-info\build.log, f:\jenkins\jenkins-slave\workspace\aven-enforcer_MENFORCER-294-IBUS6H5LUW3LLGQ77JNQBEL74UE2BN3AO433QECSA2A76NFISVIQ\m\maven-enforcer-plugin\target\it\evaluate-beanshell\build.log, f:\jenkins\jenkins-slave\workspace\aven-enforcer_MENFORCER-294-IBUS6H5LUW3LLGQ77JNQBEL74UE2BN3AO433QECSA2A76NFISVIQ\m\maven-enforcer-plugin\target\it\multimodule\build.log, f:\jenkins\jenkins-slave\workspace\aven-enforcer_MENFORCER-294-IBUS6H5LUW3LLGQ77JNQBEL74UE2BN3AO433QECSA2A76NFISVIQ\m\maven-enforcer-plugin\target\it\require-active-profile-all\build.log, f:\jenkins\jenkins-slave\workspace\aven-enforcer_MENFORCER-294-IBUS6H5LUW3LLGQ77JNQBEL74UE2BN3AO433QECSA2A76NFISVIQ\m\maven-enforcer-plugin\target\it\require-active-profile-from-settings\build.log, f:\jenkins\jenkins-slave\workspace\aven-enforcer_MENFORCER-294-IBUS6H5LUW3LLGQ77JNQBEL74UE2BN3AO433QECSA2A76NFISVIQ\m\maven-enforcer-plugin\target\it\require-active-profile\build.log, f:\jenkins\jenkins-slave\workspace\aven-enforcer_MENFORCER-294-IBUS6H5LUW3LLGQ77JNQBEL74UE2BN3AO433QECSA2A76NFISVIQ\m\maven-enforcer-plugin\target\it\require-file-checksum\build.log, f:\jenkins\jenkins-slave\workspace\aven-enforcer_MENFORCER-294-IBUS6H5LUW3LLGQ77JNQBEL74UE2BN3AO433QECSA2A76NFISVIQ\m\maven-enforcer-plugin\target\it\require-files-dont-exist\build.log, f:\jenkins\jenkins-slave\workspace\aven-enforcer_MENFORCER-294-IBUS6H5LUW3LLGQ77JNQBEL74UE2BN3AO433QECSA2A76NFISVIQ\m\maven-enforcer-plugin\target\it\require-files-exist\build.log, f:\jenkins\jenkins-slave\workspace\aven-enforcer_MENFORCER-294-IBUS6H5LUW3LLGQ77JNQBEL74UE2BN3AO433QECSA2A76NFISVIQ\m\maven-enforcer-plugin\target\it\require-files-size\build.log, f:\jenkins\jenkins-slave\workspace\aven-enforcer_MENFORCER-294-IBUS6H5LUW3LLGQ77JNQBEL74UE2BN3AO433QECSA2A76NFISVIQ\m\maven-enforcer-plugin\target\it\require-java-version\build.log, f:\jenkins\jenkins-slave\workspace\aven-enforcer_MENFORCER-294-IBUS6H5LUW3LLGQ77JNQBEL74UE2BN3AO433QECSA2A76NFISVIQ\m\maven-enforcer-plugin\target\it\require-maven-version\build.log, f:\jenkins\jenkins-slave\workspace\aven-enforcer_MENFORCER-294-IBUS6H5LUW3LLGQ77JNQBEL74UE2BN3AO433QECSA2A76NFISVIQ\m\maven-enforcer-plugin\target\it\require-no-repositories-allow-plugin-repo\build.log, f:\jenkins\jenkins-slave\workspace\aven-enforcer_MENFORCER-294-IBUS6H5LUW3LLGQ77JNQBEL74UE2BN3AO433QECSA2A76NFISVIQ\m\maven-enforcer-plugin\target\it\require-no-repositories-allow-repo\build.log, f:\jenkins\jenkins-slave\workspace\aven-enforcer_MENFORCER-294-IBUS6H5LUW3LLGQ77JNQBEL74UE2BN3AO433QECSA2A76NFISVIQ\m\maven-enforcer-plugin\target\it\require-no-repositories\build.log, f:\jenkins\jenkins-slave\workspace\aven-enforcer_MENFORCER-294-IBUS6H5LUW3LLGQ77JNQBEL74UE2BN3AO433QECSA2A76NFISVIQ\m\maven-enforcer-plugin\target\it\require-no-repositories_failure\build.log, f:\jenkins\jenkins-slave\workspace\aven-enforcer_MENFORCER-294-IBUS6H5LUW3LLGQ77JNQBEL74UE2BN3AO433QECSA2A76NFISVIQ\m\maven-enforcer-plugin\target\it\require-no-repositories_failure_allowed-plugin-repo\build.log, f:\jenkins\jenkins-slave\workspace\aven-enforcer_MENFORCER-294-IBUS6H5LUW3LLGQ77JNQBEL74UE2BN3AO433QECSA2A76NFISVIQ\m\maven-enforcer-plugin\target\it\require-no-repositories_failure_plugin-repositories\build.log, f:\jenkins\jenkins-slave\workspace\aven-enforcer_MENFORCER-294-IBUS6H5LUW3LLGQ77JNQBEL74UE2BN3AO433QECSA2A76NFISVIQ\m\maven-enforcer-plugin\target\it\require-no-repositories_failure_repositories\build.log, f:\jenkins\jenkins-slave\workspace\aven-enforcer_MENFORCER-294-IBUS6H5LUW3LLGQ77JNQBEL74UE2BN3AO433QECSA2A76NFISVIQ\m\maven-enforcer-plugin\target\it\require-no-repositories_mm\build.log, f:\jenkins\jenkins-slave\workspace\aven-enforcer_MENFORCER-294-IBUS6H5LUW3LLGQ77JNQBEL74UE2BN3AO433QECSA2A76NFISVIQ\m\maven-enforcer-plugin\target\it\require-no-repositories_mm_ci\build.log, f:\jenkins\jenkins-slave\workspace\aven-enforcer_MENFORCER-294-IBUS6H5LUW3LLGQ77JNQBEL74UE2BN3AO433QECSA2A76NFISVIQ\m\maven-enforcer-plugin\target\it\require-plugin-versions-ci\build.log, f:\jenkins\jenkins-slave\workspace\aven-enforcer_MENFORCER-294-IBUS6H5LUW3LLGQ77JNQBEL74UE2BN3AO433QECSA2A76NFISVIQ\m\maven-enforcer-plugin\target\it\require-plugin-versions-custom-packaging\build.log, f:\jenkins\jenkins-slave\workspace\aven-enforcer_MENFORCER-294-IBUS6H5LUW3LLGQ77JNQBEL74UE2BN3AO433QECSA2A76NFISVIQ\m\maven-enforcer-plugin\target\it\require-plugin-versions-expressions\build.log, f:\jenkins\jenkins-slave\workspace\aven-enforcer_MENFORCER-294-IBUS6H5LUW3LLGQ77JNQBEL74UE2BN3AO433QECSA2A76NFISVIQ\m\maven-enforcer-plugin\target\it\require-plugin-versions-mm-ci-friendly\build.log, f:\jenkins\jenkins-slave\workspace\aven-enforcer_MENFORCER-294-IBUS6H5LUW3LLGQ77JNQBEL74UE2BN3AO433QECSA2A76NFISVIQ\m\maven-enforcer-plugin\target\it\require-plugin-versions-plugin-with-extensions\build.log, f:\jenkins\jenkins-slave\workspace\aven-enforcer_MENFORCER-294-IBUS6H5LUW3LLGQ77JNQBEL74UE2BN3AO433QECSA2A76NFISVIQ\m\maven-enforcer-plugin\target\it\require-plugin-versions-plugin-with-integration-test-lifecycle\build.log, f:\jenkins\jenkins-slave\workspace\aven-enforcer_MENFORCER-294-IBUS6H5LUW3LLGQ77JNQBEL74UE2BN3AO433QECSA2A76NFISVIQ\m\maven-enforcer-plugin\target\it\require-plugin-versions-projectGAVexpressions\build.log, f:\jenkins\jenkins-slave\workspace\aven-enforcer_MENFORCER-294-IBUS6H5LUW3LLGQ77JNQBEL74UE2BN3AO433QECSA2A76NFISVIQ\m\maven-enforcer-plugin\target\it\require-plugin-versions\build.log, f:\jenkins\jenkins-slave\workspace\aven-enforcer_MENFORCER-294-IBUS6H5LUW3LLGQ77JNQBEL74UE2BN3AO433QECSA2A76NFISVIQ\m\maven-enforcer-plugin\target\it\require-profile-ids-exist_failure\build.log, f:\jenkins\jenkins-slave\workspace\aven-enforcer_MENFORCER-294-IBUS6H5LUW3LLGQ77JNQBEL74UE2BN3AO433QECSA2A76NFISVIQ\m\maven-enforcer-plugin\target\it\require-profile-ids-exist_success\build.log, f:\jenkins\jenkins-slave\workspace\aven-enforcer_MENFORCER-294-IBUS6H5LUW3LLGQ77JNQBEL74UE2BN3AO433QECSA2A76NFISVIQ\m\maven-enforcer-plugin\target\it\require-property\build.log, f:\jenkins\jenkins-slave\workspace\aven-enforcer_MENFORCER-294-IBUS6H5LUW3LLGQ77JNQBEL74UE2BN3AO433QECSA2A76NFISVIQ\m\maven-enforcer-plugin\target\it\require-release-dependencies-excludes\build.log, f:\jenkins\jenkins-slave\workspace\aven-enforcer_MENFORCER-294-IBUS6H5LUW3LLGQ77JNQBEL74UE2BN3AO433QECSA2A76NFISVIQ\m\maven-enforcer-plugin\target\it\require-release-dependencies-excludes_failure\build.log, f:\jenkins\jenkins-slave\workspace\aven-enforcer_MENFORCER-294-IBUS6H5LUW3LLGQ77JNQBEL74UE2BN3AO433QECSA2A76NFISVIQ\m\maven-enforcer-plugin\target\it\require-release-dependencies\build.log, f:\jenkins\jenkins-slave\workspace\aven-enforcer_MENFORCER-294-IBUS6H5LUW3LLGQ77JNQBEL74UE2BN3AO433QECSA2A76NFISVIQ\m\maven-enforcer-plugin\target\it\require-release-version\build.log, f:\jenkins\jenkins-slave\workspace\aven-enforcer_MENFORCER-294-IBUS6H5LUW3LLGQ77JNQBEL74UE2BN3AO433QECSA2A76NFISVIQ\m\maven-enforcer-plugin\target\it\require-same-versions_failure\build.log, f:\jenkins\jenkins-slave\workspace\aven-enforcer_MENFORCER-294-IBUS6H5LUW3LLGQ77JNQBEL74UE2BN3AO433QECSA2A76NFISVIQ\m\maven-enforcer-plugin\target\it\require-same-versions_success\build.log, f:\jenkins\jenkins-slave\workspace\aven-enforcer_MENFORCER-294-IBUS6H5LUW3LLGQ77JNQBEL74UE2BN3AO433QECSA2A76NFISVIQ\m\maven-enforcer-plugin\target\it\require-snapshot-version_failure\build.log, f:\jenkins\jenkins-slave\workspace\aven-enforcer_MENFORCER-294-IBUS6H5LUW3LLGQ77JNQBEL74UE2BN3AO433QECSA2A76NFISVIQ\m\maven-enforcer-plugin\target\it\require-snapshot-version_success\build.log, f:\jenkins\jenkins-slave\workspace\aven-enforcer_MENFORCER-294-IBUS6H5LUW3LLGQ77JNQBEL74UE2BN3AO433QECSA2A76NFISVIQ\m\maven-enforcer-plugin\target\it\require-upper-bound-dependencies-managed_failure\build.log, f:\jenkins\jenkins-slave\workspace\aven-enforcer_MENFORCER-294-IBUS6H5LUW3LLGQ77JNQBEL74UE2BN3AO433QECSA2A76NFISVIQ\m\maven-enforcer-plugin\target\it\require-upper-bound-dependencies-managed_success\build.log, f:\jenkins\jenkins-slave\workspace\aven-enforcer_MENFORCER-294-IBUS6H5LUW3LLGQ77JNQBEL74UE2BN3AO433QECSA2A76NFISVIQ\m\maven-enforcer-plugin\target\it\require-upper-bound-dependencies-unique_failure\build.log, f:\jenkins\jenkins-slave\workspace\aven-enforcer_MENFORCER-294-IBUS6H5LUW3LLGQ77JNQBEL74UE2BN3AO433QECSA2A76NFISVIQ\m\maven-enforcer-plugin\target\it\require-upper-bound-dependencies-unique_success\build.log, f:\jenkins\jenkins-slave\workspace\aven-enforcer_MENFORCER-294-IBUS6H5LUW3LLGQ77JNQBEL74UE2BN3AO433QECSA2A76NFISVIQ\m\maven-enforcer-plugin\target\it\require-upper-bound-deps_failure\build.log, f:\jenkins\jenkins-slave\workspace\aven-enforcer_MENFORCER-294-IBUS6H5LUW3LLGQ77JNQBEL74UE2BN3AO433QECSA2A76NFISVIQ\m\maven-enforcer-plugin\target\it\require-upper-bound-deps_ignored\build.log, f:\jenkins\jenkins-slave\workspace\aven-enforcer_MENFORCER-294-IBUS6H5LUW3LLGQ77JNQBEL74UE2BN3AO433QECSA2A76NFISVIQ\m\maven-enforcer-plugin\target\it\require-upper-bound-deps_success\build.log, f:\jenkins\jenkins-slave\workspace\aven-enforcer_MENFORCER-294-IBUS6H5LUW3LLGQ77JNQBEL74UE2BN3AO433QECSA2A76NFISVIQ\m\maven-enforcer-plugin\target\it\resolve_collect_dependencies\build.log]
[windows-jdk7] Finished parsing Maven Invoker results (found 68)
[windows-jdk7] [withMaven] junitPublisher - Archive test results for Maven artifact org.apache.maven.enforcer:enforcer-api:3.0.0-SNAPSHOT generated by maven-surefire-plugin:test (default-test): m\enforcer-api\target\surefire-reports\*.xml
[windows-jdk7] Recording test results
[windows-jdk7] None of the test reports contained any result
[windows-jdk7] [withMaven] junitPublisher - Archive test results for Maven artifact org.apache.maven.enforcer:enforcer-rules:3.0.0-SNAPSHOT generated by maven-surefire-plugin:test (default-test): m\enforcer-rules\target\surefire-reports\*.xml
[windows-jdk7] Recording test results
[windows-jdk7] [withMaven] junitPublisher - Archive test results for Maven artifact org.apache.maven.plugins:maven-enforcer-plugin:3.0.0-SNAPSHOT generated by maven-surefire-plugin:test (default-test): m\maven-enforcer-plugin\target\surefire-reports\*.xml
[windows-jdk7] Recording test results
[Pipeline] [windows-jdk7] // withMaven
[Pipeline] [windows-jdk7] cleanWs
[Pipeline] [windows-jdk8] }
[Pipeline] [windows-jdk8] // stage
[Pipeline] [windows-jdk8] }
[Pipeline] [windows-jdk8] // node
[Pipeline] [windows-jdk8] }
[windows-jdk7] [WS-CLEANUP] Deleting project workspace...[WS-CLEANUP] done
[Pipeline] [windows-jdk7] }
[Pipeline] [windows-jdk7] // stage
[Pipeline] [windows-jdk7] }
[Pipeline] [windows-jdk7] // node
[Pipeline] [windows-jdk7] }
[windows-jdk9] [INFO] run post-build script verify.groovy
[windows-jdk9] [INFO]           require-upper-bound-dependencies-managed_failure\pom.xml SUCCESS (5.7 s)
[windows-jdk9] [INFO] Building: require-upper-bound-dependencies-managed_success\pom.xml
[windows-jdk10] [INFO]           require-no-repositories_mm\pom.xml ............... SUCCESS (5.5 s)
[windows-jdk10] [INFO] Building: require-no-repositories_mm_ci\pom.xml
[windows-jdk9] [INFO]           require-upper-bound-dependencies-managed_success\pom.xml SUCCESS (4.9 s)
[windows-jdk9] [INFO] Building: require-upper-bound-dependencies-unique_failure\pom.xml
[windows-jdk10] [INFO]           require-no-repositories_mm_ci\pom.xml ............ SUCCESS (6.1 s)
[windows-jdk10] [INFO] Building: require-plugin-versions\pom.xml
[windows-jdk9] [INFO] snapshot org.apache.maven.plugins.enforcer.its:menforcer134_project:1.0-SNAPSHOT: checking for updates from apache-snapshots
[windows-jdk9] [INFO] snapshot org.apache.maven.plugins.enforcer.its:menforcer134_project:1.0-SNAPSHOT: checking for updates from Nexus
[windows-jdk9] [INFO] artifact org.apache.maven.plugins.enforcer.its.menforcer134_project:1.0-SNAPSHOT: checking for updates from central
[windows-jdk9] [INFO] org.apache.maven.plugins.enforcer.its.menforcer134_project.1.0-SNAPSHOT: checking for updates from central
[windows-jdk9] [INFO] snapshot org.apache.maven.plugins.enforcer.its:menforcer134_modelbuilder:1.0-SNAPSHOT: checking for updates from apache-snapshots
[windows-jdk9] [INFO] snapshot org.apache.maven.plugins.enforcer.its:menforcer134_modelbuilder:1.0-SNAPSHOT: checking for updates from Nexus
[windows-jdk9] [INFO] artifact org.apache.maven.plugins.enforcer.its.menforcer134_modelbuilder:1.0-SNAPSHOT: checking for updates from central
[windows-jdk9] [INFO] org.apache.maven.plugins.enforcer.its.menforcer134_modelbuilder.1.0-SNAPSHOT: checking for updates from central
[windows-jdk9] [INFO] snapshot org.apache.maven.plugins.enforcer.its:menforcer134_model:1.0-SNAPSHOT: checking for updates from apache-snapshots
[windows-jdk9] [INFO] snapshot org.apache.maven.plugins.enforcer.its:menforcer134_model:1.0-SNAPSHOT: checking for updates from Nexus
[windows-jdk9] [INFO] artifact org.apache.maven.plugins.enforcer.its.menforcer134_model:1.0-SNAPSHOT: checking for updates from central
[windows-jdk9] [INFO] org.apache.maven.plugins.enforcer.its.menforcer134_model.1.0-SNAPSHOT: checking for updates from central
[windows-jdk9] [INFO] run post-build script verify.groovy
[windows-jdk9] [INFO]           require-upper-bound-dependencies-unique_failure\pom.xml SUCCESS (5.6 s)
[windows-jdk9] [INFO] Building: require-upper-bound-dependencies-unique_success\pom.xml
[windows-jdk10] [INFO]           require-plugin-versions\pom.xml .................. SUCCESS (5.6 s)
[windows-jdk10] [INFO] Building: require-plugin-versions-ci\pom.xml
[windows-jdk9] [INFO]           require-upper-bound-dependencies-unique_success\pom.xml SUCCESS (4.3 s)
[windows-jdk9] [INFO] Building: require-upper-bound-deps_failure\pom.xml
[windows-jdk10] [INFO] run post-build script verify.groovy
[windows-jdk10] [INFO]           require-plugin-versions-ci\pom.xml ............... SUCCESS (5.6 s)
[windows-jdk10] [INFO] Building: require-plugin-versions-custom-packaging\pom.xml
[windows-jdk9] [INFO] run post-build script verify.groovy
[windows-jdk9] [INFO]           require-upper-bound-deps_failure\pom.xml ......... SUCCESS (5.2 s)
[windows-jdk9] [INFO] Building: require-upper-bound-deps_ignored\pom.xml
[windows-jdk9] [INFO] run post-build script verify.groovy
[windows-jdk9] [INFO]           require-upper-bound-deps_ignored\pom.xml ......... SUCCESS (4.1 s)
[windows-jdk9] [INFO] Building: require-upper-bound-deps_success\pom.xml
[windows-jdk10] [INFO] artifact org.apache.maven.plugins:maven-resources-plugin: checking for updates from central
[windows-jdk10] [INFO] artifact org.apache.maven.plugins:maven-compiler-plugin: checking for updates from central
[windows-jdk10] [INFO] artifact org.apache.maven.plugins:maven-surefire-plugin: checking for updates from central
[windows-jdk10] [INFO] artifact org.apache.maven.plugins:maven-install-plugin: checking for updates from central
[windows-jdk10] [INFO] artifact org.apache.maven.plugins:maven-deploy-plugin: checking for updates from central
[windows-jdk9] [INFO]           require-upper-bound-deps_success\pom.xml ......... SUCCESS (4.3 s)
[windows-jdk9] [INFO] Building: resolve_collect_dependencies\pom.xml
[windows-jdk10] [INFO]           require-plugin-versions-custom-packaging\pom.xml . SUCCESS (11.9 s)
[windows-jdk10] [INFO] Building: require-plugin-versions-expressions\pom.xml
[windows-jdk9] [INFO] run post-build script verify.groovy
[windows-jdk9] [INFO]           resolve_collect_dependencies\pom.xml ............. SUCCESS (6.4 s)
[windows-jdk9] [INFO] -------------------------------------------------
[windows-jdk9] [INFO] Build Summary:
[windows-jdk9] [INFO]   Passed: 68, Failed: 0, Errors: 0, Skipped: 0
[windows-jdk9] [INFO] -------------------------------------------------
[windows-jdk9] [INFO] 
[windows-jdk9] [INFO] --- mrm-maven-plugin:1.0.0:stop (default) @ maven-enforcer-plugin ---
[windows-jdk9] [INFO] Stopping Mock Repository Manager on http://localhost:63855
[windows-jdk9] [INFO] Mock Repository Manager http://localhost:63855 is stopped.
[windows-jdk9] [INFO] 
[windows-jdk9] [INFO] --- maven-checkstyle-plugin:3.0.0:check (checkstyle-check) @ maven-enforcer-plugin ---
[windows-jdk9] [INFO] ------------------------------------------------------------------------
[windows-jdk9] [INFO] Reactor Summary:
[windows-jdk9] [INFO] 
[windows-jdk9] [INFO] Apache Maven Enforcer .............................. SUCCESS [ 13.603 s]
[windows-jdk9] [INFO] Apache Maven Enforcer API .......................... SUCCESS [  5.177 s]
[windows-jdk9] [INFO] Apache Maven Enforcer Built-In Rules ............... SUCCESS [ 11.847 s]
[windows-jdk9] [INFO] Apache Maven Enforcer Plugin ....................... SUCCESS [05:44 min]
[windows-jdk9] [INFO] ------------------------------------------------------------------------
[windows-jdk9] [INFO] BUILD SUCCESS
[windows-jdk9] [INFO] ------------------------------------------------------------------------
[windows-jdk9] [INFO] Total time: 06:16 min
[windows-jdk9] [INFO] Finished at: 2018-08-17T05:27:20Z
[windows-jdk9] [INFO] Final Memory: 52M/175M
[windows-jdk9] [INFO] ------------------------------------------------------------------------
[windows-jdk9] [INFO] [jenkins-event-spy] Generated F:\jenkins\jenkins-slave\workspace\aven-enforcer_MENFORCER-294-IBUS6H5LUW3LLGQ77JNQBEL74UE2BN3AO433QECSA2A76NFISVIQ@tmp\withMaven38bb8f53\maven-spy-20180817-052104-2315578667855736106667.log
[windows-jdk10] [INFO]           require-plugin-versions-expressions\pom.xml ...... SUCCESS (5.3 s)
[windows-jdk10] [INFO] Building: require-plugin-versions-mm-ci-friendly\pom.xml
[Pipeline] [windows-jdk9] }
[Pipeline] [windows-jdk9] // dir
[Pipeline] [windows-jdk9] }
[windows-jdk9] [withMaven] invokerPublisher - Archive invoker results for Maven artifact MavenArtifact{org.apache.maven.plugins:maven-enforcer-plugin::3.0.0-SNAPSHOT(version: 3.0.0-SNAPSHOT, snapshot:false) } generated by PluginInvocation{org.apache.maven.plugins:maven-invoker-plugin:3.0.1@run  integration-test}: m\maven-enforcer-plugin\target\invoker-reports\*.xml
[windows-jdk9] performing MavenInvokerRecorder, reportsFilenamePattern:'**/m\maven-enforcer-plugin\target\invoker-reports/BUILD*.xml', invokerBuildDir:'**/m\maven-enforcer-plugin\target\it'
[windows-jdk9] Found reports:[f:\jenkins\jenkins-slave\workspace\aven-enforcer_MENFORCER-294-IBUS6H5LUW3LLGQ77JNQBEL74UE2BN3AO433QECSA2A76NFISVIQ\m\maven-enforcer-plugin\target\invoker-reports\BUILD-always-fail-warn.xml, f:\jenkins\jenkins-slave\workspace\aven-enforcer_MENFORCER-294-IBUS6H5LUW3LLGQ77JNQBEL74UE2BN3AO433QECSA2A76NFISVIQ\m\maven-enforcer-plugin\target\invoker-reports\BUILD-always-fail.xml, f:\jenkins\jenkins-slave\workspace\aven-enforcer_MENFORCER-294-IBUS6H5LUW3LLGQ77JNQBEL74UE2BN3AO433QECSA2A76NFISVIQ\m\maven-enforcer-plugin\target\invoker-reports\BUILD-always-pass.xml, f:\jenkins\jenkins-slave\workspace\aven-enforcer_MENFORCER-294-IBUS6H5LUW3LLGQ77JNQBEL74UE2BN3AO433QECSA2A76NFISVIQ\m\maven-enforcer-plugin\target\invoker-reports\BUILD-ban-distribution-management-multi-module-build.xml, f:\jenkins\jenkins-slave\workspace\aven-enforcer_MENFORCER-294-IBUS6H5LUW3LLGQ77JNQBEL74UE2BN3AO433QECSA2A76NFISVIQ\m\maven-enforcer-plugin\target\invoker-reports\BUILD-ban-distribution-management-multi-module-except-site.xml, f:\jenkins\jenkins-slave\workspace\aven-enforcer_MENFORCER-294-IBUS6H5LUW3LLGQ77JNQBEL74UE2BN3AO433QECSA2A76NFISVIQ\m\maven-enforcer-plugin\target\invoker-reports\BUILD-ban-distribution-management.xml, f:\jenkins\jenkins-slave\workspace\aven-enforcer_MENFORCER-294-IBUS6H5LUW3LLGQ77JNQBEL74UE2BN3AO433QECSA2A76NFISVIQ\m\maven-enforcer-plugin\target\invoker-reports\BUILD-ban-pom-dependency-version.xml, f:\jenkins\jenkins-slave\workspace\aven-enforcer_MENFORCER-294-IBUS6H5LUW3LLGQ77JNQBEL74UE2BN3AO433QECSA2A76NFISVIQ\m\maven-enforcer-plugin\target\invoker-reports\BUILD-ban-transitive-dependencies-fail.xml, f:\jenkins\jenkins-slave\workspace\aven-enforcer_MENFORCER-294-IBUS6H5LUW3LLGQ77JNQBEL74UE2BN3AO433QECSA2A76NFISVIQ\m\maven-enforcer-plugin\target\invoker-reports\BUILD-ban-transitive-dependencies.xml, f:\jenkins\jenkins-slave\workspace\aven-enforcer_MENFORCER-294-IBUS6H5LUW3LLGQ77JNQBEL74UE2BN3AO433QECSA2A76NFISVIQ\m\maven-enforcer-plugin\target\invoker-reports\BUILD-banned-dependencies-versionrange-fail.xml, f:\jenkins\jenkins-slave\workspace\aven-enforcer_MENFORCER-294-IBUS6H5LUW3LLGQ77JNQBEL74UE2BN3AO433QECSA2A76NFISVIQ\m\maven-enforcer-plugin\target\invoker-reports\BUILD-banned-dependencies-versionrange.xml, f:\jenkins\jenkins-slave\workspace\aven-enforcer_MENFORCER-294-IBUS6H5LUW3LLGQ77JNQBEL74UE2BN3AO433QECSA2A76NFISVIQ\m\maven-enforcer-plugin\target\invoker-reports\BUILD-banned-dependencies-wildcards.xml, f:\jenkins\jenkins-slave\workspace\aven-enforcer_MENFORCER-294-IBUS6H5LUW3LLGQ77JNQBEL74UE2BN3AO433QECSA2A76NFISVIQ\m\maven-enforcer-plugin\target\invoker-reports\BUILD-banned-dependencies.xml, f:\jenkins\jenkins-slave\workspace\aven-enforcer_MENFORCER-294-IBUS6H5LUW3LLGQ77JNQBEL74UE2BN3AO433QECSA2A76NFISVIQ\m\maven-enforcer-plugin\target\invoker-reports\BUILD-banned-plugins.xml, f:\jenkins\jenkins-slave\workspace\aven-enforcer_MENFORCER-294-IBUS6H5LUW3LLGQ77JNQBEL74UE2BN3AO433QECSA2A76NFISVIQ\m\maven-enforcer-plugin\target\invoker-reports\BUILD-builds_a_pom_noop.xml, f:\jenkins\jenkins-slave\workspace\aven-enforcer_MENFORCER-294-IBUS6H5LUW3LLGQ77JNQBEL74UE2BN3AO433QECSA2A76NFISVIQ\m\maven-enforcer-plugin\target\invoker-reports\BUILD-cli-always-fail.xml, f:\jenkins\jenkins-slave\workspace\aven-enforcer_MENFORCER-294-IBUS6H5LUW3LLGQ77JNQBEL74UE2BN3AO433QECSA2A76NFISVIQ\m\maven-enforcer-plugin\target\invoker-reports\BUILD-cli-always-pass.xml, f:\jenkins\jenkins-slave\workspace\aven-enforcer_MENFORCER-294-IBUS6H5LUW3LLGQ77JNQBEL74UE2BN3AO433QECSA2A76NFISVIQ\m\maven-enforcer-plugin\target\invoker-reports\BUILD-dependencies_converge.xml, f:\jenkins\jenkins-slave\workspace\aven-enforcer_MENFORCER-294-IBUS6H5LUW3LLGQ77JNQBEL74UE2BN3AO433QECSA2A76NFISVIQ\m\maven-enforcer-plugin\target\invoker-reports\BUILD-dependencies_not_converging.xml, f:\jenkins\jenkins-slave\workspace\aven-enforcer_MENFORCER-294-IBUS6H5LUW3LLGQ77JNQBEL74UE2BN3AO433QECSA2A76NFISVIQ\m\maven-enforcer-plugin\target\invoker-reports\BUILD-dependencies_not_converging_test_scope.xml, f:\jenkins\jenkins-slave\workspace\aven-enforcer_MENFORCER-294-IBUS6H5LUW3LLGQ77JNQBEL74UE2BN3AO433QECSA2A76NFISVIQ\m\maven-enforcer-plugin\target\invoker-reports\BUILD-display-info.xml, f:\jenkins\jenkins-slave\workspace\aven-enforcer_MENFORCER-294-IBUS6H5LUW3LLGQ77JNQBEL74UE2BN3AO433QECSA2A76NFISVIQ\m\maven-enforcer-plugin\target\invoker-reports\BUILD-evaluate-beanshell.xml, f:\jenkins\jenkins-slave\workspace\aven-enforcer_MENFORCER-294-IBUS6H5LUW3LLGQ77JNQBEL74UE2BN3AO433QECSA2A76NFISVIQ\m\maven-enforcer-plugin\target\invoker-reports\BUILD-multimodule.xml, f:\jenkins\jenkins-slave\workspace\aven-enforcer_MENFORCER-294-IBUS6H5LUW3LLGQ77JNQBEL74UE2BN3AO433QECSA2A76NFISVIQ\m\maven-enforcer-plugin\target\invoker-reports\BUILD-require-active-profile-all.xml, f:\jenkins\jenkins-slave\workspace\aven-enforcer_MENFORCER-294-IBUS6H5LUW3LLGQ77JNQBEL74UE2BN3AO433QECSA2A76NFISVIQ\m\maven-enforcer-plugin\target\invoker-reports\BUILD-require-active-profile-from-settings.xml, f:\jenkins\jenkins-slave\workspace\aven-enforcer_MENFORCER-294-IBUS6H5LUW3LLGQ77JNQBEL74UE2BN3AO433QECSA2A76NFISVIQ\m\maven-enforcer-plugin\target\invoker-reports\BUILD-require-active-profile.xml, f:\jenkins\jenkins-slave\workspace\aven-enforcer_MENFORCER-294-IBUS6H5LUW3LLGQ77JNQBEL74UE2BN3AO433QECSA2A76NFISVIQ\m\maven-enforcer-plugin\target\invoker-reports\BUILD-require-file-checksum.xml, f:\jenkins\jenkins-slave\workspace\aven-enforcer_MENFORCER-294-IBUS6H5LUW3LLGQ77JNQBEL74UE2BN3AO433QECSA2A76NFISVIQ\m\maven-enforcer-plugin\target\invoker-reports\BUILD-require-files-dont-exist.xml, f:\jenkins\jenkins-slave\workspace\aven-enforcer_MENFORCER-294-IBUS6H5LUW3LLGQ77JNQBEL74UE2BN3AO433QECSA2A76NFISVIQ\m\maven-enforcer-plugin\target\invoker-reports\BUILD-require-files-exist.xml, f:\jenkins\jenkins-slave\workspace\aven-enforcer_MENFORCER-294-IBUS6H5LUW3LLGQ77JNQBEL74UE2BN3AO433QECSA2A76NFISVIQ\m\maven-enforcer-plugin\target\invoker-reports\BUILD-require-files-size.xml, f:\jenkins\jenkins-slave\workspace\aven-enforcer_MENFORCER-294-IBUS6H5LUW3LLGQ77JNQBEL74UE2BN3AO433QECSA2A76NFISVIQ\m\maven-enforcer-plugin\target\invoker-reports\BUILD-require-java-version.xml, f:\jenkins\jenkins-slave\workspace\aven-enforcer_MENFORCER-294-IBUS6H5LUW3LLGQ77JNQBEL74UE2BN3AO433QECSA2A76NFISVIQ\m\maven-enforcer-plugin\target\invoker-reports\BUILD-require-maven-version.xml, f:\jenkins\jenkins-slave\workspace\aven-enforcer_MENFORCER-294-IBUS6H5LUW3LLGQ77JNQBEL74UE2BN3AO433QECSA2A76NFISVIQ\m\maven-enforcer-plugin\target\invoker-reports\BUILD-require-no-repositories-allow-plugin-repo.xml, f:\jenkins\jenkins-slave\workspace\aven-enforcer_MENFORCER-294-IBUS6H5LUW3LLGQ77JNQBEL74UE2BN3AO433QECSA2A76NFISVIQ\m\maven-enforcer-plugin\target\invoker-reports\BUILD-require-no-repositories-allow-repo.xml, f:\jenkins\jenkins-slave\workspace\aven-enforcer_MENFORCER-294-IBUS6H5LUW3LLGQ77JNQBEL74UE2BN3AO433QECSA2A76NFISVIQ\m\maven-enforcer-plugin\target\invoker-reports\BUILD-require-no-repositories.xml, f:\jenkins\jenkins-slave\workspace\aven-enforcer_MENFORCER-294-IBUS6H5LUW3LLGQ77JNQBEL74UE2BN3AO433QECSA2A76NFISVIQ\m\maven-enforcer-plugin\target\invoker-reports\BUILD-require-no-repositories_failure.xml, f:\jenkins\jenkins-slave\workspace\aven-enforcer_MENFORCER-294-IBUS6H5LUW3LLGQ77JNQBEL74UE2BN3AO433QECSA2A76NFISVIQ\m\maven-enforcer-plugin\target\invoker-reports\BUILD-require-no-repositories_failure_allowed-plugin-repo.xml, f:\jenkins\jenkins-slave\workspace\aven-enforcer_MENFORCER-294-IBUS6H5LUW3LLGQ77JNQBEL74UE2BN3AO433QECSA2A76NFISVIQ\m\maven-enforcer-plugin\target\invoker-reports\BUILD-require-no-repositories_failure_plugin-repositories.xml, f:\jenkins\jenkins-slave\workspace\aven-enforcer_MENFORCER-294-IBUS6H5LUW3LLGQ77JNQBEL74UE2BN3AO433QECSA2A76NFISVIQ\m\maven-enforcer-plugin\target\invoker-reports\BUILD-require-no-repositories_failure_repositories.xml, f:\jenkins\jenkins-slave\workspace\aven-enforcer_MENFORCER-294-IBUS6H5LUW3LLGQ77JNQBEL74UE2BN3AO433QECSA2A76NFISVIQ\m\maven-enforcer-plugin\target\invoker-reports\BUILD-require-no-repositories_mm.xml, f:\jenkins\jenkins-slave\workspace\aven-enforcer_MENFORCER-294-IBUS6H5LUW3LLGQ77JNQBEL74UE2BN3AO433QECSA2A76NFISVIQ\m\maven-enforcer-plugin\target\invoker-reports\BUILD-require-no-repositories_mm_ci.xml, f:\jenkins\jenkins-slave\workspace\aven-enforcer_MENFORCER-294-IBUS6H5LUW3LLGQ77JNQBEL74UE2BN3AO433QECSA2A76NFISVIQ\m\maven-enforcer-plugin\target\invoker-reports\BUILD-require-plugin-versions-ci.xml, f:\jenkins\jenkins-slave\workspace\aven-enforcer_MENFORCER-294-IBUS6H5LUW3LLGQ77JNQBEL74UE2BN3AO433QECSA2A76NFISVIQ\m\maven-enforcer-plugin\target\invoker-reports\BUILD-require-plugin-versions-custom-packaging.xml, f:\jenkins\jenkins-slave\workspace\aven-enforcer_MENFORCER-294-IBUS6H5LUW3LLGQ77JNQBEL74UE2BN3AO433QECSA2A76NFISVIQ\m\maven-enforcer-plugin\target\invoker-reports\BUILD-require-plugin-versions-expressions.xml, f:\jenkins\jenkins-slave\workspace\aven-enforcer_MENFORCER-294-IBUS6H5LUW3LLGQ77JNQBEL74UE2BN3AO433QECSA2A76NFISVIQ\m\maven-enforcer-plugin\target\invoker-reports\BUILD-require-plugin-versions-mm-ci-friendly.xml, f:\jenkins\jenkins-slave\workspace\aven-enforcer_MENFORCER-294-IBUS6H5LUW3LLGQ77JNQBEL74UE2BN3AO433QECSA2A76NFISVIQ\m\maven-enforcer-plugin\target\invoker-reports\BUILD-require-plugin-versions-plugin-with-extensions.xml, f:\jenkins\jenkins-slave\workspace\aven-enforcer_MENFORCER-294-IBUS6H5LUW3LLGQ77JNQBEL74UE2BN3AO433QECSA2A76NFISVIQ\m\maven-enforcer-plugin\target\invoker-reports\BUILD-require-plugin-versions-plugin-with-integration-test-lifecycle.xml, f:\jenkins\jenkins-slave\workspace\aven-enforcer_MENFORCER-294-IBUS6H5LUW3LLGQ77JNQBEL74UE2BN3AO433QECSA2A76NFISVIQ\m\maven-enforcer-plugin\target\invoker-reports\BUILD-require-plugin-versions-projectGAVexpressions.xml, f:\jenkins\jenkins-slave\workspace\aven-enforcer_MENFORCER-294-IBUS6H5LUW3LLGQ77JNQBEL74UE2BN3AO433QECSA2A76NFISVIQ\m\maven-enforcer-plugin\target\invoker-reports\BUILD-require-plugin-versions.xml, f:\jenkins\jenkins-slave\workspace\aven-enforcer_MENFORCER-294-IBUS6H5LUW3LLGQ77JNQBEL74UE2BN3AO433QECSA2A76NFISVIQ\m\maven-enforcer-plugin\target\invoker-reports\BUILD-require-profile-ids-exist_failure.xml, f:\jenkins\jenkins-slave\workspace\aven-enforcer_MENFORCER-294-IBUS6H5LUW3LLGQ77JNQBEL74UE2BN3AO433QECSA2A76NFISVIQ\m\maven-enforcer-plugin\target\invoker-reports\BUILD-require-profile-ids-exist_success.xml, f:\jenkins\jenkins-slave\workspace\aven-enforcer_MENFORCER-294-IBUS6H5LUW3LLGQ77JNQBEL74UE2BN3AO433QECSA2A76NFISVIQ\m\maven-enforcer-plugin\target\invoker-reports\BUILD-require-property.xml, f:\jenkins\jenkins-slave\workspace\aven-enforcer_MENFORCER-294-IBUS6H5LUW3LLGQ77JNQBEL74UE2BN3AO433QECSA2A76NFISVIQ\m\maven-enforcer-plugin\target\invoker-reports\BUILD-require-release-dependencies-excludes.xml, f:\jenkins\jenkins-slave\workspace\aven-enforcer_MENFORCER-294-IBUS6H5LUW3LLGQ77JNQBEL74UE2BN3AO433QECSA2A76NFISVIQ\m\maven-enforcer-plugin\target\invoker-reports\BUILD-require-release-dependencies-excludes_failure.xml, f:\jenkins\jenkins-slave\workspace\aven-enforcer_MENFORCER-294-IBUS6H5LUW3LLGQ77JNQBEL74UE2BN3AO433QECSA2A76NFISVIQ\m\maven-enforcer-plugin\target\invoker-reports\BUILD-require-release-dependencies.xml, f:\jenkins\jenkins-slave\workspace\aven-enforcer_MENFORCER-294-IBUS6H5LUW3LLGQ77JNQBEL74UE2BN3AO433QECSA2A76NFISVIQ\m\maven-enforcer-plugin\target\invoker-reports\BUILD-require-release-version.xml, f:\jenkins\jenkins-slave\workspace\aven-enforcer_MENFORCER-294-IBUS6H5LUW3LLGQ77JNQBEL74UE2BN3AO433QECSA2A76NFISVIQ\m\maven-enforcer-plugin\target\invoker-reports\BUILD-require-same-versions_failure.xml, f:\jenkins\jenkins-slave\workspace\aven-enforcer_MENFORCER-294-IBUS6H5LUW3LLGQ77JNQBEL74UE2BN3AO433QECSA2A76NFISVIQ\m\maven-enforcer-plugin\target\invoker-reports\BUILD-require-same-versions_success.xml, f:\jenkins\jenkins-slave\workspace\aven-enforcer_MENFORCER-294-IBUS6H5LUW3LLGQ77JNQBEL74UE2BN3AO433QECSA2A76NFISVIQ\m\maven-enforcer-plugin\target\invoker-reports\BUILD-require-snapshot-version_failure.xml, f:\jenkins\jenkins-slave\workspace\aven-enforcer_MENFORCER-294-IBUS6H5LUW3LLGQ77JNQBEL74UE2BN3AO433QECSA2A76NFISVIQ\m\maven-enforcer-plugin\target\invoker-reports\BUILD-require-snapshot-version_success.xml, f:\jenkins\jenkins-slave\workspace\aven-enforcer_MENFORCER-294-IBUS6H5LUW3LLGQ77JNQBEL74UE2BN3AO433QECSA2A76NFISVIQ\m\maven-enforcer-plugin\target\invoker-reports\BUILD-require-upper-bound-dependencies-managed_failure.xml, f:\jenkins\jenkins-slave\workspace\aven-enforcer_MENFORCER-294-IBUS6H5LUW3LLGQ77JNQBEL74UE2BN3AO433QECSA2A76NFISVIQ\m\maven-enforcer-plugin\target\invoker-reports\BUILD-require-upper-bound-dependencies-managed_success.xml, f:\jenkins\jenkins-slave\workspace\aven-enforcer_MENFORCER-294-IBUS6H5LUW3LLGQ77JNQBEL74UE2BN3AO433QECSA2A76NFISVIQ\m\maven-enforcer-plugin\target\invoker-reports\BUILD-require-upper-bound-dependencies-unique_failure.xml, f:\jenkins\jenkins-slave\workspace\aven-enforcer_MENFORCER-294-IBUS6H5LUW3LLGQ77JNQBEL74UE2BN3AO433QECSA2A76NFISVIQ\m\maven-enforcer-plugin\target\invoker-reports\BUILD-require-upper-bound-dependencies-unique_success.xml, f:\jenkins\jenkins-slave\workspace\aven-enforcer_MENFORCER-294-IBUS6H5LUW3LLGQ77JNQBEL74UE2BN3AO433QECSA2A76NFISVIQ\m\maven-enforcer-plugin\target\invoker-reports\BUILD-require-upper-bound-deps_failure.xml, f:\jenkins\jenkins-slave\workspace\aven-enforcer_MENFORCER-294-IBUS6H5LUW3LLGQ77JNQBEL74UE2BN3AO433QECSA2A76NFISVIQ\m\maven-enforcer-plugin\target\invoker-reports\BUILD-require-upper-bound-deps_ignored.xml, f:\jenkins\jenkins-slave\workspace\aven-enforcer_MENFORCER-294-IBUS6H5LUW3LLGQ77JNQBEL74UE2BN3AO433QECSA2A76NFISVIQ\m\maven-enforcer-plugin\target\invoker-reports\BUILD-require-upper-bound-deps_success.xml, f:\jenkins\jenkins-slave\workspace\aven-enforcer_MENFORCER-294-IBUS6H5LUW3LLGQ77JNQBEL74UE2BN3AO433QECSA2A76NFISVIQ\m\maven-enforcer-plugin\target\invoker-reports\BUILD-resolve_collect_dependencies.xml]
[windows-jdk9] Found logs:[f:\jenkins\jenkins-slave\workspace\aven-enforcer_MENFORCER-294-IBUS6H5LUW3LLGQ77JNQBEL74UE2BN3AO433QECSA2A76NFISVIQ\m\maven-enforcer-plugin\target\it\always-fail-warn\build.log, f:\jenkins\jenkins-slave\workspace\aven-enforcer_MENFORCER-294-IBUS6H5LUW3LLGQ77JNQBEL74UE2BN3AO433QECSA2A76NFISVIQ\m\maven-enforcer-plugin\target\it\always-fail\build.log, f:\jenkins\jenkins-slave\workspace\aven-enforcer_MENFORCER-294-IBUS6H5LUW3LLGQ77JNQBEL74UE2BN3AO433QECSA2A76NFISVIQ\m\maven-enforcer-plugin\target\it\always-pass\build.log, f:\jenkins\jenkins-slave\workspace\aven-enforcer_MENFORCER-294-IBUS6H5LUW3LLGQ77JNQBEL74UE2BN3AO433QECSA2A76NFISVIQ\m\maven-enforcer-plugin\target\it\ban-distribution-management-multi-module-build\build.log, f:\jenkins\jenkins-slave\workspace\aven-enforcer_MENFORCER-294-IBUS6H5LUW3LLGQ77JNQBEL74UE2BN3AO433QECSA2A76NFISVIQ\m\maven-enforcer-plugin\target\it\ban-distribution-management-multi-module-except-site\build.log, f:\jenkins\jenkins-slave\workspace\aven-enforcer_MENFORCER-294-IBUS6H5LUW3LLGQ77JNQBEL74UE2BN3AO433QECSA2A76NFISVIQ\m\maven-enforcer-plugin\target\it\ban-distribution-management\build.log, f:\jenkins\jenkins-slave\workspace\aven-enforcer_MENFORCER-294-IBUS6H5LUW3LLGQ77JNQBEL74UE2BN3AO433QECSA2A76NFISVIQ\m\maven-enforcer-plugin\target\it\ban-pom-dependency-version\build.log, f:\jenkins\jenkins-slave\workspace\aven-enforcer_MENFORCER-294-IBUS6H5LUW3LLGQ77JNQBEL74UE2BN3AO433QECSA2A76NFISVIQ\m\maven-enforcer-plugin\target\it\ban-transitive-dependencies-fail\build.log, f:\jenkins\jenkins-slave\workspace\aven-enforcer_MENFORCER-294-IBUS6H5LUW3LLGQ77JNQBEL74UE2BN3AO433QECSA2A76NFISVIQ\m\maven-enforcer-plugin\target\it\ban-transitive-dependencies\build.log, f:\jenkins\jenkins-slave\workspace\aven-enforcer_MENFORCER-294-IBUS6H5LUW3LLGQ77JNQBEL74UE2BN3AO433QECSA2A76NFISVIQ\m\maven-enforcer-plugin\target\it\banned-dependencies-versionrange-fail\build.log, f:\jenkins\jenkins-slave\workspace\aven-enforcer_MENFORCER-294-IBUS6H5LUW3LLGQ77JNQBEL74UE2BN3AO433QECSA2A76NFISVIQ\m\maven-enforcer-plugin\target\it\banned-dependencies-versionrange\build.log, f:\jenkins\jenkins-slave\workspace\aven-enforcer_MENFORCER-294-IBUS6H5LUW3LLGQ77JNQBEL74UE2BN3AO433QECSA2A76NFISVIQ\m\maven-enforcer-plugin\target\it\banned-dependencies-wildcards\build.log, f:\jenkins\jenkins-slave\workspace\aven-enforcer_MENFORCER-294-IBUS6H5LUW3LLGQ77JNQBEL74UE2BN3AO433QECSA2A76NFISVIQ\m\maven-enforcer-plugin\target\it\banned-dependencies\build.log, f:\jenkins\jenkins-slave\workspace\aven-enforcer_MENFORCER-294-IBUS6H5LUW3LLGQ77JNQBEL74UE2BN3AO433QECSA2A76NFISVIQ\m\maven-enforcer-plugin\target\it\banned-plugins\build.log, f:\jenkins\jenkins-slave\workspace\aven-enforcer_MENFORCER-294-IBUS6H5LUW3LLGQ77JNQBEL74UE2BN3AO433QECSA2A76NFISVIQ\m\maven-enforcer-plugin\target\it\builds_a_pom_noop\build.log, f:\jenkins\jenkins-slave\workspace\aven-enforcer_MENFORCER-294-IBUS6H5LUW3LLGQ77JNQBEL74UE2BN3AO433QECSA2A76NFISVIQ\m\maven-enforcer-plugin\target\it\cli-always-fail\build.log, f:\jenkins\jenkins-slave\workspace\aven-enforcer_MENFORCER-294-IBUS6H5LUW3LLGQ77JNQBEL74UE2BN3AO433QECSA2A76NFISVIQ\m\maven-enforcer-plugin\target\it\cli-always-pass\build.log, f:\jenkins\jenkins-slave\workspace\aven-enforcer_MENFORCER-294-IBUS6H5LUW3LLGQ77JNQBEL74UE2BN3AO433QECSA2A76NFISVIQ\m\maven-enforcer-plugin\target\it\dependencies_converge\build.log, f:\jenkins\jenkins-slave\workspace\aven-enforcer_MENFORCER-294-IBUS6H5LUW3LLGQ77JNQBEL74UE2BN3AO433QECSA2A76NFISVIQ\m\maven-enforcer-plugin\target\it\dependencies_not_converging\build.log, f:\jenkins\jenkins-slave\workspace\aven-enforcer_MENFORCER-294-IBUS6H5LUW3LLGQ77JNQBEL74UE2BN3AO433QECSA2A76NFISVIQ\m\maven-enforcer-plugin\target\it\dependencies_not_converging_test_scope\build.log, f:\jenkins\jenkins-slave\workspace\aven-enforcer_MENFORCER-294-IBUS6H5LUW3LLGQ77JNQBEL74UE2BN3AO433QECSA2A76NFISVIQ\m\maven-enforcer-plugin\target\it\display-info\build.log, f:\jenkins\jenkins-slave\workspace\aven-enforcer_MENFORCER-294-IBUS6H5LUW3LLGQ77JNQBEL74UE2BN3AO433QECSA2A76NFISVIQ\m\maven-enforcer-plugin\target\it\evaluate-beanshell\build.log, f:\jenkins\jenkins-slave\workspace\aven-enforcer_MENFORCER-294-IBUS6H5LUW3LLGQ77JNQBEL74UE2BN3AO433QECSA2A76NFISVIQ\m\maven-enforcer-plugin\target\it\multimodule\build.log, f:\jenkins\jenkins-slave\workspace\aven-enforcer_MENFORCER-294-IBUS6H5LUW3LLGQ77JNQBEL74UE2BN3AO433QECSA2A76NFISVIQ\m\maven-enforcer-plugin\target\it\require-active-profile-all\build.log, f:\jenkins\jenkins-slave\workspace\aven-enforcer_MENFORCER-294-IBUS6H5LUW3LLGQ77JNQBEL74UE2BN3AO433QECSA2A76NFISVIQ\m\maven-enforcer-plugin\target\it\require-active-profile-from-settings\build.log, f:\jenkins\jenkins-slave\workspace\aven-enforcer_MENFORCER-294-IBUS6H5LUW3LLGQ77JNQBEL74UE2BN3AO433QECSA2A76NFISVIQ\m\maven-enforcer-plugin\target\it\require-active-profile\build.log, f:\jenkins\jenkins-slave\workspace\aven-enforcer_MENFORCER-294-IBUS6H5LUW3LLGQ77JNQBEL74UE2BN3AO433QECSA2A76NFISVIQ\m\maven-enforcer-plugin\target\it\require-file-checksum\build.log, f:\jenkins\jenkins-slave\workspace\aven-enforcer_MENFORCER-294-IBUS6H5LUW3LLGQ77JNQBEL74UE2BN3AO433QECSA2A76NFISVIQ\m\maven-enforcer-plugin\target\it\require-files-dont-exist\build.log, f:\jenkins\jenkins-slave\workspace\aven-enforcer_MENFORCER-294-IBUS6H5LUW3LLGQ77JNQBEL74UE2BN3AO433QECSA2A76NFISVIQ\m\maven-enforcer-plugin\target\it\require-files-exist\build.log, f:\jenkins\jenkins-slave\workspace\aven-enforcer_MENFORCER-294-IBUS6H5LUW3LLGQ77JNQBEL74UE2BN3AO433QECSA2A76NFISVIQ\m\maven-enforcer-plugin\target\it\require-files-size\build.log, f:\jenkins\jenkins-slave\workspace\aven-enforcer_MENFORCER-294-IBUS6H5LUW3LLGQ77JNQBEL74UE2BN3AO433QECSA2A76NFISVIQ\m\maven-enforcer-plugin\target\it\require-java-version\build.log, f:\jenkins\jenkins-slave\workspace\aven-enforcer_MENFORCER-294-IBUS6H5LUW3LLGQ77JNQBEL74UE2BN3AO433QECSA2A76NFISVIQ\m\maven-enforcer-plugin\target\it\require-maven-version\build.log, f:\jenkins\jenkins-slave\workspace\aven-enforcer_MENFORCER-294-IBUS6H5LUW3LLGQ77JNQBEL74UE2BN3AO433QECSA2A76NFISVIQ\m\maven-enforcer-plugin\target\it\require-no-repositories-allow-plugin-repo\build.log, f:\jenkins\jenkins-slave\workspace\aven-enforcer_MENFORCER-294-IBUS6H5LUW3LLGQ77JNQBEL74UE2BN3AO433QECSA2A76NFISVIQ\m\maven-enforcer-plugin\target\it\require-no-repositories-allow-repo\build.log, f:\jenkins\jenkins-slave\workspace\aven-enforcer_MENFORCER-294-IBUS6H5LUW3LLGQ77JNQBEL74UE2BN3AO433QECSA2A76NFISVIQ\m\maven-enforcer-plugin\target\it\require-no-repositories\build.log, f:\jenkins\jenkins-slave\workspace\aven-enforcer_MENFORCER-294-IBUS6H5LUW3LLGQ77JNQBEL74UE2BN3AO433QECSA2A76NFISVIQ\m\maven-enforcer-plugin\target\it\require-no-repositories_failure\build.log, f:\jenkins\jenkins-slave\workspace\aven-enforcer_MENFORCER-294-IBUS6H5LUW3LLGQ77JNQBEL74UE2BN3AO433QECSA2A76NFISVIQ\m\maven-enforcer-plugin\target\it\require-no-repositories_failure_allowed-plugin-repo\build.log, f:\jenkins\jenkins-slave\workspace\aven-enforcer_MENFORCER-294-IBUS6H5LUW3LLGQ77JNQBEL74UE2BN3AO433QECSA2A76NFISVIQ\m\maven-enforcer-plugin\target\it\require-no-repositories_failure_plugin-repositories\build.log, f:\jenkins\jenkins-slave\workspace\aven-enforcer_MENFORCER-294-IBUS6H5LUW3LLGQ77JNQBEL74UE2BN3AO433QECSA2A76NFISVIQ\m\maven-enforcer-plugin\target\it\require-no-repositories_failure_repositories\build.log, f:\jenkins\jenkins-slave\workspace\aven-enforcer_MENFORCER-294-IBUS6H5LUW3LLGQ77JNQBEL74UE2BN3AO433QECSA2A76NFISVIQ\m\maven-enforcer-plugin\target\it\require-no-repositories_mm\build.log, f:\jenkins\jenkins-slave\workspace\aven-enforcer_MENFORCER-294-IBUS6H5LUW3LLGQ77JNQBEL74UE2BN3AO433QECSA2A76NFISVIQ\m\maven-enforcer-plugin\target\it\require-no-repositories_mm_ci\build.log, f:\jenkins\jenkins-slave\workspace\aven-enforcer_MENFORCER-294-IBUS6H5LUW3LLGQ77JNQBEL74UE2BN3AO433QECSA2A76NFISVIQ\m\maven-enforcer-plugin\target\it\require-plugin-versions-ci\build.log, f:\jenkins\jenkins-slave\workspace\aven-enforcer_MENFORCER-294-IBUS6H5LUW3LLGQ77JNQBEL74UE2BN3AO433QECSA2A76NFISVIQ\m\maven-enforcer-plugin\target\it\require-plugin-versions-custom-packaging\build.log, f:\jenkins\jenkins-slave\workspace\aven-enforcer_MENFORCER-294-IBUS6H5LUW3LLGQ77JNQBEL74UE2BN3AO433QECSA2A76NFISVIQ\m\maven-enforcer-plugin\target\it\require-plugin-versions-expressions\build.log, f:\jenkins\jenkins-slave\workspace\aven-enforcer_MENFORCER-294-IBUS6H5LUW3LLGQ77JNQBEL74UE2BN3AO433QECSA2A76NFISVIQ\m\maven-enforcer-plugin\target\it\require-plugin-versions-mm-ci-friendly\build.log, f:\jenkins\jenkins-slave\workspace\aven-enforcer_MENFORCER-294-IBUS6H5LUW3LLGQ77JNQBEL74UE2BN3AO433QECSA2A76NFISVIQ\m\maven-enforcer-plugin\target\it\require-plugin-versions-plugin-with-extensions\build.log, f:\jenkins\jenkins-slave\workspace\aven-enforcer_MENFORCER-294-IBUS6H5LUW3LLGQ77JNQBEL74UE2BN3AO433QECSA2A76NFISVIQ\m\maven-enforcer-plugin\target\it\require-plugin-versions-plugin-with-integration-test-lifecycle\build.log, f:\jenkins\jenkins-slave\workspace\aven-enforcer_MENFORCER-294-IBUS6H5LUW3LLGQ77JNQBEL74UE2BN3AO433QECSA2A76NFISVIQ\m\maven-enforcer-plugin\target\it\require-plugin-versions-projectGAVexpressions\build.log, f:\jenkins\jenkins-slave\workspace\aven-enforcer_MENFORCER-294-IBUS6H5LUW3LLGQ77JNQBEL74UE2BN3AO433QECSA2A76NFISVIQ\m\maven-enforcer-plugin\target\it\require-plugin-versions\build.log, f:\jenkins\jenkins-slave\workspace\aven-enforcer_MENFORCER-294-IBUS6H5LUW3LLGQ77JNQBEL74UE2BN3AO433QECSA2A76NFISVIQ\m\maven-enforcer-plugin\target\it\require-profile-ids-exist_failure\build.log, f:\jenkins\jenkins-slave\workspace\aven-enforcer_MENFORCER-294-IBUS6H5LUW3LLGQ77JNQBEL74UE2BN3AO433QECSA2A76NFISVIQ\m\maven-enforcer-plugin\target\it\require-profile-ids-exist_success\build.log, f:\jenkins\jenkins-slave\workspace\aven-enforcer_MENFORCER-294-IBUS6H5LUW3LLGQ77JNQBEL74UE2BN3AO433QECSA2A76NFISVIQ\m\maven-enforcer-plugin\target\it\require-property\build.log, f:\jenkins\jenkins-slave\workspace\aven-enforcer_MENFORCER-294-IBUS6H5LUW3LLGQ77JNQBEL74UE2BN3AO433QECSA2A76NFISVIQ\m\maven-enforcer-plugin\target\it\require-release-dependencies-excludes\build.log, f:\jenkins\jenkins-slave\workspace\aven-enforcer_MENFORCER-294-IBUS6H5LUW3LLGQ77JNQBEL74UE2BN3AO433QECSA2A76NFISVIQ\m\maven-enforcer-plugin\target\it\require-release-dependencies-excludes_failure\build.log, f:\jenkins\jenkins-slave\workspace\aven-enforcer_MENFORCER-294-IBUS6H5LUW3LLGQ77JNQBEL74UE2BN3AO433QECSA2A76NFISVIQ\m\maven-enforcer-plugin\target\it\require-release-dependencies\build.log, f:\jenkins\jenkins-slave\workspace\aven-enforcer_MENFORCER-294-IBUS6H5LUW3LLGQ77JNQBEL74UE2BN3AO433QECSA2A76NFISVIQ\m\maven-enforcer-plugin\target\it\require-release-version\build.log, f:\jenkins\jenkins-slave\workspace\aven-enforcer_MENFORCER-294-IBUS6H5LUW3LLGQ77JNQBEL74UE2BN3AO433QECSA2A76NFISVIQ\m\maven-enforcer-plugin\target\it\require-same-versions_failure\build.log, f:\jenkins\jenkins-slave\workspace\aven-enforcer_MENFORCER-294-IBUS6H5LUW3LLGQ77JNQBEL74UE2BN3AO433QECSA2A76NFISVIQ\m\maven-enforcer-plugin\target\it\require-same-versions_success\build.log, f:\jenkins\jenkins-slave\workspace\aven-enforcer_MENFORCER-294-IBUS6H5LUW3LLGQ77JNQBEL74UE2BN3AO433QECSA2A76NFISVIQ\m\maven-enforcer-plugin\target\it\require-snapshot-version_failure\build.log, f:\jenkins\jenkins-slave\workspace\aven-enforcer_MENFORCER-294-IBUS6H5LUW3LLGQ77JNQBEL74UE2BN3AO433QECSA2A76NFISVIQ\m\maven-enforcer-plugin\target\it\require-snapshot-version_success\build.log, f:\jenkins\jenkins-slave\workspace\aven-enforcer_MENFORCER-294-IBUS6H5LUW3LLGQ77JNQBEL74UE2BN3AO433QECSA2A76NFISVIQ\m\maven-enforcer-plugin\target\it\require-upper-bound-dependencies-managed_failure\build.log, f:\jenkins\jenkins-slave\workspace\aven-enforcer_MENFORCER-294-IBUS6H5LUW3LLGQ77JNQBEL74UE2BN3AO433QECSA2A76NFISVIQ\m\maven-enforcer-plugin\target\it\require-upper-bound-dependencies-managed_success\build.log, f:\jenkins\jenkins-slave\workspace\aven-enforcer_MENFORCER-294-IBUS6H5LUW3LLGQ77JNQBEL74UE2BN3AO433QECSA2A76NFISVIQ\m\maven-enforcer-plugin\target\it\require-upper-bound-dependencies-unique_failure\build.log, f:\jenkins\jenkins-slave\workspace\aven-enforcer_MENFORCER-294-IBUS6H5LUW3LLGQ77JNQBEL74UE2BN3AO433QECSA2A76NFISVIQ\m\maven-enforcer-plugin\target\it\require-upper-bound-dependencies-unique_success\build.log, f:\jenkins\jenkins-slave\workspace\aven-enforcer_MENFORCER-294-IBUS6H5LUW3LLGQ77JNQBEL74UE2BN3AO433QECSA2A76NFISVIQ\m\maven-enforcer-plugin\target\it\require-upper-bound-deps_failure\build.log, f:\jenkins\jenkins-slave\workspace\aven-enforcer_MENFORCER-294-IBUS6H5LUW3LLGQ77JNQBEL74UE2BN3AO433QECSA2A76NFISVIQ\m\maven-enforcer-plugin\target\it\require-upper-bound-deps_ignored\build.log, f:\jenkins\jenkins-slave\workspace\aven-enforcer_MENFORCER-294-IBUS6H5LUW3LLGQ77JNQBEL74UE2BN3AO433QECSA2A76NFISVIQ\m\maven-enforcer-plugin\target\it\require-upper-bound-deps_success\build.log, f:\jenkins\jenkins-slave\workspace\aven-enforcer_MENFORCER-294-IBUS6H5LUW3LLGQ77JNQBEL74UE2BN3AO433QECSA2A76NFISVIQ\m\maven-enforcer-plugin\target\it\resolve_collect_dependencies\build.log]
[windows-jdk9] Finished parsing Maven Invoker results (found 68)
[windows-jdk9] [withMaven] junitPublisher - Archive test results for Maven artifact org.apache.maven.enforcer:enforcer-api:3.0.0-SNAPSHOT generated by maven-surefire-plugin:test (default-test): m\enforcer-api\target\surefire-reports\*.xml
[windows-jdk9] Recording test results
[windows-jdk9] None of the test reports contained any result
[windows-jdk9] [withMaven] junitPublisher - Archive test results for Maven artifact org.apache.maven.enforcer:enforcer-rules:3.0.0-SNAPSHOT generated by maven-surefire-plugin:test (default-test): m\enforcer-rules\target\surefire-reports\*.xml
[windows-jdk9] Recording test results
[windows-jdk9] [withMaven] junitPublisher - Archive test results for Maven artifact org.apache.maven.plugins:maven-enforcer-plugin:3.0.0-SNAPSHOT generated by maven-surefire-plugin:test (default-test): m\maven-enforcer-plugin\target\surefire-reports\*.xml
[windows-jdk9] Recording test results
[Pipeline] [windows-jdk9] // withMaven
[Pipeline] [windows-jdk9] cleanWs
[windows-jdk9] [WS-CLEANUP] Deleting project workspace...[WS-CLEANUP] done
[Pipeline] [windows-jdk9] }
[Pipeline] [windows-jdk9] // stage
[Pipeline] [windows-jdk9] }
[Pipeline] [windows-jdk9] // node
[Pipeline] [windows-jdk9] }
[windows-jdk10] [INFO]           require-plugin-versions-mm-ci-friendly\pom.xml ... SUCCESS (7.9 s)
[windows-jdk10] [INFO] Building: require-plugin-versions-plugin-with-extensions\pom.xml
[windows-jdk10] [INFO]           require-plugin-versions-plugin-with-extensions\pom.xml SUCCESS (9.5 s)
[windows-jdk10] [INFO] Building: require-plugin-versions-plugin-with-integration-test-lifecycle\pom.xml
[windows-jdk10] [INFO]           require-plugin-versions-plugin-with-integration-test-lifecycle\pom.xml SUCCESS (21.7 s)
[windows-jdk10] [INFO] Building: require-plugin-versions-projectGAVexpressions\pom.xml
[windows-jdk10] [INFO]           require-plugin-versions-projectGAVexpressions\pom.xml SUCCESS (6.6 s)
[windows-jdk10] [INFO] Building: require-profile-ids-exist_failure\pom.xml
[windows-jdk10] [INFO] run post-build script verify.groovy
[windows-jdk10] [INFO]           require-profile-ids-exist_failure\pom.xml ........ SUCCESS (5.9 s)
[windows-jdk10] [INFO] Building: require-profile-ids-exist_success\pom.xml
[windows-jdk10] [INFO]           require-profile-ids-exist_success\pom.xml ........ SUCCESS (5.9 s)
[windows-jdk10] [INFO] Building: require-property\pom.xml
[windows-jdk10] [INFO]           require-property\pom.xml ......................... SUCCESS (5.4 s)
[windows-jdk10] [INFO] Building: require-release-dependencies\pom.xml
[windows-jdk10] [INFO]           require-release-dependencies\pom.xml ............. SUCCESS (5.5 s)
[windows-jdk10] [INFO] Building: require-release-dependencies-excludes\pom.xml
[windows-jdk10] [INFO] snapshot org.apache.maven.plugins.enforcer.its:menforcer85_api:1.0-SNAPSHOT: checking for updates from apache-snapshots
[windows-jdk10] [INFO] snapshot org.apache.maven.plugins.enforcer.its:menforcer85_api:1.0-SNAPSHOT: checking for updates from Nexus
[windows-jdk10] [INFO] artifact org.apache.maven.plugins.enforcer.its.menforcer85_api:1.0-SNAPSHOT: checking for updates from central
[windows-jdk10] [INFO] org.apache.maven.plugins.enforcer.its.menforcer85_api.1.0-SNAPSHOT: checking for updates from central
[windows-jdk10] [INFO]           require-release-dependencies-excludes\pom.xml .... SUCCESS (5.8 s)
[windows-jdk10] [INFO] Building: require-release-dependencies-excludes_failure\pom.xml
[windows-jdk10] [INFO]           require-release-dependencies-excludes_failure\pom.xml SUCCESS (5.7 s)
[windows-jdk10] [INFO] Building: require-release-version\pom.xml
[windows-jdk10] [INFO]           require-release-version\pom.xml .................. SUCCESS (5.0 s)
[windows-jdk10] [INFO] Building: require-same-versions_failure\pom.xml
[windows-jdk10] [INFO]           require-same-versions_failure\pom.xml ............ SUCCESS (5.5 s)
[windows-jdk10] [INFO] Building: require-same-versions_success\pom.xml
[windows-jdk10] [INFO]           require-same-versions_success\pom.xml ............ SUCCESS (5.5 s)
[windows-jdk10] [INFO] Building: require-snapshot-version_failure\pom.xml
[windows-jdk10] [INFO]           require-snapshot-version_failure\pom.xml ......... SUCCESS (5.7 s)
[windows-jdk10] [INFO] Building: require-snapshot-version_success\pom.xml
[windows-jdk10] [INFO]           require-snapshot-version_success\pom.xml ......... SUCCESS (5.4 s)
[windows-jdk10] [INFO] Building: require-upper-bound-dependencies-managed_failure\pom.xml
[windows-jdk10] [INFO] run post-build script verify.groovy
[windows-jdk10] [INFO]           require-upper-bound-dependencies-managed_failure\pom.xml SUCCESS (5.5 s)
[windows-jdk10] [INFO] Building: require-upper-bound-dependencies-managed_success\pom.xml
[windows-jdk10] [INFO]           require-upper-bound-dependencies-managed_success\pom.xml SUCCESS (5.4 s)
[windows-jdk10] [INFO] Building: require-upper-bound-dependencies-unique_failure\pom.xml
[windows-jdk10] [INFO] snapshot org.apache.maven.plugins.enforcer.its:menforcer134_project:1.0-SNAPSHOT: checking for updates from apache-snapshots
[windows-jdk10] [INFO] snapshot org.apache.maven.plugins.enforcer.its:menforcer134_project:1.0-SNAPSHOT: checking for updates from Nexus
[windows-jdk10] [INFO] artifact org.apache.maven.plugins.enforcer.its.menforcer134_project:1.0-SNAPSHOT: checking for updates from central
[windows-jdk10] [INFO] org.apache.maven.plugins.enforcer.its.menforcer134_project.1.0-SNAPSHOT: checking for updates from central
[windows-jdk10] [INFO] snapshot org.apache.maven.plugins.enforcer.its:menforcer134_modelbuilder:1.0-SNAPSHOT: checking for updates from apache-snapshots
[windows-jdk10] [INFO] snapshot org.apache.maven.plugins.enforcer.its:menforcer134_modelbuilder:1.0-SNAPSHOT: checking for updates from Nexus
[windows-jdk10] [INFO] artifact org.apache.maven.plugins.enforcer.its.menforcer134_modelbuilder:1.0-SNAPSHOT: checking for updates from central
[windows-jdk10] [INFO] org.apache.maven.plugins.enforcer.its.menforcer134_modelbuilder.1.0-SNAPSHOT: checking for updates from central
[windows-jdk10] [INFO] snapshot org.apache.maven.plugins.enforcer.its:menforcer134_model:1.0-SNAPSHOT: checking for updates from apache-snapshots
[windows-jdk10] [INFO] snapshot org.apache.maven.plugins.enforcer.its:menforcer134_model:1.0-SNAPSHOT: checking for updates from Nexus
[windows-jdk10] [INFO] artifact org.apache.maven.plugins.enforcer.its.menforcer134_model:1.0-SNAPSHOT: checking for updates from central
[windows-jdk10] [INFO] org.apache.maven.plugins.enforcer.its.menforcer134_model.1.0-SNAPSHOT: checking for updates from central
[windows-jdk10] [INFO] run post-build script verify.groovy
[windows-jdk10] [INFO]           require-upper-bound-dependencies-unique_failure\pom.xml SUCCESS (6.8 s)
[windows-jdk10] [INFO] Building: require-upper-bound-dependencies-unique_success\pom.xml
[windows-jdk10] [INFO]           require-upper-bound-dependencies-unique_success\pom.xml SUCCESS (5.6 s)
[windows-jdk10] [INFO] Building: require-upper-bound-deps_failure\pom.xml
[windows-jdk10] [INFO] run post-build script verify.groovy
[windows-jdk10] [INFO]           require-upper-bound-deps_failure\pom.xml ......... SUCCESS (5.7 s)
[windows-jdk10] [INFO] Building: require-upper-bound-deps_ignored\pom.xml
[windows-jdk10] [INFO] run post-build script verify.groovy
[windows-jdk10] [INFO]           require-upper-bound-deps_ignored\pom.xml ......... SUCCESS (5.3 s)
[windows-jdk10] [INFO] Building: require-upper-bound-deps_success\pom.xml
[windows-jdk10] [INFO]           require-upper-bound-deps_success\pom.xml ......... SUCCESS (5.4 s)
[windows-jdk10] [INFO] Building: resolve_collect_dependencies\pom.xml
[windows-jdk10] [INFO] run post-build script verify.groovy
[windows-jdk10] [INFO]           resolve_collect_dependencies\pom.xml ............. SUCCESS (10.0 s)
[windows-jdk10] [INFO] -------------------------------------------------
[windows-jdk10] [INFO] Build Summary:
[windows-jdk10] [INFO]   Passed: 68, Failed: 0, Errors: 0, Skipped: 0
[windows-jdk10] [INFO] -------------------------------------------------
[windows-jdk10] [INFO] 
[windows-jdk10] [INFO] --- mrm-maven-plugin:1.0.0:stop (default) @ maven-enforcer-plugin ---
[windows-jdk10] [INFO] Stopping Mock Repository Manager on http://localhost:50550
[windows-jdk10] [INFO] Mock Repository Manager http://localhost:50550 is stopped.
[windows-jdk10] [INFO] 
[windows-jdk10] [INFO] --- maven-checkstyle-plugin:3.0.0:check (checkstyle-check) @ maven-enforcer-plugin ---
[windows-jdk10] [INFO] ------------------------------------------------------------------------
[windows-jdk10] [INFO] Reactor Summary:
[windows-jdk10] [INFO] 
[windows-jdk10] [INFO] Apache Maven Enforcer .............................. SUCCESS [ 37.244 s]
[windows-jdk10] [INFO] Apache Maven Enforcer API .......................... SUCCESS [  9.550 s]
[windows-jdk10] [INFO] Apache Maven Enforcer Built-In Rules ............... SUCCESS [ 21.822 s]
[windows-jdk10] [INFO] Apache Maven Enforcer Plugin ....................... SUCCESS [07:38 min]
[windows-jdk10] [INFO] ------------------------------------------------------------------------
[windows-jdk10] [INFO] BUILD SUCCESS
[windows-jdk10] [INFO] ------------------------------------------------------------------------
[windows-jdk10] [INFO] Total time: 08:48 min
[windows-jdk10] [INFO] Finished at: 2018-08-16T22:29:58-07:00
[windows-jdk10] [INFO] Final Memory: 51M/177M
[windows-jdk10] [INFO] ------------------------------------------------------------------------
[windows-jdk10] [INFO] [jenkins-event-spy] Generated F:\jenkins\jenkins-slave\workspace\aven-enforcer_MENFORCER-294-IBUS6H5LUW3LLGQ77JNQBEL74UE2BN3AO433QECSA2A76NFISVIQ@tmp\withMaven28c0e6d6\maven-spy-20180816-222109-32710165901643769453702.log
[Pipeline] [windows-jdk10] }
[Pipeline] [windows-jdk10] // dir
[Pipeline] [windows-jdk10] }
[windows-jdk10] [withMaven] invokerPublisher - Archive invoker results for Maven artifact MavenArtifact{org.apache.maven.plugins:maven-enforcer-plugin::3.0.0-SNAPSHOT(version: 3.0.0-SNAPSHOT, snapshot:false) } generated by PluginInvocation{org.apache.maven.plugins:maven-invoker-plugin:3.0.1@run  integration-test}: m\maven-enforcer-plugin\target\invoker-reports\*.xml
[windows-jdk10] performing MavenInvokerRecorder, reportsFilenamePattern:'**/m\maven-enforcer-plugin\target\invoker-reports/BUILD*.xml', invokerBuildDir:'**/m\maven-enforcer-plugin\target\it'
[windows-jdk10] Found reports:[f:\jenkins\jenkins-slave\workspace\aven-enforcer_MENFORCER-294-IBUS6H5LUW3LLGQ77JNQBEL74UE2BN3AO433QECSA2A76NFISVIQ\m\maven-enforcer-plugin\target\invoker-reports\BUILD-always-fail-warn.xml, f:\jenkins\jenkins-slave\workspace\aven-enforcer_MENFORCER-294-IBUS6H5LUW3LLGQ77JNQBEL74UE2BN3AO433QECSA2A76NFISVIQ\m\maven-enforcer-plugin\target\invoker-reports\BUILD-always-fail.xml, f:\jenkins\jenkins-slave\workspace\aven-enforcer_MENFORCER-294-IBUS6H5LUW3LLGQ77JNQBEL74UE2BN3AO433QECSA2A76NFISVIQ\m\maven-enforcer-plugin\target\invoker-reports\BUILD-always-pass.xml, f:\jenkins\jenkins-slave\workspace\aven-enforcer_MENFORCER-294-IBUS6H5LUW3LLGQ77JNQBEL74UE2BN3AO433QECSA2A76NFISVIQ\m\maven-enforcer-plugin\target\invoker-reports\BUILD-ban-distribution-management-multi-module-build.xml, f:\jenkins\jenkins-slave\workspace\aven-enforcer_MENFORCER-294-IBUS6H5LUW3LLGQ77JNQBEL74UE2BN3AO433QECSA2A76NFISVIQ\m\maven-enforcer-plugin\target\invoker-reports\BUILD-ban-distribution-management-multi-module-except-site.xml, f:\jenkins\jenkins-slave\workspace\aven-enforcer_MENFORCER-294-IBUS6H5LUW3LLGQ77JNQBEL74UE2BN3AO433QECSA2A76NFISVIQ\m\maven-enforcer-plugin\target\invoker-reports\BUILD-ban-distribution-management.xml, f:\jenkins\jenkins-slave\workspace\aven-enforcer_MENFORCER-294-IBUS6H5LUW3LLGQ77JNQBEL74UE2BN3AO433QECSA2A76NFISVIQ\m\maven-enforcer-plugin\target\invoker-reports\BUILD-ban-pom-dependency-version.xml, f:\jenkins\jenkins-slave\workspace\aven-enforcer_MENFORCER-294-IBUS6H5LUW3LLGQ77JNQBEL74UE2BN3AO433QECSA2A76NFISVIQ\m\maven-enforcer-plugin\target\invoker-reports\BUILD-ban-transitive-dependencies-fail.xml, f:\jenkins\jenkins-slave\workspace\aven-enforcer_MENFORCER-294-IBUS6H5LUW3LLGQ77JNQBEL74UE2BN3AO433QECSA2A76NFISVIQ\m\maven-enforcer-plugin\target\invoker-reports\BUILD-ban-transitive-dependencies.xml, f:\jenkins\jenkins-slave\workspace\aven-enforcer_MENFORCER-294-IBUS6H5LUW3LLGQ77JNQBEL74UE2BN3AO433QECSA2A76NFISVIQ\m\maven-enforcer-plugin\target\invoker-reports\BUILD-banned-dependencies-versionrange-fail.xml, f:\jenkins\jenkins-slave\workspace\aven-enforcer_MENFORCER-294-IBUS6H5LUW3LLGQ77JNQBEL74UE2BN3AO433QECSA2A76NFISVIQ\m\maven-enforcer-plugin\target\invoker-reports\BUILD-banned-dependencies-versionrange.xml, f:\jenkins\jenkins-slave\workspace\aven-enforcer_MENFORCER-294-IBUS6H5LUW3LLGQ77JNQBEL74UE2BN3AO433QECSA2A76NFISVIQ\m\maven-enforcer-plugin\target\invoker-reports\BUILD-banned-dependencies-wildcards.xml, f:\jenkins\jenkins-slave\workspace\aven-enforcer_MENFORCER-294-IBUS6H5LUW3LLGQ77JNQBEL74UE2BN3AO433QECSA2A76NFISVIQ\m\maven-enforcer-plugin\target\invoker-reports\BUILD-banned-dependencies.xml, f:\jenkins\jenkins-slave\workspace\aven-enforcer_MENFORCER-294-IBUS6H5LUW3LLGQ77JNQBEL74UE2BN3AO433QECSA2A76NFISVIQ\m\maven-enforcer-plugin\target\invoker-reports\BUILD-banned-plugins.xml, f:\jenkins\jenkins-slave\workspace\aven-enforcer_MENFORCER-294-IBUS6H5LUW3LLGQ77JNQBEL74UE2BN3AO433QECSA2A76NFISVIQ\m\maven-enforcer-plugin\target\invoker-reports\BUILD-builds_a_pom_noop.xml, f:\jenkins\jenkins-slave\workspace\aven-enforcer_MENFORCER-294-IBUS6H5LUW3LLGQ77JNQBEL74UE2BN3AO433QECSA2A76NFISVIQ\m\maven-enforcer-plugin\target\invoker-reports\BUILD-cli-always-fail.xml, f:\jenkins\jenkins-slave\workspace\aven-enforcer_MENFORCER-294-IBUS6H5LUW3LLGQ77JNQBEL74UE2BN3AO433QECSA2A76NFISVIQ\m\maven-enforcer-plugin\target\invoker-reports\BUILD-cli-always-pass.xml, f:\jenkins\jenkins-slave\workspace\aven-enforcer_MENFORCER-294-IBUS6H5LUW3LLGQ77JNQBEL74UE2BN3AO433QECSA2A76NFISVIQ\m\maven-enforcer-plugin\target\invoker-reports\BUILD-dependencies_converge.xml, f:\jenkins\jenkins-slave\workspace\aven-enforcer_MENFORCER-294-IBUS6H5LUW3LLGQ77JNQBEL74UE2BN3AO433QECSA2A76NFISVIQ\m\maven-enforcer-plugin\target\invoker-reports\BUILD-dependencies_not_converging.xml, f:\jenkins\jenkins-slave\workspace\aven-enforcer_MENFORCER-294-IBUS6H5LUW3LLGQ77JNQBEL74UE2BN3AO433QECSA2A76NFISVIQ\m\maven-enforcer-plugin\target\invoker-reports\BUILD-dependencies_not_converging_test_scope.xml, f:\jenkins\jenkins-slave\workspace\aven-enforcer_MENFORCER-294-IBUS6H5LUW3LLGQ77JNQBEL74UE2BN3AO433QECSA2A76NFISVIQ\m\maven-enforcer-plugin\target\invoker-reports\BUILD-display-info.xml, f:\jenkins\jenkins-slave\workspace\aven-enforcer_MENFORCER-294-IBUS6H5LUW3LLGQ77JNQBEL74UE2BN3AO433QECSA2A76NFISVIQ\m\maven-enforcer-plugin\target\invoker-reports\BUILD-evaluate-beanshell.xml, f:\jenkins\jenkins-slave\workspace\aven-enforcer_MENFORCER-294-IBUS6H5LUW3LLGQ77JNQBEL74UE2BN3AO433QECSA2A76NFISVIQ\m\maven-enforcer-plugin\target\invoker-reports\BUILD-multimodule.xml, f:\jenkins\jenkins-slave\workspace\aven-enforcer_MENFORCER-294-IBUS6H5LUW3LLGQ77JNQBEL74UE2BN3AO433QECSA2A76NFISVIQ\m\maven-enforcer-plugin\target\invoker-reports\BUILD-require-active-profile-all.xml, f:\jenkins\jenkins-slave\workspace\aven-enforcer_MENFORCER-294-IBUS6H5LUW3LLGQ77JNQBEL74UE2BN3AO433QECSA2A76NFISVIQ\m\maven-enforcer-plugin\target\invoker-reports\BUILD-require-active-profile-from-settings.xml, f:\jenkins\jenkins-slave\workspace\aven-enforcer_MENFORCER-294-IBUS6H5LUW3LLGQ77JNQBEL74UE2BN3AO433QECSA2A76NFISVIQ\m\maven-enforcer-plugin\target\invoker-reports\BUILD-require-active-profile.xml, f:\jenkins\jenkins-slave\workspace\aven-enforcer_MENFORCER-294-IBUS6H5LUW3LLGQ77JNQBEL74UE2BN3AO433QECSA2A76NFISVIQ\m\maven-enforcer-plugin\target\invoker-reports\BUILD-require-file-checksum.xml, f:\jenkins\jenkins-slave\workspace\aven-enforcer_MENFORCER-294-IBUS6H5LUW3LLGQ77JNQBEL74UE2BN3AO433QECSA2A76NFISVIQ\m\maven-enforcer-plugin\target\invoker-reports\BUILD-require-files-dont-exist.xml, f:\jenkins\jenkins-slave\workspace\aven-enforcer_MENFORCER-294-IBUS6H5LUW3LLGQ77JNQBEL74UE2BN3AO433QECSA2A76NFISVIQ\m\maven-enforcer-plugin\target\invoker-reports\BUILD-require-files-exist.xml, f:\jenkins\jenkins-slave\workspace\aven-enforcer_MENFORCER-294-IBUS6H5LUW3LLGQ77JNQBEL74UE2BN3AO433QECSA2A76NFISVIQ\m\maven-enforcer-plugin\target\invoker-reports\BUILD-require-files-size.xml, f:\jenkins\jenkins-slave\workspace\aven-enforcer_MENFORCER-294-IBUS6H5LUW3LLGQ77JNQBEL74UE2BN3AO433QECSA2A76NFISVIQ\m\maven-enforcer-plugin\target\invoker-reports\BUILD-require-java-version.xml, f:\jenkins\jenkins-slave\workspace\aven-enforcer_MENFORCER-294-IBUS6H5LUW3LLGQ77JNQBEL74UE2BN3AO433QECSA2A76NFISVIQ\m\maven-enforcer-plugin\target\invoker-reports\BUILD-require-maven-version.xml, f:\jenkins\jenkins-slave\workspace\aven-enforcer_MENFORCER-294-IBUS6H5LUW3LLGQ77JNQBEL74UE2BN3AO433QECSA2A76NFISVIQ\m\maven-enforcer-plugin\target\invoker-reports\BUILD-require-no-repositories-allow-plugin-repo.xml, f:\jenkins\jenkins-slave\workspace\aven-enforcer_MENFORCER-294-IBUS6H5LUW3LLGQ77JNQBEL74UE2BN3AO433QECSA2A76NFISVIQ\m\maven-enforcer-plugin\target\invoker-reports\BUILD-require-no-repositories-allow-repo.xml, f:\jenkins\jenkins-slave\workspace\aven-enforcer_MENFORCER-294-IBUS6H5LUW3LLGQ77JNQBEL74UE2BN3AO433QECSA2A76NFISVIQ\m\maven-enforcer-plugin\target\invoker-reports\BUILD-require-no-repositories.xml, f:\jenkins\jenkins-slave\workspace\aven-enforcer_MENFORCER-294-IBUS6H5LUW3LLGQ77JNQBEL74UE2BN3AO433QECSA2A76NFISVIQ\m\maven-enforcer-plugin\target\invoker-reports\BUILD-require-no-repositories_failure.xml, f:\jenkins\jenkins-slave\workspace\aven-enforcer_MENFORCER-294-IBUS6H5LUW3LLGQ77JNQBEL74UE2BN3AO433QECSA2A76NFISVIQ\m\maven-enforcer-plugin\target\invoker-reports\BUILD-require-no-repositories_failure_allowed-plugin-repo.xml, f:\jenkins\jenkins-slave\workspace\aven-enforcer_MENFORCER-294-IBUS6H5LUW3LLGQ77JNQBEL74UE2BN3AO433QECSA2A76NFISVIQ\m\maven-enforcer-plugin\target\invoker-reports\BUILD-require-no-repositories_failure_plugin-repositories.xml, f:\jenkins\jenkins-slave\workspace\aven-enforcer_MENFORCER-294-IBUS6H5LUW3LLGQ77JNQBEL74UE2BN3AO433QECSA2A76NFISVIQ\m\maven-enforcer-plugin\target\invoker-reports\BUILD-require-no-repositories_failure_repositories.xml, f:\jenkins\jenkins-slave\workspace\aven-enforcer_MENFORCER-294-IBUS6H5LUW3LLGQ77JNQBEL74UE2BN3AO433QECSA2A76NFISVIQ\m\maven-enforcer-plugin\target\invoker-reports\BUILD-require-no-repositories_mm.xml, f:\jenkins\jenkins-slave\workspace\aven-enforcer_MENFORCER-294-IBUS6H5LUW3LLGQ77JNQBEL74UE2BN3AO433QECSA2A76NFISVIQ\m\maven-enforcer-plugin\target\invoker-reports\BUILD-require-no-repositories_mm_ci.xml, f:\jenkins\jenkins-slave\workspace\aven-enforcer_MENFORCER-294-IBUS6H5LUW3LLGQ77JNQBEL74UE2BN3AO433QECSA2A76NFISVIQ\m\maven-enforcer-plugin\target\invoker-reports\BUILD-require-plugin-versions-ci.xml, f:\jenkins\jenkins-slave\workspace\aven-enforcer_MENFORCER-294-IBUS6H5LUW3LLGQ77JNQBEL74UE2BN3AO433QECSA2A76NFISVIQ\m\maven-enforcer-plugin\target\invoker-reports\BUILD-require-plugin-versions-custom-packaging.xml, f:\jenkins\jenkins-slave\workspace\aven-enforcer_MENFORCER-294-IBUS6H5LUW3LLGQ77JNQBEL74UE2BN3AO433QECSA2A76NFISVIQ\m\maven-enforcer-plugin\target\invoker-reports\BUILD-require-plugin-versions-expressions.xml, f:\jenkins\jenkins-slave\workspace\aven-enforcer_MENFORCER-294-IBUS6H5LUW3LLGQ77JNQBEL74UE2BN3AO433QECSA2A76NFISVIQ\m\maven-enforcer-plugin\target\invoker-reports\BUILD-require-plugin-versions-mm-ci-friendly.xml, f:\jenkins\jenkins-slave\workspace\aven-enforcer_MENFORCER-294-IBUS6H5LUW3LLGQ77JNQBEL74UE2BN3AO433QECSA2A76NFISVIQ\m\maven-enforcer-plugin\target\invoker-reports\BUILD-require-plugin-versions-plugin-with-extensions.xml, f:\jenkins\jenkins-slave\workspace\aven-enforcer_MENFORCER-294-IBUS6H5LUW3LLGQ77JNQBEL74UE2BN3AO433QECSA2A76NFISVIQ\m\maven-enforcer-plugin\target\invoker-reports\BUILD-require-plugin-versions-plugin-with-integration-test-lifecycle.xml, f:\jenkins\jenkins-slave\workspace\aven-enforcer_MENFORCER-294-IBUS6H5LUW3LLGQ77JNQBEL74UE2BN3AO433QECSA2A76NFISVIQ\m\maven-enforcer-plugin\target\invoker-reports\BUILD-require-plugin-versions-projectGAVexpressions.xml, f:\jenkins\jenkins-slave\workspace\aven-enforcer_MENFORCER-294-IBUS6H5LUW3LLGQ77JNQBEL74UE2BN3AO433QECSA2A76NFISVIQ\m\maven-enforcer-plugin\target\invoker-reports\BUILD-require-plugin-versions.xml, f:\jenkins\jenkins-slave\workspace\aven-enforcer_MENFORCER-294-IBUS6H5LUW3LLGQ77JNQBEL74UE2BN3AO433QECSA2A76NFISVIQ\m\maven-enforcer-plugin\target\invoker-reports\BUILD-require-profile-ids-exist_failure.xml, f:\jenkins\jenkins-slave\workspace\aven-enforcer_MENFORCER-294-IBUS6H5LUW3LLGQ77JNQBEL74UE2BN3AO433QECSA2A76NFISVIQ\m\maven-enforcer-plugin\target\invoker-reports\BUILD-require-profile-ids-exist_success.xml, f:\jenkins\jenkins-slave\workspace\aven-enforcer_MENFORCER-294-IBUS6H5LUW3LLGQ77JNQBEL74UE2BN3AO433QECSA2A76NFISVIQ\m\maven-enforcer-plugin\target\invoker-reports\BUILD-require-property.xml, f:\jenkins\jenkins-slave\workspace\aven-enforcer_MENFORCER-294-IBUS6H5LUW3LLGQ77JNQBEL74UE2BN3AO433QECSA2A76NFISVIQ\m\maven-enforcer-plugin\target\invoker-reports\BUILD-require-release-dependencies-excludes.xml, f:\jenkins\jenkins-slave\workspace\aven-enforcer_MENFORCER-294-IBUS6H5LUW3LLGQ77JNQBEL74UE2BN3AO433QECSA2A76NFISVIQ\m\maven-enforcer-plugin\target\invoker-reports\BUILD-require-release-dependencies-excludes_failure.xml, f:\jenkins\jenkins-slave\workspace\aven-enforcer_MENFORCER-294-IBUS6H5LUW3LLGQ77JNQBEL74UE2BN3AO433QECSA2A76NFISVIQ\m\maven-enforcer-plugin\target\invoker-reports\BUILD-require-release-dependencies.xml, f:\jenkins\jenkins-slave\workspace\aven-enforcer_MENFORCER-294-IBUS6H5LUW3LLGQ77JNQBEL74UE2BN3AO433QECSA2A76NFISVIQ\m\maven-enforcer-plugin\target\invoker-reports\BUILD-require-release-version.xml, f:\jenkins\jenkins-slave\workspace\aven-enforcer_MENFORCER-294-IBUS6H5LUW3LLGQ77JNQBEL74UE2BN3AO433QECSA2A76NFISVIQ\m\maven-enforcer-plugin\target\invoker-reports\BUILD-require-same-versions_failure.xml, f:\jenkins\jenkins-slave\workspace\aven-enforcer_MENFORCER-294-IBUS6H5LUW3LLGQ77JNQBEL74UE2BN3AO433QECSA2A76NFISVIQ\m\maven-enforcer-plugin\target\invoker-reports\BUILD-require-same-versions_success.xml, f:\jenkins\jenkins-slave\workspace\aven-enforcer_MENFORCER-294-IBUS6H5LUW3LLGQ77JNQBEL74UE2BN3AO433QECSA2A76NFISVIQ\m\maven-enforcer-plugin\target\invoker-reports\BUILD-require-snapshot-version_failure.xml, f:\jenkins\jenkins-slave\workspace\aven-enforcer_MENFORCER-294-IBUS6H5LUW3LLGQ77JNQBEL74UE2BN3AO433QECSA2A76NFISVIQ\m\maven-enforcer-plugin\target\invoker-reports\BUILD-require-snapshot-version_success.xml, f:\jenkins\jenkins-slave\workspace\aven-enforcer_MENFORCER-294-IBUS6H5LUW3LLGQ77JNQBEL74UE2BN3AO433QECSA2A76NFISVIQ\m\maven-enforcer-plugin\target\invoker-reports\BUILD-require-upper-bound-dependencies-managed_failure.xml, f:\jenkins\jenkins-slave\workspace\aven-enforcer_MENFORCER-294-IBUS6H5LUW3LLGQ77JNQBEL74UE2BN3AO433QECSA2A76NFISVIQ\m\maven-enforcer-plugin\target\invoker-reports\BUILD-require-upper-bound-dependencies-managed_success.xml, f:\jenkins\jenkins-slave\workspace\aven-enforcer_MENFORCER-294-IBUS6H5LUW3LLGQ77JNQBEL74UE2BN3AO433QECSA2A76NFISVIQ\m\maven-enforcer-plugin\target\invoker-reports\BUILD-require-upper-bound-dependencies-unique_failure.xml, f:\jenkins\jenkins-slave\workspace\aven-enforcer_MENFORCER-294-IBUS6H5LUW3LLGQ77JNQBEL74UE2BN3AO433QECSA2A76NFISVIQ\m\maven-enforcer-plugin\target\invoker-reports\BUILD-require-upper-bound-dependencies-unique_success.xml, f:\jenkins\jenkins-slave\workspace\aven-enforcer_MENFORCER-294-IBUS6H5LUW3LLGQ77JNQBEL74UE2BN3AO433QECSA2A76NFISVIQ\m\maven-enforcer-plugin\target\invoker-reports\BUILD-require-upper-bound-deps_failure.xml, f:\jenkins\jenkins-slave\workspace\aven-enforcer_MENFORCER-294-IBUS6H5LUW3LLGQ77JNQBEL74UE2BN3AO433QECSA2A76NFISVIQ\m\maven-enforcer-plugin\target\invoker-reports\BUILD-require-upper-bound-deps_ignored.xml, f:\jenkins\jenkins-slave\workspace\aven-enforcer_MENFORCER-294-IBUS6H5LUW3LLGQ77JNQBEL74UE2BN3AO433QECSA2A76NFISVIQ\m\maven-enforcer-plugin\target\invoker-reports\BUILD-require-upper-bound-deps_success.xml, f:\jenkins\jenkins-slave\workspace\aven-enforcer_MENFORCER-294-IBUS6H5LUW3LLGQ77JNQBEL74UE2BN3AO433QECSA2A76NFISVIQ\m\maven-enforcer-plugin\target\invoker-reports\BUILD-resolve_collect_dependencies.xml]
[windows-jdk10] Found logs:[f:\jenkins\jenkins-slave\workspace\aven-enforcer_MENFORCER-294-IBUS6H5LUW3LLGQ77JNQBEL74UE2BN3AO433QECSA2A76NFISVIQ\m\maven-enforcer-plugin\target\it\always-fail-warn\build.log, f:\jenkins\jenkins-slave\workspace\aven-enforcer_MENFORCER-294-IBUS6H5LUW3LLGQ77JNQBEL74UE2BN3AO433QECSA2A76NFISVIQ\m\maven-enforcer-plugin\target\it\always-fail\build.log, f:\jenkins\jenkins-slave\workspace\aven-enforcer_MENFORCER-294-IBUS6H5LUW3LLGQ77JNQBEL74UE2BN3AO433QECSA2A76NFISVIQ\m\maven-enforcer-plugin\target\it\always-pass\build.log, f:\jenkins\jenkins-slave\workspace\aven-enforcer_MENFORCER-294-IBUS6H5LUW3LLGQ77JNQBEL74UE2BN3AO433QECSA2A76NFISVIQ\m\maven-enforcer-plugin\target\it\ban-distribution-management-multi-module-build\build.log, f:\jenkins\jenkins-slave\workspace\aven-enforcer_MENFORCER-294-IBUS6H5LUW3LLGQ77JNQBEL74UE2BN3AO433QECSA2A76NFISVIQ\m\maven-enforcer-plugin\target\it\ban-distribution-management-multi-module-except-site\build.log, f:\jenkins\jenkins-slave\workspace\aven-enforcer_MENFORCER-294-IBUS6H5LUW3LLGQ77JNQBEL74UE2BN3AO433QECSA2A76NFISVIQ\m\maven-enforcer-plugin\target\it\ban-distribution-management\build.log, f:\jenkins\jenkins-slave\workspace\aven-enforcer_MENFORCER-294-IBUS6H5LUW3LLGQ77JNQBEL74UE2BN3AO433QECSA2A76NFISVIQ\m\maven-enforcer-plugin\target\it\ban-pom-dependency-version\build.log, f:\jenkins\jenkins-slave\workspace\aven-enforcer_MENFORCER-294-IBUS6H5LUW3LLGQ77JNQBEL74UE2BN3AO433QECSA2A76NFISVIQ\m\maven-enforcer-plugin\target\it\ban-transitive-dependencies-fail\build.log, f:\jenkins\jenkins-slave\workspace\aven-enforcer_MENFORCER-294-IBUS6H5LUW3LLGQ77JNQBEL74UE2BN3AO433QECSA2A76NFISVIQ\m\maven-enforcer-plugin\target\it\ban-transitive-dependencies\build.log, f:\jenkins\jenkins-slave\workspace\aven-enforcer_MENFORCER-294-IBUS6H5LUW3LLGQ77JNQBEL74UE2BN3AO433QECSA2A76NFISVIQ\m\maven-enforcer-plugin\target\it\banned-dependencies-versionrange-fail\build.log, f:\jenkins\jenkins-slave\workspace\aven-enforcer_MENFORCER-294-IBUS6H5LUW3LLGQ77JNQBEL74UE2BN3AO433QECSA2A76NFISVIQ\m\maven-enforcer-plugin\target\it\banned-dependencies-versionrange\build.log, f:\jenkins\jenkins-slave\workspace\aven-enforcer_MENFORCER-294-IBUS6H5LUW3LLGQ77JNQBEL74UE2BN3AO433QECSA2A76NFISVIQ\m\maven-enforcer-plugin\target\it\banned-dependencies-wildcards\build.log, f:\jenkins\jenkins-slave\workspace\aven-enforcer_MENFORCER-294-IBUS6H5LUW3LLGQ77JNQBEL74UE2BN3AO433QECSA2A76NFISVIQ\m\maven-enforcer-plugin\target\it\banned-dependencies\build.log, f:\jenkins\jenkins-slave\workspace\aven-enforcer_MENFORCER-294-IBUS6H5LUW3LLGQ77JNQBEL74UE2BN3AO433QECSA2A76NFISVIQ\m\maven-enforcer-plugin\target\it\banned-plugins\build.log, f:\jenkins\jenkins-slave\workspace\aven-enforcer_MENFORCER-294-IBUS6H5LUW3LLGQ77JNQBEL74UE2BN3AO433QECSA2A76NFISVIQ\m\maven-enforcer-plugin\target\it\builds_a_pom_noop\build.log, f:\jenkins\jenkins-slave\workspace\aven-enforcer_MENFORCER-294-IBUS6H5LUW3LLGQ77JNQBEL74UE2BN3AO433QECSA2A76NFISVIQ\m\maven-enforcer-plugin\target\it\cli-always-fail\build.log, f:\jenkins\jenkins-slave\workspace\aven-enforcer_MENFORCER-294-IBUS6H5LUW3LLGQ77JNQBEL74UE2BN3AO433QECSA2A76NFISVIQ\m\maven-enforcer-plugin\target\it\cli-always-pass\build.log, f:\jenkins\jenkins-slave\workspace\aven-enforcer_MENFORCER-294-IBUS6H5LUW3LLGQ77JNQBEL74UE2BN3AO433QECSA2A76NFISVIQ\m\maven-enforcer-plugin\target\it\dependencies_converge\build.log, f:\jenkins\jenkins-slave\workspace\aven-enforcer_MENFORCER-294-IBUS6H5LUW3LLGQ77JNQBEL74UE2BN3AO433QECSA2A76NFISVIQ\m\maven-enforcer-plugin\target\it\dependencies_not_converging\build.log, f:\jenkins\jenkins-slave\workspace\aven-enforcer_MENFORCER-294-IBUS6H5LUW3LLGQ77JNQBEL74UE2BN3AO433QECSA2A76NFISVIQ\m\maven-enforcer-plugin\target\it\dependencies_not_converging_test_scope\build.log, f:\jenkins\jenkins-slave\workspace\aven-enforcer_MENFORCER-294-IBUS6H5LUW3LLGQ77JNQBEL74UE2BN3AO433QECSA2A76NFISVIQ\m\maven-enforcer-plugin\target\it\display-info\build.log, f:\jenkins\jenkins-slave\workspace\aven-enforcer_MENFORCER-294-IBUS6H5LUW3LLGQ77JNQBEL74UE2BN3AO433QECSA2A76NFISVIQ\m\maven-enforcer-plugin\target\it\evaluate-beanshell\build.log, f:\jenkins\jenkins-slave\workspace\aven-enforcer_MENFORCER-294-IBUS6H5LUW3LLGQ77JNQBEL74UE2BN3AO433QECSA2A76NFISVIQ\m\maven-enforcer-plugin\target\it\multimodule\build.log, f:\jenkins\jenkins-slave\workspace\aven-enforcer_MENFORCER-294-IBUS6H5LUW3LLGQ77JNQBEL74UE2BN3AO433QECSA2A76NFISVIQ\m\maven-enforcer-plugin\target\it\require-active-profile-all\build.log, f:\jenkins\jenkins-slave\workspace\aven-enforcer_MENFORCER-294-IBUS6H5LUW3LLGQ77JNQBEL74UE2BN3AO433QECSA2A76NFISVIQ\m\maven-enforcer-plugin\target\it\require-active-profile-from-settings\build.log, f:\jenkins\jenkins-slave\workspace\aven-enforcer_MENFORCER-294-IBUS6H5LUW3LLGQ77JNQBEL74UE2BN3AO433QECSA2A76NFISVIQ\m\maven-enforcer-plugin\target\it\require-active-profile\build.log, f:\jenkins\jenkins-slave\workspace\aven-enforcer_MENFORCER-294-IBUS6H5LUW3LLGQ77JNQBEL74UE2BN3AO433QECSA2A76NFISVIQ\m\maven-enforcer-plugin\target\it\require-file-checksum\build.log, f:\jenkins\jenkins-slave\workspace\aven-enforcer_MENFORCER-294-IBUS6H5LUW3LLGQ77JNQBEL74UE2BN3AO433QECSA2A76NFISVIQ\m\maven-enforcer-plugin\target\it\require-files-dont-exist\build.log, f:\jenkins\jenkins-slave\workspace\aven-enforcer_MENFORCER-294-IBUS6H5LUW3LLGQ77JNQBEL74UE2BN3AO433QECSA2A76NFISVIQ\m\maven-enforcer-plugin\target\it\require-files-exist\build.log, f:\jenkins\jenkins-slave\workspace\aven-enforcer_MENFORCER-294-IBUS6H5LUW3LLGQ77JNQBEL74UE2BN3AO433QECSA2A76NFISVIQ\m\maven-enforcer-plugin\target\it\require-files-size\build.log, f:\jenkins\jenkins-slave\workspace\aven-enforcer_MENFORCER-294-IBUS6H5LUW3LLGQ77JNQBEL74UE2BN3AO433QECSA2A76NFISVIQ\m\maven-enforcer-plugin\target\it\require-java-version\build.log, f:\jenkins\jenkins-slave\workspace\aven-enforcer_MENFORCER-294-IBUS6H5LUW3LLGQ77JNQBEL74UE2BN3AO433QECSA2A76NFISVIQ\m\maven-enforcer-plugin\target\it\require-maven-version\build.log, f:\jenkins\jenkins-slave\workspace\aven-enforcer_MENFORCER-294-IBUS6H5LUW3LLGQ77JNQBEL74UE2BN3AO433QECSA2A76NFISVIQ\m\maven-enforcer-plugin\target\it\require-no-repositories-allow-plugin-repo\build.log, f:\jenkins\jenkins-slave\workspace\aven-enforcer_MENFORCER-294-IBUS6H5LUW3LLGQ77JNQBEL74UE2BN3AO433QECSA2A76NFISVIQ\m\maven-enforcer-plugin\target\it\require-no-repositories-allow-repo\build.log, f:\jenkins\jenkins-slave\workspace\aven-enforcer_MENFORCER-294-IBUS6H5LUW3LLGQ77JNQBEL74UE2BN3AO433QECSA2A76NFISVIQ\m\maven-enforcer-plugin\target\it\require-no-repositories\build.log, f:\jenkins\jenkins-slave\workspace\aven-enforcer_MENFORCER-294-IBUS6H5LUW3LLGQ77JNQBEL74UE2BN3AO433QECSA2A76NFISVIQ\m\maven-enforcer-plugin\target\it\require-no-repositories_failure\build.log, f:\jenkins\jenkins-slave\workspace\aven-enforcer_MENFORCER-294-IBUS6H5LUW3LLGQ77JNQBEL74UE2BN3AO433QECSA2A76NFISVIQ\m\maven-enforcer-plugin\target\it\require-no-repositories_failure_allowed-plugin-repo\build.log, f:\jenkins\jenkins-slave\workspace\aven-enforcer_MENFORCER-294-IBUS6H5LUW3LLGQ77JNQBEL74UE2BN3AO433QECSA2A76NFISVIQ\m\maven-enforcer-plugin\target\it\require-no-repositories_failure_plugin-repositories\build.log, f:\jenkins\jenkins-slave\workspace\aven-enforcer_MENFORCER-294-IBUS6H5LUW3LLGQ77JNQBEL74UE2BN3AO433QECSA2A76NFISVIQ\m\maven-enforcer-plugin\target\it\require-no-repositories_failure_repositories\build.log, f:\jenkins\jenkins-slave\workspace\aven-enforcer_MENFORCER-294-IBUS6H5LUW3LLGQ77JNQBEL74UE2BN3AO433QECSA2A76NFISVIQ\m\maven-enforcer-plugin\target\it\require-no-repositories_mm\build.log, f:\jenkins\jenkins-slave\workspace\aven-enforcer_MENFORCER-294-IBUS6H5LUW3LLGQ77JNQBEL74UE2BN3AO433QECSA2A76NFISVIQ\m\maven-enforcer-plugin\target\it\require-no-repositories_mm_ci\build.log, f:\jenkins\jenkins-slave\workspace\aven-enforcer_MENFORCER-294-IBUS6H5LUW3LLGQ77JNQBEL74UE2BN3AO433QECSA2A76NFISVIQ\m\maven-enforcer-plugin\target\it\require-plugin-versions-ci\build.log, f:\jenkins\jenkins-slave\workspace\aven-enforcer_MENFORCER-294-IBUS6H5LUW3LLGQ77JNQBEL74UE2BN3AO433QECSA2A76NFISVIQ\m\maven-enforcer-plugin\target\it\require-plugin-versions-custom-packaging\build.log, f:\jenkins\jenkins-slave\workspace\aven-enforcer_MENFORCER-294-IBUS6H5LUW3LLGQ77JNQBEL74UE2BN3AO433QECSA2A76NFISVIQ\m\maven-enforcer-plugin\target\it\require-plugin-versions-expressions\build.log, f:\jenkins\jenkins-slave\workspace\aven-enforcer_MENFORCER-294-IBUS6H5LUW3LLGQ77JNQBEL74UE2BN3AO433QECSA2A76NFISVIQ\m\maven-enforcer-plugin\target\it\require-plugin-versions-mm-ci-friendly\build.log, f:\jenkins\jenkins-slave\workspace\aven-enforcer_MENFORCER-294-IBUS6H5LUW3LLGQ77JNQBEL74UE2BN3AO433QECSA2A76NFISVIQ\m\maven-enforcer-plugin\target\it\require-plugin-versions-plugin-with-extensions\build.log, f:\jenkins\jenkins-slave\workspace\aven-enforcer_MENFORCER-294-IBUS6H5LUW3LLGQ77JNQBEL74UE2BN3AO433QECSA2A76NFISVIQ\m\maven-enforcer-plugin\target\it\require-plugin-versions-plugin-with-integration-test-lifecycle\build.log, f:\jenkins\jenkins-slave\workspace\aven-enforcer_MENFORCER-294-IBUS6H5LUW3LLGQ77JNQBEL74UE2BN3AO433QECSA2A76NFISVIQ\m\maven-enforcer-plugin\target\it\require-plugin-versions-projectGAVexpressions\build.log, f:\jenkins\jenkins-slave\workspace\aven-enforcer_MENFORCER-294-IBUS6H5LUW3LLGQ77JNQBEL74UE2BN3AO433QECSA2A76NFISVIQ\m\maven-enforcer-plugin\target\it\require-plugin-versions\build.log, f:\jenkins\jenkins-slave\workspace\aven-enforcer_MENFORCER-294-IBUS6H5LUW3LLGQ77JNQBEL74UE2BN3AO433QECSA2A76NFISVIQ\m\maven-enforcer-plugin\target\it\require-profile-ids-exist_failure\build.log, f:\jenkins\jenkins-slave\workspace\aven-enforcer_MENFORCER-294-IBUS6H5LUW3LLGQ77JNQBEL74UE2BN3AO433QECSA2A76NFISVIQ\m\maven-enforcer-plugin\target\it\require-profile-ids-exist_success\build.log, f:\jenkins\jenkins-slave\workspace\aven-enforcer_MENFORCER-294-IBUS6H5LUW3LLGQ77JNQBEL74UE2BN3AO433QECSA2A76NFISVIQ\m\maven-enforcer-plugin\target\it\require-property\build.log, f:\jenkins\jenkins-slave\workspace\aven-enforcer_MENFORCER-294-IBUS6H5LUW3LLGQ77JNQBEL74UE2BN3AO433QECSA2A76NFISVIQ\m\maven-enforcer-plugin\target\it\require-release-dependencies-excludes\build.log, f:\jenkins\jenkins-slave\workspace\aven-enforcer_MENFORCER-294-IBUS6H5LUW3LLGQ77JNQBEL74UE2BN3AO433QECSA2A76NFISVIQ\m\maven-enforcer-plugin\target\it\require-release-dependencies-excludes_failure\build.log, f:\jenkins\jenkins-slave\workspace\aven-enforcer_MENFORCER-294-IBUS6H5LUW3LLGQ77JNQBEL74UE2BN3AO433QECSA2A76NFISVIQ\m\maven-enforcer-plugin\target\it\require-release-dependencies\build.log, f:\jenkins\jenkins-slave\workspace\aven-enforcer_MENFORCER-294-IBUS6H5LUW3LLGQ77JNQBEL74UE2BN3AO433QECSA2A76NFISVIQ\m\maven-enforcer-plugin\target\it\require-release-version\build.log, f:\jenkins\jenkins-slave\workspace\aven-enforcer_MENFORCER-294-IBUS6H5LUW3LLGQ77JNQBEL74UE2BN3AO433QECSA2A76NFISVIQ\m\maven-enforcer-plugin\target\it\require-same-versions_failure\build.log, f:\jenkins\jenkins-slave\workspace\aven-enforcer_MENFORCER-294-IBUS6H5LUW3LLGQ77JNQBEL74UE2BN3AO433QECSA2A76NFISVIQ\m\maven-enforcer-plugin\target\it\require-same-versions_success\build.log, f:\jenkins\jenkins-slave\workspace\aven-enforcer_MENFORCER-294-IBUS6H5LUW3LLGQ77JNQBEL74UE2BN3AO433QECSA2A76NFISVIQ\m\maven-enforcer-plugin\target\it\require-snapshot-version_failure\build.log, f:\jenkins\jenkins-slave\workspace\aven-enforcer_MENFORCER-294-IBUS6H5LUW3LLGQ77JNQBEL74UE2BN3AO433QECSA2A76NFISVIQ\m\maven-enforcer-plugin\target\it\require-snapshot-version_success\build.log, f:\jenkins\jenkins-slave\workspace\aven-enforcer_MENFORCER-294-IBUS6H5LUW3LLGQ77JNQBEL74UE2BN3AO433QECSA2A76NFISVIQ\m\maven-enforcer-plugin\target\it\require-upper-bound-dependencies-managed_failure\build.log, f:\jenkins\jenkins-slave\workspace\aven-enforcer_MENFORCER-294-IBUS6H5LUW3LLGQ77JNQBEL74UE2BN3AO433QECSA2A76NFISVIQ\m\maven-enforcer-plugin\target\it\require-upper-bound-dependencies-managed_success\build.log, f:\jenkins\jenkins-slave\workspace\aven-enforcer_MENFORCER-294-IBUS6H5LUW3LLGQ77JNQBEL74UE2BN3AO433QECSA2A76NFISVIQ\m\maven-enforcer-plugin\target\it\require-upper-bound-dependencies-unique_failure\build.log, f:\jenkins\jenkins-slave\workspace\aven-enforcer_MENFORCER-294-IBUS6H5LUW3LLGQ77JNQBEL74UE2BN3AO433QECSA2A76NFISVIQ\m\maven-enforcer-plugin\target\it\require-upper-bound-dependencies-unique_success\build.log, f:\jenkins\jenkins-slave\workspace\aven-enforcer_MENFORCER-294-IBUS6H5LUW3LLGQ77JNQBEL74UE2BN3AO433QECSA2A76NFISVIQ\m\maven-enforcer-plugin\target\it\require-upper-bound-deps_failure\build.log, f:\jenkins\jenkins-slave\workspace\aven-enforcer_MENFORCER-294-IBUS6H5LUW3LLGQ77JNQBEL74UE2BN3AO433QECSA2A76NFISVIQ\m\maven-enforcer-plugin\target\it\require-upper-bound-deps_ignored\build.log, f:\jenkins\jenkins-slave\workspace\aven-enforcer_MENFORCER-294-IBUS6H5LUW3LLGQ77JNQBEL74UE2BN3AO433QECSA2A76NFISVIQ\m\maven-enforcer-plugin\target\it\require-upper-bound-deps_success\build.log, f:\jenkins\jenkins-slave\workspace\aven-enforcer_MENFORCER-294-IBUS6H5LUW3LLGQ77JNQBEL74UE2BN3AO433QECSA2A76NFISVIQ\m\maven-enforcer-plugin\target\it\resolve_collect_dependencies\build.log]
[windows-jdk10] Finished parsing Maven Invoker results (found 68)
[windows-jdk10] [withMaven] junitPublisher - Archive test results for Maven artifact org.apache.maven.enforcer:enforcer-api:3.0.0-SNAPSHOT generated by maven-surefire-plugin:test (default-test): m\enforcer-api\target\surefire-reports\*.xml
[windows-jdk10] Recording test results
[windows-jdk10] None of the test reports contained any result
[windows-jdk10] [withMaven] junitPublisher - Archive test results for Maven artifact org.apache.maven.enforcer:enforcer-rules:3.0.0-SNAPSHOT generated by maven-surefire-plugin:test (default-test): m\enforcer-rules\target\surefire-reports\*.xml
[windows-jdk10] Recording test results
[windows-jdk10] [withMaven] junitPublisher - Archive test results for Maven artifact org.apache.maven.plugins:maven-enforcer-plugin:3.0.0-SNAPSHOT generated by maven-surefire-plugin:test (default-test): m\maven-enforcer-plugin\target\surefire-reports\*.xml
[windows-jdk10] Recording test results
[Pipeline] [windows-jdk10] // withMaven
[Pipeline] [windows-jdk10] cleanWs
[windows-jdk10] [WS-CLEANUP] Deleting project workspace...[WS-CLEANUP] done
[Pipeline] [windows-jdk10] }
[Pipeline] [windows-jdk10] // stage
[Pipeline] [windows-jdk10] }
[Pipeline] [windows-jdk10] // node
[Pipeline] [windows-jdk10] }
[Pipeline] // parallel
[Pipeline] stage
[Pipeline] { (Notifications)
[Pipeline] echo
Build result: UNSTABLE
[Pipeline] jiraIssueSelector
[Pipeline] emailext
Mime
  • Unnamed multipart/mixed (inline, None, 0 bytes)
View raw message