maven-notifications mailing list archives

Site index · List index
Message view « Date » · « Thread »
Top « Date » · « Thread »
From Apache Jenkins Server <jenk...@builds.apache.org>
Subject Build failed in Jenkins: Maven TLP » maven-archetypes » master #12
Date Fri, 13 Jul 2018 13:16:43 GMT
See https://builds.apache.org/job/maven-box/job/maven-archetypes/job/master/12/

No changes.

No tests ran.

Build log:
[...truncated 238.77 KB...]
[windows-jdk7] [INFO] Downloading: https://repo.maven.apache.org/maven2/asm/asm-commons/3.2/asm-commons-3.2.jar
[windows-jdk7] [INFO] Downloaded: https://repo.maven.apache.org/maven2/org/apache/maven/wagon/wagon-provider-api/2.8/wagon-provider-api-2.8.jar
(53 kB at 1.5 MB/s)
[windows-jdk7] [INFO] Downloading: https://repo.maven.apache.org/maven2/asm/asm-util/3.2/asm-util-3.2.jar
[windows-jdk7] [INFO] Downloaded: https://repo.maven.apache.org/maven2/asm/asm/3.2/asm-3.2.jar
(43 kB at 1.1 MB/s)
[windows-jdk7] [INFO] Downloading: https://repo.maven.apache.org/maven2/asm/asm-analysis/3.2/asm-analysis-3.2.jar
[windows-jdk7] [INFO] Downloaded: https://repo.maven.apache.org/maven2/jdom/jdom/1.0/jdom-1.0.jar
(153 kB at 3.8 MB/s)
[windows-jdk7] [INFO] Downloading: https://repo.maven.apache.org/maven2/asm/asm-tree/3.2/asm-tree-3.2.jar
[windows-jdk7] [INFO] Downloaded: https://repo.maven.apache.org/maven2/asm/asm-commons/3.2/asm-commons-3.2.jar
(33 kB at 788 kB/s)
[windows-jdk7] [INFO] Downloading: https://repo.maven.apache.org/maven2/org/codehaus/plexus/plexus-interactivity-api/1.0-alpha-6/plexus-interactivity-api-1.0-alpha-6.jar
[windows-jdk7] [INFO] Downloaded: https://repo.maven.apache.org/maven2/asm/asm-util/3.2/asm-util-3.2.jar
(37 kB at 746 kB/s)
[windows-jdk7] [INFO] Downloading: https://repo.maven.apache.org/maven2/org/apache/maven/shared/maven-invoker/2.2/maven-invoker-2.2.jar
[windows-jdk7] [INFO] Downloaded: https://repo.maven.apache.org/maven2/org/codehaus/plexus/plexus-interactivity-api/1.0-alpha-6/plexus-interactivity-api-1.0-alpha-6.jar
(12 kB at 231 kB/s)
[windows-jdk7] [INFO] Downloading: https://repo.maven.apache.org/maven2/org/apache/maven/shared/maven-artifact-transfer/0.9.0/maven-artifact-transfer-0.9.0.jar
[windows-jdk7] [INFO] Downloaded: https://repo.maven.apache.org/maven2/asm/asm-analysis/3.2/asm-analysis-3.2.jar
(18 kB at 353 kB/s)
[windows-jdk7] [INFO] Downloading: https://repo.maven.apache.org/maven2/org/apache/maven/shared/maven-common-artifact-filters/3.0.0/maven-common-artifact-filters-3.0.0.jar
[windows-jdk7] [INFO] Downloaded: https://repo.maven.apache.org/maven2/asm/asm-tree/3.2/asm-tree-3.2.jar
(22 kB at 405 kB/s)
[windows-jdk7] [INFO] Downloading: https://repo.maven.apache.org/maven2/commons-codec/commons-codec/1.6/commons-codec-1.6.jar
[windows-jdk7] [INFO] Downloaded: https://repo.maven.apache.org/maven2/org/apache/maven/shared/maven-invoker/2.2/maven-invoker-2.2.jar
(30 kB at 458 kB/s)
[windows-jdk7] [INFO] Downloading: https://repo.maven.apache.org/maven2/org/slf4j/slf4j-api/1.7.5/slf4j-api-1.7.5.jar
[windows-jdk7] [INFO] Downloaded: https://repo.maven.apache.org/maven2/org/apache/maven/shared/maven-artifact-transfer/0.9.0/maven-artifact-transfer-0.9.0.jar
(123 kB at 1.8 MB/s)
[windows-jdk7] [INFO] Downloading: https://repo.maven.apache.org/maven2/org/apache/maven/shared/maven-script-interpreter/1.0/maven-script-interpreter-1.0.jar
[windows-jdk7] [INFO] Downloaded: https://repo.maven.apache.org/maven2/org/apache/maven/shared/maven-common-artifact-filters/3.0.0/maven-common-artifact-filters-3.0.0.jar
(57 kB at 841 kB/s)
[windows-jdk7] [INFO] Downloading: https://repo.maven.apache.org/maven2/org/apache/ant/ant/1.8.1/ant-1.8.1.jar
[windows-jdk7] [INFO] Downloaded: https://repo.maven.apache.org/maven2/org/apache/maven/shared/maven-script-interpreter/1.0/maven-script-interpreter-1.0.jar
(21 kB at 270 kB/s)
[windows-jdk7] [INFO] Downloaded: https://repo.maven.apache.org/maven2/org/slf4j/slf4j-api/1.7.5/slf4j-api-1.7.5.jar
(26 kB at 334 kB/s)
[windows-jdk7] [INFO] Downloaded: https://repo.maven.apache.org/maven2/commons-codec/commons-codec/1.6/commons-codec-1.6.jar
(233 kB at 2.9 MB/s)
[windows-jdk7] [INFO] Downloaded: https://repo.maven.apache.org/maven2/org/apache/ant/ant/1.8.1/ant-1.8.1.jar
(1.5 MB at 11 MB/s)
[windows-jdk7] [INFO] Downloaded: https://repo.maven.apache.org/maven2/org/codehaus/groovy/groovy/1.8.3/groovy-1.8.3.jar
(5.5 MB at 28 MB/s)
[windows-jdk7] [INFO] Building archetype jar: F:\jenkins\jenkins-slave\workspace\box_maven-archetypes_master-CWQIX33IMRENQAEK6YQUG4YRNL2FP25GOPO4YFHLPIHFEWUYVBDQ\m\maven-archetype-archetype\target\maven-archetype-archetype-1.4-SNAPSHOT
[windows-jdk7] [INFO] 
[windows-jdk7] [INFO] --- maven-site-plugin:3.7:attach-descriptor (attach-descriptor) @ maven-archetype-archetype
---
[windows-jdk7] [INFO] Skipping because packaging 'maven-archetype' is not pom.
[windows-jdk7] [INFO] 
[windows-jdk7] [INFO] --- maven-archetype-plugin:3.0.1:integration-test (default-integration-test)
@ maven-archetype-archetype ---
[windows-jdk7] [INFO] Processing Archetype IT project: it-basic
[windows-jdk7] [INFO] ----------------------------------------------------------------------------
[windows-jdk7] [INFO] Using following parameters for creating project from Archetype: maven-archetype-archetype:1.4-SNAPSHOT
[windows-jdk7] [INFO] ----------------------------------------------------------------------------
[windows-jdk7] [INFO] Parameter: groupId, Value: archetype.it
[windows-jdk7] [INFO] Parameter: artifactId, Value: basic-archetype
[windows-jdk7] [INFO] Parameter: version, Value: 0.1-SNAPSHOT
[windows-jdk7] [INFO] Parameter: package, Value: null
[windows-jdk7] [INFO] Parameter: packageInPathFormat, Value: null
[windows-jdk7] [INFO] Parameter: version, Value: 0.1-SNAPSHOT
[windows-jdk7] [INFO] Parameter: groupId, Value: archetype.it
[windows-jdk7] [INFO] Parameter: artifactId, Value: basic-archetype
[windows-jdk7] [INFO] Project created from Archetype in dir: F:\jenkins\jenkins-slave\workspace\box_maven-archetypes_master-CWQIX33IMRENQAEK6YQUG4YRNL2FP25GOPO4YFHLPIHFEWUYVBDQ\m\maven-archetype-archetype\target\test-classes\projects\it-basic\project\basic-archetype
[windows-jdk7] [INFO] Invoking post-archetype-generation goals: verify
[windows-jdk7] [INFO] [INFO] [jenkins-event-spy] Generate F:\jenkins\jenkins-slave\workspace\box_maven-archetypes_master-CWQIX33IMRENQAEK6YQUG4YRNL2FP25GOPO4YFHLPIHFEWUYVBDQ@tmp\withMaven75d44dee\maven-spy-20180713-131633-381301956519524253538.log.tmp
...
[windows-jdk7] [INFO] [INFO] Error stacktraces are turned on.
[windows-jdk7] [INFO] [INFO] Scanning for projects...
[windows-jdk7] [INFO] [INFO] 
[windows-jdk7] [INFO] [INFO] ------------------------------------------------------------------------
[windows-jdk7] [INFO] [INFO] Building Archetype - basic-archetype 0.1-SNAPSHOT
[windows-jdk7] [INFO] [INFO] ------------------------------------------------------------------------
[windows-jdk7] [INFO] [INFO] 
[windows-jdk7] [INFO] [INFO] --- maven-resources-plugin:3.0.2:resources (default-resources)
@ basic-archetype ---
[windows-jdk7] [INFO] [INFO] Using 'UTF-8' encoding to copy filtered resources.
[windows-jdk7] [INFO] [INFO] Copying 4 resources
[windows-jdk7] [INFO] [INFO] 
[windows-jdk7] [INFO] [INFO] --- maven-resources-plugin:3.0.2:testResources (default-testResources)
@ basic-archetype ---
[windows-jdk7] [INFO] [INFO] Using 'UTF-8' encoding to copy filtered resources.
[windows-jdk7] [INFO] [INFO] Copying 2 resources
[windows-jdk7] [INFO] [INFO] 
[windows-jdk7] [INFO] [INFO] --- maven-archetype-plugin:3.0.1:jar (default-jar) @ basic-archetype
---
[windows-jdk7] [INFO] [INFO] Building archetype jar: F:\jenkins\jenkins-slave\workspace\box_maven-archetypes_master-CWQIX33IMRENQAEK6YQUG4YRNL2FP25GOPO4YFHLPIHFEWUYVBDQ\m\maven-archetype-archetype\target\test-classes\projects\it-basic\project\basic-archetype\target\basic-archetype-0.1-SNAPSHOT
[windows-jdk7] [INFO] [INFO] 
[windows-jdk7] [INFO] [INFO] --- maven-archetype-plugin:3.0.1:integration-test (default-integration-test)
@ basic-archetype ---
[windows-jdk7] [INFO] [INFO] Processing Archetype IT project: it-basic
[windows-jdk7] [INFO] [INFO] ----------------------------------------------------------------------------
[windows-jdk7] [INFO] [INFO] Using following parameters for creating project from Archetype:
basic-archetype:0.1-SNAPSHOT
[windows-jdk7] [INFO] [INFO] ----------------------------------------------------------------------------
[windows-jdk7] [INFO] [INFO] Parameter: groupId, Value: archetype.it
[windows-jdk7] [INFO] [INFO] Parameter: artifactId, Value: basic-project
[windows-jdk7] [INFO] [INFO] Parameter: version, Value: 0.1-SNAPSHOT
[windows-jdk7] [INFO] [INFO] Parameter: package, Value: it.pkg
[windows-jdk7] [INFO] [INFO] Parameter: packageInPathFormat, Value: it/pkg
[windows-jdk7] [INFO] [INFO] Parameter: package, Value: it.pkg
[windows-jdk7] [INFO] [INFO] Parameter: version, Value: 0.1-SNAPSHOT
[windows-jdk7] [INFO] [INFO] Parameter: groupId, Value: archetype.it
[windows-jdk7] [INFO] [INFO] Parameter: artifactId, Value: basic-project
[windows-jdk7] [INFO] [INFO] Project created from Archetype in dir: F:\jenkins\jenkins-slave\workspace\box_maven-archetypes_master-CWQIX33IMRENQAEK6YQUG4YRNL2FP25GOPO4YFHLPIHFEWUYVBDQ\m\maven-archetype-archetype\target\test-classes\projects\it-basic\project\basic-archetype\target\test-classes\projects\it-basic\project\basic-project
[windows-jdk7] [INFO] [INFO] Invoking post-archetype-generation goals: verify
[windows-jdk7] [INFO] [INFO] Post-archetype-generation invoker exit code: -2147483648
[windows-jdk7] [INFO] [INFO] ------------------------------------------------------------------------
[windows-jdk7] [INFO] [INFO] BUILD FAILURE
[windows-jdk7] [INFO] [INFO] ------------------------------------------------------------------------
[windows-jdk7] [INFO] [INFO] Total time: 2.269 s
[windows-jdk7] [INFO] [INFO] Finished at: 2018-07-13T13:16:36Z
[windows-jdk7] [INFO] [INFO] Final Memory: 14M/232M
[windows-jdk7] [INFO] [INFO] ------------------------------------------------------------------------
[windows-jdk7] [INFO] [INFO] [jenkins-event-spy] Generated F:\jenkins\jenkins-slave\workspace\box_maven-archetypes_master-CWQIX33IMRENQAEK6YQUG4YRNL2FP25GOPO4YFHLPIHFEWUYVBDQ@tmp\withMaven75d44dee\maven-spy-20180713-131633-381301956519524253538.log
[windows-jdk7] [INFO] [ERROR] Failed to execute goal org.apache.maven.plugins:maven-archetype-plugin:3.0.1:integration-test
(default-integration-test) on project basic-archetype: 
[windows-jdk7] [INFO] [ERROR] Archetype IT 'it-basic' failed: Execution failure: exit code
= -2147483648
[windows-jdk7] [INFO] [ERROR] -> [Help 1]
[windows-jdk7] [INFO] org.apache.maven.lifecycle.LifecycleExecutionException: Failed to execute
goal org.apache.maven.plugins:maven-archetype-plugin:3.0.1:integration-test (default-integration-test)
on project basic-archetype: 
[windows-jdk7] [INFO] Archetype IT 'it-basic' failed: Execution failure: exit code = -2147483648
[windows-jdk7] [INFO] 	at org.apache.maven.lifecycle.internal.MojoExecutor.execute(MojoExecutor.java:213)
[windows-jdk7] [INFO] 	at org.apache.maven.lifecycle.internal.MojoExecutor.execute(MojoExecutor.java:154)
[windows-jdk7] [INFO] 	at org.apache.maven.lifecycle.internal.MojoExecutor.execute(MojoExecutor.java:146)
[windows-jdk7] [INFO] 	at org.apache.maven.lifecycle.internal.LifecycleModuleBuilder.buildProject(LifecycleModuleBuilder.java:117)
[windows-jdk7] [INFO] 	at org.apache.maven.lifecycle.internal.LifecycleModuleBuilder.buildProject(LifecycleModuleBuilder.java:81)
[windows-jdk7] [INFO] 	at org.apache.maven.lifecycle.internal.builder.singlethreaded.SingleThreadedBuilder.build(SingleThreadedBuilder.java:51)
[windows-jdk7] [INFO] 	at org.apache.maven.lifecycle.internal.LifecycleStarter.execute(LifecycleStarter.java:128)
[windows-jdk7] [INFO] 	at org.apache.maven.DefaultMaven.doExecute(DefaultMaven.java:309)
[windows-jdk7] [INFO] 	at org.apache.maven.DefaultMaven.doExecute(DefaultMaven.java:194)
[windows-jdk7] [INFO] 	at org.apache.maven.DefaultMaven.execute(DefaultMaven.java:107)
[windows-jdk7] [INFO] 	at org.apache.maven.cli.MavenCli.execute(MavenCli.java:993)
[windows-jdk7] [INFO] 	at org.apache.maven.cli.MavenCli.doMain(MavenCli.java:345)
[windows-jdk7] [INFO] 	at org.apache.maven.cli.MavenCli.main(MavenCli.java:191)
[windows-jdk7] [INFO] 	at sun.reflect.NativeMethodAccessorImpl.invoke0(Native Method)
[windows-jdk7] [INFO] 	at sun.reflect.NativeMethodAccessorImpl.invoke(NativeMethodAccessorImpl.java:57)
[windows-jdk7] [INFO] 	at sun.reflect.DelegatingMethodAccessorImpl.invoke(DelegatingMethodAccessorImpl.java:43)
[windows-jdk7] [INFO] 	at java.lang.reflect.Method.invoke(Method.java:606)
[windows-jdk7] [INFO] 	at org.codehaus.plexus.classworlds.launcher.Launcher.launchEnhanced(Launcher.java:289)
[windows-jdk7] [INFO] 	at org.codehaus.plexus.classworlds.launcher.Launcher.launch(Launcher.java:229)
[windows-jdk7] [INFO] 	at org.codehaus.plexus.classworlds.launcher.Launcher.mainWithExitCode(Launcher.java:415)
[windows-jdk7] [INFO] 	at org.codehaus.plexus.classworlds.launcher.Launcher.main(Launcher.java:356)
[windows-jdk7] [INFO] Caused by: org.apache.maven.plugin.MojoExecutionException: 
[windows-jdk7] [INFO] Archetype IT 'it-basic' failed: Execution failure: exit code = -2147483648
[windows-jdk7] [INFO] 	at org.apache.maven.archetype.mojos.IntegrationTestMojo.execute(IntegrationTestMojo.java:325)
[windows-jdk7] [INFO] 	at org.apache.maven.plugin.DefaultBuildPluginManager.executeMojo(DefaultBuildPluginManager.java:134)
[windows-jdk7] [INFO] 	at org.apache.maven.lifecycle.internal.MojoExecutor.execute(MojoExecutor.java:208)
[windows-jdk7] [INFO] 	... 20 more
[windows-jdk7] [INFO] [ERROR] 
[windows-jdk7] [INFO] [ERROR] Re-run Maven using the -X switch to enable full debug logging.
[windows-jdk7] [INFO] [ERROR] 
[windows-jdk7] [INFO] [ERROR] For more information about the errors and possible solutions,
please read the following articles:
[windows-jdk7] [INFO] [ERROR] [Help 1] http://cwiki.apache.org/confluence/display/MAVEN/MojoExecutionException
[windows-jdk7] [INFO] Picked up JAVA_TOOL_OPTIONS: -Dmaven.ext.class.path="f:\jenkins\jenkins-slave\workspace\box_maven-archetypes_master-CWQIX33IMRENQAEK6YQUG4YRNL2FP25GOPO4YFHLPIHFEWUYVBDQ@tmp\withMaven75d44dee\pipeline-maven-spy.jar"
-Dorg.jenkinsci.plugins.pipeline.maven.reportsFolder="f:\jenkins\jenkins-slave\workspace\box_maven-archetypes_master-CWQIX33IMRENQAEK6YQUG4YRNL2FP25GOPO4YFHLPIHFEWUYVBDQ@tmp\withMaven75d44dee"

[windows-jdk7] [INFO] Post-archetype-generation invoker exit code: 1
[windows-jdk7] [INFO] ------------------------------------------------------------------------
[windows-jdk7] [INFO] Reactor Summary:
[windows-jdk7] [INFO] 
[windows-jdk7] [INFO] Apache Maven Archetypes ............................ SUCCESS [ 13.747
s]
[windows-jdk7] [INFO] Maven Archetype Archetype .......................... FAILURE [  8.827
s]
[windows-jdk7] [INFO] Maven Simple J2EE Archetype ........................ SKIPPED
[windows-jdk7] [INFO] Maven Plugin Archetype ............................. SKIPPED
[windows-jdk7] [INFO] Maven Plugin Site Archetype ........................ SKIPPED
[windows-jdk7] [INFO] Maven Portlet Archetype ............................ SKIPPED
[windows-jdk7] [INFO] Maven Quickstart Archetype ......................... SKIPPED
[windows-jdk7] [INFO] Maven Simple Project Archetype ..................... SKIPPED
[windows-jdk7] [INFO] Maven Site Archetype ............................... SKIPPED
[windows-jdk7] [INFO] Maven Archetype for Simple Site .................... SKIPPED
[windows-jdk7] [INFO] Maven Site Skin Archetype .......................... SKIPPED
[windows-jdk7] [INFO] Maven Webapp Archetype ............................. SKIPPED
[windows-jdk7] [INFO] ------------------------------------------------------------------------
[windows-jdk7] [INFO] BUILD FAILURE
[windows-jdk7] [INFO] ------------------------------------------------------------------------
[windows-jdk7] [INFO] Total time: 24.572 s
[windows-jdk7] [INFO] Finished at: 2018-07-13T13:16:36Z
[windows-jdk7] [INFO] Final Memory: 32M/273M
[windows-jdk7] [INFO] ------------------------------------------------------------------------
[windows-jdk7] [WARNING] The requested profile "run-its" could not be activated because it
does not exist.
[windows-jdk7] [INFO] [jenkins-event-spy] Generated F:\jenkins\jenkins-slave\workspace\box_maven-archetypes_master-CWQIX33IMRENQAEK6YQUG4YRNL2FP25GOPO4YFHLPIHFEWUYVBDQ@tmp\withMaven75d44dee\maven-spy-20180713-131611-2578387900827488425662.log
[windows-jdk7] [ERROR] Failed to execute goal org.apache.maven.plugins:maven-archetype-plugin:3.0.1:integration-test
(default-integration-test) on project maven-archetype-archetype: 
[windows-jdk7] [ERROR] Archetype IT 'it-basic' failed: Execution failure: exit code = 1
[windows-jdk7] [ERROR] -> [Help 1]
[windows-jdk7] [ERROR] 
[windows-jdk7] [ERROR] To see the full stack trace of the errors, re-run Maven with the -e
switch.
[windows-jdk7] [ERROR] Re-run Maven using the -X switch to enable full debug logging.
[windows-jdk7] [ERROR] 
[windows-jdk7] [ERROR] For more information about the errors and possible solutions, please
read the following articles:
[windows-jdk7] [ERROR] [Help 1] http://cwiki.apache.org/confluence/display/MAVEN/MojoExecutionException
[windows-jdk7] [ERROR] 
[windows-jdk7] [ERROR] After correcting the problems, you can resume the build with the command
[windows-jdk7] [ERROR]   mvn <goals> -rf :maven-archetype-archetype
[windows-jdk7] Picked up JAVA_TOOL_OPTIONS: -Dmaven.ext.class.path="f:\jenkins\jenkins-slave\workspace\box_maven-archetypes_master-CWQIX33IMRENQAEK6YQUG4YRNL2FP25GOPO4YFHLPIHFEWUYVBDQ@tmp\withMaven75d44dee\pipeline-maven-spy.jar"
-Dorg.jenkinsci.plugins.pipeline.maven.reportsFolder="f:\jenkins\jenkins-slave\workspace\box_maven-archetypes_master-CWQIX33IMRENQAEK6YQUG4YRNL2FP25GOPO4YFHLPIHFEWUYVBDQ@tmp\withMaven75d44dee"

[Pipeline] [windows-jdk7] }
[Pipeline] [windows-jdk7] // dir
[Pipeline] [windows-jdk7] }
[Pipeline] [windows-jdk7] // withMaven
[Pipeline] [windows-jdk7] echo
[windows-jdk7] [FAIL FAST] This is the first failure and likely root cause
[Pipeline] [windows-jdk7] }
[Pipeline] [windows-jdk7] // stage
[Pipeline] [windows-jdk7] }
[Pipeline] [windows-jdk7] // node
[Pipeline] [windows-jdk7] }
[windows-jdk8] Running on windows-2012-2 in f:\jenkins\jenkins-slave\workspace\box_maven-archetypes_master-CWQIX33IMRENQAEK6YQUG4YRNL2FP25GOPO4YFHLPIHFEWUYVBDQ
[windows-jdk7] Failed in branch windows-jdk7
[Pipeline] [linux-jdk7] // node
[Pipeline] [linux-jdk8] // node
[Pipeline] [windows-jdk8] {
[Pipeline] [linux-jdk9] // node
[Pipeline] [linux-jdk10] // node
[Pipeline] [windows-jdk9] // node
[Pipeline] [windows-jdk10] // node
[Pipeline] [linux-jdk7] }
[linux-jdk7] Failed in branch linux-jdk7
[Pipeline] [linux-jdk8] }
[linux-jdk8] Failed in branch linux-jdk8
[Pipeline] [linux-jdk9] }
[linux-jdk9] Failed in branch linux-jdk9
[Pipeline] [linux-jdk10] }
[linux-jdk10] Failed in branch linux-jdk10
[Pipeline] [windows-jdk9] }
[windows-jdk9] Failed in branch windows-jdk9
[Pipeline] [windows-jdk10] }
[windows-jdk10] Failed in branch windows-jdk10
[Pipeline] [windows-jdk8] stage
[Pipeline] [windows-jdk8] { (Checkout windows-jdk8)
[Pipeline] [windows-jdk8] dir
[windows-jdk8] Running in f:\jenkins\jenkins-slave\workspace\box_maven-archetypes_master-CWQIX33IMRENQAEK6YQUG4YRNL2FP25GOPO4YFHLPIHFEWUYVBDQ\m
[Pipeline] [windows-jdk8] {
[Pipeline] [windows-jdk8] checkout
[windows-jdk8]  > git rev-parse --is-inside-work-tree # timeout=10
[windows-jdk8] Fetching changes from the remote Git repository
[windows-jdk8]  > git config remote.origin.url https://gitbox.apache.org/repos/asf/maven-archetypes.git
# timeout=10
[windows-jdk8] Fetching without tags
[windows-jdk8] Fetching upstream changes from https://gitbox.apache.org/repos/asf/maven-archetypes.git
[windows-jdk8]  > git --version # timeout=10
[windows-jdk8]  > git fetch --no-tags --progress https://gitbox.apache.org/repos/asf/maven-archetypes.git
+refs/heads/*:refs/remotes/origin/*
[windows-jdk8] Checking out Revision 4f6492c5981cd0bace21563fb674f443bbba8a24 (master)
[windows-jdk8]  > git config core.sparsecheckout # timeout=10
[windows-jdk8]  > git checkout -f 4f6492c5981cd0bace21563fb674f443bbba8a24
[windows-jdk8] Commit message: "[INFRA-16467] move components documentation out of CMS space"
[windows-jdk8] Cleaning workspace
[windows-jdk8]  > git rev-parse --verify HEAD # timeout=10
[windows-jdk8] Resetting working tree
[windows-jdk8]  > git reset --hard # timeout=10
[windows-jdk8]  > git clean -fdx # timeout=10
[Pipeline] [windows-jdk8] }
[Pipeline] [windows-jdk8] // dir
[Pipeline] [windows-jdk8] }
[Pipeline] [windows-jdk8] // stage
[Pipeline] [windows-jdk8] stage
[Pipeline] [windows-jdk8] { (Build windows-jdk8)
[Pipeline] [windows-jdk8] echo
[windows-jdk8] [FAIL FAST] windows-jdk7 has failed. Skipping windows-jdk8.
[Pipeline] [windows-jdk8] }
[Pipeline] [windows-jdk8] // stage
[Pipeline] [windows-jdk8] }
[Pipeline] [windows-jdk8] // node
[Pipeline] [windows-jdk8] }
[windows-jdk8] Failed in branch windows-jdk8
[Pipeline] // parallel
[Pipeline] echo
***** FAST FAILURE *****

Fast failure triggered by windows-jdk7

***** FAST FAILURE *****
[Pipeline] stage
[Pipeline] { (Notifications)
[Pipeline] echo
Build result: FAILURE
[Pipeline] jiraIssueSelector
[Pipeline] emailext
Mime
  • Unnamed multipart/mixed (inline, None, 0 bytes)
View raw message